com\tadstran\model\Fuel.class
com\tadstran\model\Address.class
com\tadstran\model\Transfer.class
com\tadstran\dao\UserDAO.class
com\tadstran\dao\LoginDAO.class
com\tadstran\model\User.class
com\tadstran\facade\LoginFacade.class
com\tadstran\model\Vehicle.class
com\tadstran\beans\LoginBean.class
com\tadstran\resources\JakartaEE8Resource.class
com\tadstran\util\HibernateUtil.class
