com\multtads\model\DescriptionType.class
com\multtads\model\Address.class
com\multtads\model\InfractionType.class
com\multtads\model\TrafficTicket.class
com\mutltads\dao\UserDAO.class
com\multtads\model\ScoreInfration.class
com\multtads\resources\JakartaEE8Resource.class
com\multtads\model\User.class
com\multtads\model\Infration.class
com\mutltads\dao\LoginDAO.class
com\multtads\model\Payment.class
com\multtads\beans\LoginBean.class
com\multtads\JakartaRestConfiguration.class
com\multtads\util\HibernateUtil.class
com\mutltads\dao\AddressDAO.class
