/home/daniel/ufpr/guide-docker/finish/src/main/java/util/HibernateUtil.java
/home/daniel/ufpr/guide-docker/finish/src/main/java/model/Client.java
/home/daniel/ufpr/guide-docker/finish/src/main/java/io/openliberty/guides/rest/SystemApplication.java
/home/daniel/ufpr/guide-docker/finish/src/main/java/io/openliberty/guides/rest/PropertiesResource.java
