module gitlab.com/daniel.louda/gbt

go 1.16

require (
	github.com/smartystreets/goconvey v1.6.4 // indirect
	gopkg.in/go-ini/ini.v1 v1.62.0
	gopkg.in/ini.v1 v1.62.0 // indirect
	k8s.io/client-go v0.20.5
)
