<?xml version="1.0" encoding="UTF-8" ?>
<testsuite 
errors="0" failures="0" hostname="lt23" name="diva.tests.TestRSLR" tests="5" time="0.012" timestamp="2020-08-06T14:19:47">
  <properties>
    <property name="java.runtime.name" value="Java(TM) SE Runtime Environment">
    </property>
    <property 
    name="sun.boot.library.path" value="/usr/lib/jvm/java-8-oracle/jre/lib/amd64">
</property>
    <property name="java.vm.version" value="25.181-b13"> </property>
    <property name="java.vm.vendor" value="Oracle Corporation"> </property>
    <property name="java.vendor.url" value="http://java.oracle.com/">
    </property>
    <property name="path.separator" value=":"> </property>
    <property name="java.vm.name" value="Java HotSpot(TM) 64-Bit Server VM">
    </property>
    <property name="file.encoding.pkg" value="sun.io"> </property>
    <property name="user.country" value="US"> </property>
    <property name="sun.java.launcher" value="SUN_STANDARD"> </property>
    <property name="sun.os.patch.level" value="unknown"> </property>
    <property 
    name="java.vm.specification.name" value="Java Virtual Machine Specification">
</property>
    <property 
    name="user.dir" value="/home/lincke/Repositories/diva/model/2.4.0">
</property>
    <property name="java.runtime.version" value="1.8.0_181-b13"> </property>
    <property 
    name="java.awt.graphicsenv" value="sun.awt.X11GraphicsEnvironment">
</property>
    <property 
    name="basedir" value="/home/lincke/Repositories/diva/model/2.4.0">
</property>
    <property 
    name="java.endorsed.dirs" value="/usr/lib/jvm/java-8-oracle/jre/lib/endorsed">
</property>
    <property name="os.arch" value="amd64"> </property>
    <property name="java.io.tmpdir" value="/tmp"> </property>
    <property name="line.separator" value=" "> </property>
    <property name="java.vm.specification.vendor" value="Oracle Corporation">
    </property>
    <property name="os.name" value="Linux"> </property>
    <property name="sun.jnu.encoding" value="UTF-8"> </property>
    <property 
    name="java.library.path" value="/usr/java/packages/lib/amd64:/usr/lib64:/lib64:/lib:/usr/lib">
</property>
    <property 
    name="java.specification.name" value="Java Platform API Specification">
</property>
    <property name="java.class.version" value="52.0"> </property>
    <property 
    name="sun.management.compiler" value="HotSpot 64-Bit Tiered Compilers">
</property>
    <property name="os.version" value="4.15.0-112-generic"> </property>
    <property name="user.home" value="/home/lincke"> </property>
    <property name="user.timezone" value=""> </property>
    <property name="java.awt.printerjob" value="sun.print.PSPrinterJob">
    </property>
    <property name="file.encoding" value="UTF-8"> </property>
    <property name="java.specification.version" value="1.8"> </property>
    <property name="user.name" value="lincke"> </property>
    <property 
    name="java.class.path" value="/home/lincke/Repositories/diva/model/2.4.0/target/test-classes:/home/lincke/Repositories/diva/model/2.4.0/target/classes:/home/lincke/.m2/repository/org/scala-lang/scala-library/2.12.6/scala-library-2.12.6.jar:/home/lincke/.m2/repository/org/scala-lang/scala-reflect/2.12.6/scala-reflect-2.12.6.jar:/home/lincke/.m2/repository/com/opencsv/opencsv/3.3/opencsv-3.3.jar:/home/lincke/.m2/repository/org/apache/commons/commons-lang3/3.3.2/commons-lang3-3.3.2.jar:/home/lincke/.m2/repository/org/json/json/20180130/json-20180130.jar:/home/lincke/.m2/repository/org/apache/commons/commons-math3/3.6.1/commons-math3-3.6.1.jar:/home/lincke/.m2/repository/edu/ucar/netcdf/4.3.23/netcdf-4.3.23.jar:/home/lincke/.m2/repository/edu/ucar/udunits/4.3.23/udunits-4.3.23.jar:/home/lincke/.m2/repository/commons-httpclient/commons-httpclient/3.1/commons-httpclient-3.1.jar:/home/lincke/.m2/repository/commons-codec/commons-codec/1.2/commons-codec-1.2.jar:/home/lincke/.m2/repository/org/slf4j/jcl-over-slf4j/1.7.5/jcl-over-slf4j-1.7.5.jar:/home/lincke/.m2/repository/joda-time/joda-time/2.2/joda-time-2.2.jar:/home/lincke/.m2/repository/org/slf4j/slf4j-api/1.7.5/slf4j-api-1.7.5.jar:/home/lincke/.m2/repository/org/jdom/jdom2/2.0.4/jdom2-2.0.4.jar:/home/lincke/.m2/repository/net/jcip/jcip-annotations/1.0/jcip-annotations-1.0.jar:/home/lincke/.m2/repository/com/sun/jna/jna/3.0.9/jna-3.0.9.jar:/home/lincke/.m2/repository/org/quartz-scheduler/quartz/2.1.1/quartz-2.1.1.jar:/home/lincke/.m2/repository/c3p0/c3p0/0.9.1.1/c3p0-0.9.1.1.jar:/home/lincke/.m2/repository/com/google/protobuf/protobuf-java/2.5.0/protobuf-java-2.5.0.jar:/home/lincke/.m2/repository/net/sf/ehcache/ehcache-core/2.6.2/ehcache-core-2.6.2.jar:/home/lincke/.m2/repository/com/sleepycat/je/4.0.92/je-4.0.92.jar:/home/lincke/.m2/repository/org/scalatest/scalatest_2.12/3.2.0-SNAP4/scalatest_2.12-3.2.0-SNAP4.jar:/home/lincke/.m2/repository/org/scala-lang/modules/scala-xml_2.12/1.0.5/scala-xml_2.12-1.0.5.jar:/home/lincke/.m2/repository/org/scala-lang/modules/scala-parser-combinators_2.12/1.0.4/scala-parser-combinators_2.12-1.0.4.jar:/home/lincke/.m2/repository/org/scalactic/scalactic_2.12/3.2.0-SNAP4/scalactic_2.12-3.2.0-SNAP4.jar:/home/lincke/.m2/repository/org/geotools/gt-shapefile/17.0/gt-shapefile-17.0.jar:/home/lincke/.m2/repository/org/geotools/gt-data/17.0/gt-data-17.0.jar:/home/lincke/.m2/repository/org/geotools/gt-main/17.0/gt-main-17.0.jar:/home/lincke/.m2/repository/org/geotools/gt-api/17.0/gt-api-17.0.jar:/home/lincke/.m2/repository/org/geotools/gt-referencing/17.0/gt-referencing-17.0.jar:/home/lincke/.m2/repository/com/googlecode/efficient-java-matrix-library/core/0.26/core-0.26.jar:/home/lincke/.m2/repository/commons-pool/commons-pool/1.5.4/commons-pool-1.5.4.jar:/home/lincke/.m2/repository/org/geotools/gt-metadata/17.0/gt-metadata-17.0.jar:/home/lincke/.m2/repository/org/geotools/gt-opengis/17.0/gt-opengis-17.0.jar:/home/lincke/.m2/repository/net/java/dev/jsr-275/jsr-275/1.0-beta-2/jsr-275-1.0-beta-2.jar:/home/lincke/.m2/repository/jgridshift/jgridshift/1.0/jgridshift-1.0.jar:/home/lincke/.m2/repository/net/sf/geographiclib/GeographicLib-Java/1.44/GeographicLib-Java-1.44.jar:/home/lincke/.m2/repository/com/vividsolutions/jts/1.13/jts-1.13.jar:/home/lincke/.m2/repository/org/jdom/jdom/1.1.3/jdom-1.1.3.jar:/home/lincke/.m2/repository/javax/media/jai_core/1.1.3/jai_core-1.1.3.jar">
</property>
    <property name="java.vm.specification.version" value="1.8"> </property>
    <property name="sun.arch.data.model" value="64"> </property>
    <property name="java.home" value="/usr/lib/jvm/java-8-oracle/jre">
    </property>
    <property 
    name="sun.java.command" value="org.scalatest.tools.Runner -R /home/lincke/Repositories/diva/model/2.4.0/target/classes /home/lincke/Repositories/diva/model/2.4.0/target/test-classes -o -fWDF /home/lincke/Repositories/diva/model/2.4.0/target/surefire-reports/TestSuite.txt -u /home/lincke/Repositories/diva/model/2.4.0/target/surefire-reports/.">
</property>
    <property name="java.specification.vendor" value="Oracle Corporation">
    </property>
    <property name="user.language" value="en"> </property>
    <property name="awt.toolkit" value="sun.awt.X11.XToolkit"> </property>
    <property name="java.vm.info" value="mixed mode"> </property>
    <property name="java.version" value="1.8.0_181"> </property>
    <property 
    name="java.ext.dirs" value="/usr/lib/jvm/java-8-oracle/jre/lib/ext:/usr/java/packages/lib/ext">
</property>
    <property 
    name="sun.boot.class.path" value="/usr/lib/jvm/java-8-oracle/jre/lib/resources.jar:/usr/lib/jvm/java-8-oracle/jre/lib/rt.jar:/usr/lib/jvm/java-8-oracle/jre/lib/sunrsasign.jar:/usr/lib/jvm/java-8-oracle/jre/lib/jsse.jar:/usr/lib/jvm/java-8-oracle/jre/lib/jce.jar:/usr/lib/jvm/java-8-oracle/jre/lib/charsets.jar:/usr/lib/jvm/java-8-oracle/jre/lib/jfr.jar:/usr/lib/jvm/java-8-oracle/jre/classes">
</property>
    <property name="java.vendor" value="Oracle Corporation"> </property>
    <property name="file.separator" value="/"> </property>
    <property 
    name="java.vendor.url.bug" value="http://bugreport.sun.com/bugreport/">
</property>
    <property name="sun.cpu.endian" value="little"> </property>
    <property name="sun.io.unicode.encoding" value="UnicodeLittle"> </property>
    <property name="sun.desktop" value="gnome"> </property>
    <property name="sun.cpu.isalist" value=""> </property>
  </properties>
  <testcase 
  name="EDFloodHazard.cdf should generate 0 for h1; 0.1 for h10 and 0.999 for h1000" classname="diva.tests.TestRSLR" time="0.0">
</testcase>
  <testcase 
  name="EDFloodHazard.cdf should imply exceedance probability 1 for hx when hx is &lt; h1" classname="diva.tests.TestRSLR" time="0.0">
</testcase>
  <testcase 
  name="EDFloodHazard.cdf should be monotonous" classname="diva.tests.TestRSLR" time="0.001">
</testcase>
  <testcase 
  name="EDFloodHazard.cdf should shifted by the shift" classname="diva.tests.TestRSLR" time="0.002">
</testcase>
  <testcase 
  name="EDFloodHazard.returnPeriodHeight should be the inverse of EDFloodHazard.returnPeriod" classname="diva.tests.TestRSLR" time="0.001">
</testcase>
  <system-out><![CDATA[]]></system-out>
  <system-err><![CDATA[]]></system-err>
</testsuite>
