// Jest Snapshot v1, https://goo.gl/fbAQLP

exports[`Should check UserDetails component exists 1`] = `
<div
  className="offset-md-2 col-md-8"
>
  <input
    className="form-control"
    name="name"
    placeholder="name"
    style={
      Object {
        "marginBottom": "10px",
      }
    }
  />
  <input
    className="form-control"
    name="email"
    placeholder="email"
    style={
      Object {
        "marginBottom": "10px",
      }
    }
  />
</div>
`;

exports[`Should check if header component exists 1`] = `
<div>
  <h1
    data-testid="header"
  >
    Feedback Form
  </h1>
</div>
`;

exports[`Should check message component exists 1`] = `
<div
  className="offset-md-2 col-md-8"
  style={
    Object {
      "padding": "10px",
    }
  }
>
  <textarea
    className="form-control"
    name="message"
    placeholder="Enter Your Feedback"
    rows="5"
  />
</div>
`;

exports[`Should check type component exists 1`] = `
<div>
  <div
    className="form-check form-check-inline"
  >
    <input
      className="form-check-input"
      id="comments"
      name="type"
      type="radio"
      value="Comments"
    />
    <label
      className="form-check-label"
      htmlFor="materialUnchecked"
    >
      Comments
    </label>
  </div>
  <div
    className="form-check form-check-inline"
  >
    <input
      className="form-check-input"
      id="bugreport"
      name="type"
      type="radio"
      value="Bug Report"
    />
    <label
      className="form-check-label"
      htmlFor="materialUnchecked"
    >
      Bug Report
    </label>
  </div>
  <div
    className="form-check form-check-inline"
  >
    <input
      className="form-check-input"
      id="questions"
      name="type"
      type="radio"
      value="Question"
    />
    <label
      className="form-check-label"
      htmlFor="materialUnchecked"
    >
      Question
    </label>
  </div>
</div>
`;
