Red,ESIME,,,,,,
Estación,CHETUMAL ob,,,,,,
Ubicación,QUINTANA ROO,,,,,,
Latitud (N),18.5005555555556,,,,,,
Longitud (O),-88.3275,,,,,,
Altitud,9,,,,,,
,,,,,,,
,,,,,,,
AAAA/MM/DD HH:MM HORAZ,Dirección de ráfaga (grados),Dirección del Viento (grados),Humedad relativa (%),Precipitación (mm),Radiación Solar (W/m²),Temperatura del Aire (°C),Presión Atmosférica
2020-10-08 01:00,202,169,93,,,24.4,1008.1
2020-10-08 00:50,194,155,93,0,-1,24.5,1007.9
2020-10-08 00:40,190,164,92,0,-1,24.6,1007.7
2020-10-08 00:30,203,171,91,0,-1,24.8,1007.5
2020-10-08 00:20,199,169,91,0,-1,24.9,1007.2
2020-10-08 00:10,231,184,90,0,-1,25.1,1007
2020-10-08 00:00,228,186,89,0,-1,25.4,1007
2020-10-07 23:50,241,196,88,0,-1,25.5,1007
2020-10-07 23:40,241,198,87,0,0,25.7,1007
2020-10-07 23:30,232,193,86,0,3,25.9,1007
2020-10-07 23:20,289,222,85,0,13,26.1,1006.9
2020-10-07 23:10,338,234,83,0,28,26.3,1006.8
2020-10-07 23:00,319,246,81,0,42,26.6,1006.8
2020-10-07 22:50,318,237,80,,,26.8,1006.7
2020-10-07 22:40,310,232,80,0,73,26.9,1006.6
2020-10-07 22:30,353,231,79,0,90,27,1006.5
2020-10-07 22:20,317,233,80,0,82,27,1006.6
2020-10-07 22:10,36,225,79,0,104,27.2,1006.6
2020-10-07 22:00,299,232,79,0,156,27.1,1006.5
2020-10-07 21:50,335,230,79,0,,27.1,1006.5
2020-10-07 21:40,304,225,78,0,123,27.1,1006.3
2020-10-07 21:30,309,220,78,0,154,27.3,1006.3
2020-10-07 21:20,305,220,76,0,283,27.7,1006.1
2020-10-07 21:10,283,220,76,0,394,27.6,1006.2
2020-10-07 21:00,342,224,76,0,299,27.5,1006.1
2020-10-07 20:50,274,219,77,0,239,27.3,1006.1
2020-10-07 20:40,280,218,78,0,356,27.3,1005.9
2020-10-07 20:30,259,210,79,0,200,26.9,1005.9
2020-10-07 20:20,304,218,79,0,159,27.1,1005.8
2020-10-07 20:10,280,219,78,0,166,27.4,1005.9
2020-10-07 20:00,351,214,78,0,269,27.2,1005.8
2020-10-07 19:50,304,216,78,0,137,26.9,1005.9
2020-10-07 19:40,312,225,77,0,247,27.4,1005.8
2020-10-07 19:30,328,221,77,0,341,27.4,1005.8
2020-10-07 19:20,311,218,77,0,308,27.6,1005.6
2020-10-07 19:10,297,218,77,0,418,27.5,1005.7
2020-10-07 19:00,313,227,78,0,312,27.1,1005.7
2020-10-07 18:50,306,220,76,,,27.2,1005.9
2020-10-07 18:40,311,222,75,0,575,27.7,1005.9
2020-10-07 18:30,308,218,77,0,408,27.4,1006.2
2020-10-07 18:20,295,217,78,0,332,27.1,1006.5
2020-10-07 18:10,286,218,78,0,315,27.1,1006.6
2020-10-07 18:00,291,213,78,0,383,27.1,1006.8
2020-10-07 17:50,318,219,77,0,295,27.2,1006.8
2020-10-07 17:40,299,229,76,0,368,27.3,1006.9
2020-10-07 17:30,294,225,78,0,401,26.9,1006.9
2020-10-07 17:20,323,224,79,0,259,26.5,1007.1
2020-10-07 17:10,298,220,79,0,196,26.5,1007.2
2020-10-07 17:00,314,224,78,0,260,26.8,1007.1
2020-10-07 16:50,288,220,79,0,337,26.7,1006.9
2020-10-07 16:40,313,225,79,0,311,26.4,1006.8
2020-10-07 16:30,325,234,80,0,231,26.2,1006.7
2020-10-07 16:20,337,228,79,0,213,26.1,1006.7
2020-10-07 16:10,317,231,78,0,236,26.4,1006.7
2020-10-07 16:00,319,230,80,0,282,26.5,1006.8
2020-10-07 15:50,350,230,80,0,278,26.1,1006.9
2020-10-07 15:40,342,245,80,0,255,26.1,1006.8
2020-10-07 15:30,316,240,80,,,25.8,
2020-10-07 15:20,8,240,80,0,228,25.8,1007.1
2020-10-07 15:10,318,246,82,0,277,25.6,1007
2020-10-07 15:00,342,251,82,0,278,25.4,1006.7
2020-10-07 14:50,326,247,82,0,338,25.4,1006.5
2020-10-07 14:40,21,249,83,0,366,25.1,1006.4
2020-10-07 14:30,32,259,85,0,311,24.8,1006.3
2020-10-07 14:20,332,260,86,0,296,24.5,1006.3
2020-10-07 14:10,336,254,87,0,268,24.2,1006.4
2020-10-07 14:00,357,251,88,0,229,23.9,1006.1
2020-10-07 13:50,332,244,89,0,197,23.6,1006.1
2020-10-07 13:40,319,242,90,0,169,23.5,1006
2020-10-07 13:30,318,234,91,0,145,23.2,1005.9
2020-10-07 13:20,359,233,92,0,122,23,1006
2020-10-07 13:10,289,217,93,0,101,22.8,1006.1
2020-10-07 13:00,305,212,94,0,82,22.7,1006.2
2020-10-07 12:50,283,211,94,0,47,22.5,1006.3
2020-10-07 12:40,272,208,95,0,42,22.3,1006.1
2020-10-07 12:30,273,211,96,0,32,22.2,1005.9
2020-10-07 12:20,260,210,96,0,21,22.1,1005.7
2020-10-07 12:10,266,209,96,0,11,22,1005.5
2020-10-07 12:00,255,210,96,0,5,22,1005.4
2020-10-07 11:50,257,208,96,0,0,22,1005.3
2020-10-07 11:40,340,215,96,0,-1,22.1,1005.2
2020-10-07 11:30,268,216,96,0,-1,22.1,1005.2
2020-10-07 11:20,319,228,96,0,-1,22.1,1005.1
2020-10-07 11:10,311,229,96,0,-1,22.1,1005.2
2020-10-07 11:00,302,233,96,0,-1,22.1,1005.2
2020-10-07 10:50,30,235,96,0,-1,22.1,1005.4
2020-10-07 10:40,308,231,96,0,-1,22.1,1005.5
2020-10-07 10:30,16,236,95,0,-1,22.1,1005.5
2020-10-07 10:20,293,230,95,0,-1,22.2,1005.4
2020-10-07 10:10,314,229,95,0,0,22.2,1005.3
2020-10-07 10:00,356,233,94,0,0,22.3,1005.3
2020-10-07 09:50,294,232,95,0,0,22.2,1005.3
2020-10-07 09:40,283,232,95,0,0,22.2,1005.3
2020-10-07 09:30,332,235,95,0,-1,22.2,1005.2
2020-10-07 09:20,327,232,95,0,-1,22.2,1005.2
2020-10-07 09:10,353,238,95,0,-1,22.1,1005
2020-10-07 09:00,21,231,95,0,-1,22.1,1004.9
2020-10-07 08:50,297,232,96,,,22.1,1004.7
2020-10-07 08:40,302,229,96,,,22.1,
2020-10-07 08:30,345,225,96,0,-1,22.1,1004.6
2020-10-07 08:20,285,222,96,0,0,22.1,1004.6
2020-10-07 08:10,310,227,96,0,0,22.2,1004.9
2020-10-07 08:00,293,222,96,0,0,22.1,1005.4
2020-10-07 07:50,322,227,96,0,-1,22.1,1005.5
2020-10-07 07:40,329,234,97,0,-1,22.1,1005.6
2020-10-07 07:30,313,238,97,0,-1,22,1005.6
2020-10-07 07:20,25,243,97,0,-1,22,1005.6
2020-10-07 07:10,320,251,97,0,-1,22,1005.8
2020-10-07 07:00,311,248,97,0,0,22,1006
2020-10-07 06:50,354,262,97,0,0,22,1006.2
2020-10-07 06:40,339,253,97,0,0,21.9,1006.2
2020-10-07 06:30,324,260,97,0,0,21.9,1006.3
2020-10-07 06:20,5,261,97,0,0,21.9,1006.4
2020-10-07 06:10,333,256,97,0,-1,21.8,1006.6
2020-10-07 06:00,314,243,97,0,0,21.8,1006.6
2020-10-07 05:50,313,250,97,0,0,21.8,1006.8
2020-10-07 05:40,351,250,97,0,-1,21.8,1006.9
2020-10-07 05:30,340,259,97,0,0,21.8,1006.9
2020-10-07 05:20,335,260,97,0,-1,21.7,1007.1
2020-10-07 05:10,332,254,97,0.2,0,21.6,1007.2
2020-10-07 05:00,3,250,97,0,0,21.5,1007.1
2020-10-07 04:50,330,249,96,0,0,21.4,1007.3
2020-10-07 04:40,17,251,96,0,0,21.4,1007.4
2020-10-07 04:30,313,235,96,0,0,21.4,1007.3
2020-10-07 04:20,273,223,96,0,0,21.5,1007.3
2020-10-07 04:10,267,217,96,0,0,21.6,1007.3
2020-10-07 04:00,268,217,96,0,0,21.7,1007.3
2020-10-07 03:50,275,223,96,0,0,21.8,1007.5
2020-10-07 03:40,330,233,96,0,0,21.9,1007.5
2020-10-07 03:30,338,245,96,0.2,0,21.9,1007.6
2020-10-07 03:20,349,263,97,0.4,0,22.1,1007.6
2020-10-07 03:10,331,247,96,5.2,0,22.2,1007.4
2020-10-07 03:00,334,259,96,4.2,0,22.6,1007.5
2020-10-07 02:50,10,285,95,0,0,22.8,1007.7
2020-10-07 02:40,333,274,95,0,0,22.7,1007.5
2020-10-07 02:30,4,277,95,0,0,22.7,1007.3
2020-10-07 02:20,331,260,95,0.6,0,22.7,1007.1
2020-10-07 02:10,334,259,93,0,-1,22.9,1006.8
2020-10-07 02:00,334,261,93,0,-1,22.9,1006.7
2020-10-07 01:50,355,279,94,0,0,23,1006.8
2020-10-07 01:40,18,280,95,0.2,0,22.9,1006.8
