Red,SMN EMAS,,,,,,,,
Estación,LOS PETENES,,,,,,,,
Ubicación,CAMPECHE,,,,,,,,
Latitud (N),19.9433333333333,,,,,,,,
Longitud (O),-90.3738888888889,,,,,,,,
Altitud,3.323,,,,,,,,
,,,,,,,,,
,,,,,,,,,
AAAA/MM/DD HH:MM HORAZ,Dirección de ráfaga (grados),Dirección del Viento (grados),Humedad relativa (%),Precipitación (mm),Radiación Solar (W/m²),Rapidez de ráfaga (km/h),Rapidez de viento (km/h),Temperatura del Aire (°C),Presión Atmosférica
2020-10-07 20:20,0,0,100,0,49,0,0,27.3,1004
2020-10-07 20:00,0,0,100,0,91,0,0,27.8,1003.9
2020-10-07 19:50,0,0,100,0,120,0,0,27.7,1003.9
2020-10-07 19:40,0,0,100,0,121,0,0,27.6,1004.1
2020-10-07 19:30,0,0,100,0,113,0,0,27.5,1004.3
2020-10-07 19:20,0,0,100,0,112,0,0,27.3,1004.5
2020-10-07 19:10,0,0,100,0,91,0,0,27.2,1004.7
2020-10-07 19:00,0,0,100,0,66,0,0,27.2,1004.8
2020-10-07 18:50,0,0,100,0,107,0,0,27.2,1004.7
2020-10-07 18:40,0,0,100,0,142,0,0,27,1004.8
2020-10-07 18:30,0,0,100,0,131,0,0,26.9,1005
2020-10-07 18:20,0,0,100,0,127,0,0,26.9,1005.3
2020-10-07 18:10,0,0,100,0,139,0,0,26.9,1005.4
2020-10-07 18:00,0,0,100,0,135,0,0,27,1005.5
2020-10-07 17:50,0,0,100,0,106,0,0,26.9,1005.7
2020-10-07 17:40,0,0,100,0,88,0,0,26.9,1005.8
2020-10-07 17:30,0,0,100,0,90,0,0,27,1006
2020-10-07 17:20,0,0,100,0,137,0,0,27,1006.1
2020-10-07 17:10,0,0,100,0,160,0,0,26.9,1006.2
2020-10-07 17:00,0,0,100,0,160,0,0,26.9,1006.3
2020-10-07 16:50,0,0,100,0,147,0,0,26.8,1006.3
2020-10-07 16:40,0,0,100,0,131,0,0,26.7,1006.5
2020-10-07 16:30,0,0,100,0,160,0,0,26.6,1006.6
2020-10-07 16:00,0,0,100,0,187,0,0,27.1,1007
2020-10-07 15:50,0,0,99,0,166,0,0,27.2,1006.9
2020-10-07 15:40,0,0,99,0,285,0,0,26.9,1006.9
2020-10-07 15:20,0,0,100,0,81,0,0,26.3,1007
2020-10-07 15:10,0,0,100,0,71,0,0,26.2,1006.8
2020-10-07 15:00,0,0,100,0,21,0,0,26.2,1006.8
2020-10-07 14:50,0,0,100,0,32,0,0,26.3,1006.9
2020-10-07 14:40,0,0,100,0,38,0,0,26.3,1006.9
2020-10-07 14:30,0,0,100,0,67,0,0,26.2,1006.8
2020-10-07 12:20,0,0,100,0,1,0,0,25,1005.8
2020-10-07 12:10,0,0,100,0,0,0,0,24.9,1005.7
2020-10-07 12:00,0,0,100,0,0,0,0,24.9,1005.7
2020-10-07 11:50,0,0,100,0,0,0,0,24.9,1005.8
2020-10-07 11:40,0,0,100,0,0,0,0,24.9,1005.8
2020-10-07 11:30,0,0,100,0,0,0,0,24.9,1005.9
2020-10-07 10:20,0,0,100,0,0,0,0,25.1,1005.1
2020-10-07 10:10,0,0,100,0,0,0,0,25.1,1005.1
2020-10-07 10:00,0,0,100,0,0,0,0,25.1,1005.1
2020-10-07 09:50,0,0,100,0,0,0,0,25.1,1005.2
2020-10-07 09:40,0,0,100,0,0,0,0,25.1,1005
2020-10-07 08:20,0,0,100,0,0,0,0,25.1,1004.8
2020-10-07 08:10,0,0,100,0,0,0,0,25.2,1004.9
2020-10-07 08:00,0,0,100,0,0,0,0,25.2,1005.2
2020-10-07 07:50,0,0,100,0,0,0,0,25.2,1005.3
2020-10-07 07:40,0,0,100,0,0,0,0,25.3,1005.2
2020-10-07 07:30,0,0,100,0,0,0,0,25.3,1005.3
2020-10-07 06:20,0,0,100,0,0,0,0,25.7,1005.9
2020-10-07 06:10,0,0,100,0,0,0,0,25.7,1005.9
2020-10-07 06:00,0,0,100,0,0,0,0,25.8,1005.8
2020-10-07 05:50,0,0,100,0,0,0,0,25.8,1005.8
2020-10-07 05:40,0,0,100,0,0,0,0,25.8,1005.8
2020-10-07 05:30,0,0,100,0,0,0,0,25.8,1005.8
2020-10-07 05:20,0,0,100,0,0,0,0,25.8,1005.8
2020-10-07 05:10,0,0,100,0,0,0,0,25.8,1006
2020-10-07 05:00,0,0,100,0.2,0,0,0,25.8,1006
2020-10-07 04:50,0,0,100,0,0,0,0,25.8,1005.8
2020-10-07 04:40,0,0,100,0,0,0,0,25.8,1005.8
2020-10-07 04:30,0,0,100,0,0,0,0,25.8,1005.7
2020-10-07 04:20,0,0,100,0,0,0,0,25.8,1005.7
2020-10-07 04:10,0,0,100,0,0,0,0,25.8,1005.7
2020-10-07 04:00,0,0,100,0,0,0,0,25.8,1005.9
2020-10-07 03:50,0,0,100,0,0,0,0,25.8,1005.9
2020-10-07 03:40,0,0,100,0,0,0,0,25.8,1005.9
2020-10-07 03:30,0,0,100,0,0,0,0,25.9,1006
2020-10-07 03:20,0,0,100,0,0,0,0,25.9,1006
2020-10-07 03:10,0,0,100,0,0,0,0,25.8,1006.1
2020-10-07 03:00,0,0,100,0,0,0,0,25.8,1006
2020-10-07 02:50,0,0,100,0,0,0,0,25.7,1005.9
2020-10-07 02:40,0,0,100,0,0,0,0,25.6,1005.7
2020-10-07 02:30,0,0,100,0,0,0,0,25.6,1005.7
2020-10-07 01:50,0,0,100,0,0,0,0,25.7,1005.5
2020-10-07 01:40,0,0,100,0,0,0,0,25.6,1005.5
2020-10-07 01:30,0,0,100,0,0,0,0,25.6,1005.3
2020-10-07 01:20,0,0,100,0,0,0,0,25.5,1005.4
2020-10-07 01:10,0,0,100,0,0,0,0,25.5,1005.4
