Red,SMN EMAS,,,,,,,,,,,,
Estación,COZUMEL,,,,,,,,,,,,
Ubicación,QUINTANA ROO,,UTM,,,,,,,,,,
Latitud (N),20.4769444444444,,509704.4,,,,,,,,,,
Longitud (O),-86.9069444444444,,2264264.2,,,,,,,,,,
Altitud,5,,,,,,,,,,,,
,,,,,,,,,,,,,
,,,,,,,,,,,,,
AAAA/MM/DD HH:MM HORAZ,Dirección de ráfaga (grados),Dirección del Viento (grados),Humedad relativa (%),Precipitación (mm),Radiación Solar (W/m²),Rapidez de ráfaga (km/h),Rapidez de viento (km/h),Temperatura del Aire (°C),Presión Atmosférica,,TEMP,U,V
2020-10-08 00:20,24,358,96,0,0,5.8,3.1,26.1,1005.9,,-1.53588974175501,0.108188439777753,-3.0981115637592
2020-10-08 00:10,11,9,96,0,0,5.8,2.8,26.2,1005.9,,4.5553093477052,-0.438016502112647,-2.76552735366639
2020-10-08 00:00,6,4,96,0,0,5.8,3.3,26.3,1005.8,,4.64257581030492,-0.230196363355614,-3.29196136585742
2020-10-07 23:50,354,5,96,0,0,4.3,2.3,26.3,1005.7,,4.62512251778497,-0.200458208319614,-2.29124780561101
2020-10-07 23:40,1,351,96,0,0,4,2.1,26.4,1005.7,,-1.41371669411541,0.328512376584485,-2.07414551524979
2020-10-07 23:30,7,8,95,0,3,2.9,2,26.5,1005.8,,4.57276264022514,-0.27834620192013,-1.98053613748314
2020-10-07 23:20,170,169,88,0,12,10.8,5.8,26.7,1006.8,,1.76278254451427,-1.10669217318396,5.69343766399645
2020-10-07 23:10,161,172,87,0,26,11.9,6.2,26.8,1006.7,,1.71042266695444,-0.862873225952405,6.13966202619774
2020-10-07 23:00,181,169,86,0,44,13,5.8,26.9,1006.5,,1.76278254451427,-1.10669217318396,5.69343766399645
2020-10-07 22:50,165,162,86,0,64,12.2,6.3,27,1006.4,,1.88495559215388,-1.94680706456217,5.99165605265947
2020-10-07 22:40,163,162,86,0,85,12.6,7,27.1,1006.4,,1.88495559215388,-2.16311896062463,6.65739561406608
2020-10-07 22:30,186,167,85,0,106,15.1,7.3,27.2,1006.3,,1.79768912955416,-1.64214269671021,7.11290147293222
2020-10-07 22:20,189,164,85,0,130,15.1,7.5,27.2,1006.2,,1.85004900711399,-2.06728016862749,7.20946271953739
2020-10-07 22:10,203,162,85,0,154,16.9,7.9,27.3,1006.1,,1.88495559215388,-2.44123425556208,7.51334647873171
2020-10-07 22:00,198,171,84,0,165,14.4,7.7,27.3,1006.2,,1.72787595947439,-1.20454538080978,7.60520022258256
2020-10-07 21:50,139,171,84,0,174,14.8,8.2,27.3,1006.1,,1.72787595947439,-1.28276261332989,8.09904439288013
2020-10-07 21:40,144,167,85,0,133,13,7,27.2,1006,,1.79768912955416,-1.57465738040705,6.82059045349665
2020-10-07 21:30,167,174,84,0,141,15.8,7.8,27.2,1005.8,,1.67551608191456,-0.815322013487696,7.75727078387253
2020-10-07 21:20,167,173,85,0,162,15.8,6.6,27.2,1005.8,,1.6929693744345,-0.804337666473973,6.55080460083273
2020-10-07 21:10,183,171,85,0,158,13,6.5,27.1,1005.8,,1.72787595947439,-1.0168240227615,6.4199742138684
2020-10-07 21:00,191,169,85,0,120,18,7,27.1,1005.8,,1.76278254451427,-1.33566296763581,6.87139028413365
2020-10-07 20:50,151,166,85,0,94,11.9,6.3,27.2,1005.8,,1.8151424220741,-1.52410794227791,6.11286307553878
2020-10-07 20:40,177,172,85,0,78,9.7,5.1,27.4,1005.9,,1.71042266695444,-0.709782814896333,5.05036715058201
2020-10-07 20:30,151,172,83,0,125,14.4,7.5,27.6,1005.9,,1.71042266695444,-1.04379825720049,7.42701051556178
2020-10-07 20:20,164,174,82,0,179,16.2,8.7,27.8,1005.7,,1.67551608191456,-0.909397630428584,8.65234048970398
2020-10-07 20:10,138,169,81,0,264,17.3,8.4,28.1,1005.6,,1.76278254451427,-1.60279556116298,8.24566834096038
2020-10-07 20:00,149,171,81,0,377,17.6,8.1,28.1,1005.7,,1.72787595947439,-1.26711916682587,8.00027555882062
2020-10-07 19:50,173,165,80,0,451,19.4,9.6,28.1,1005.6,,1.83259571459405,-2.4846628329842,9.27288793237506
2020-10-07 19:40,143,168,82,0,416,16.6,9,27.8,1005.5,,1.78023583703422,-1.87120521735983,8.80332840660425
2020-10-07 19:30,187,184,83,0,313,15.1,7.7,27.7,1005.6,,1.50098315671512,0.537124847829766,7.68124318700065
2020-10-07 19:20,185,172,82,0,252,16.9,8.3,27.7,1005.7,,1.71042266695444,-1.15513673796854,8.21922497055503
2020-10-07 19:10,164,170,82,0,310,20.9,10.4,27.7,1005.7,,1.74532925199433,-1.80594104773608,10.242000631327
2020-10-07 19:00,189,174,81,0,317,26.3,10.9,27.8,1005.7,,1.67551608191456,-1.13936024961742,10.8402886595142
2020-10-07 18:50,198,168,81,0,369,21.6,10.7,28,1005.8,,1.78023583703422,-2.22465509175002,10.4661793278517
2020-10-07 18:40,149,162,83,0,561,19.4,10.3,27.8,1005.8,,1.88495559215388,-3.18287504206196,9.79588211784008
2020-10-07 18:30,149,164,85,0,438,19.4,9.5,27.4,1005.9,,1.85004900711399,-2.61855488026149,9.13198611141403
2020-10-07 18:20,207,169,84,0,249,19.1,9.1,27.3,1006.1,,1.76278254451427,-1.73636185792656,8.93280736937374
2020-10-07 18:10,186,170,84,0,249,21.2,10.5,27.5,1006.1,,1.74532925199433,-1.82330586550277,10.3404814066282
2020-10-07 18:00,156,185,84,0,339,19.1,10.1,27.6,1006,,1.48352986419518,0.880273001751347,10.0615664507266
2020-10-07 17:50,165,180,85,0,345,19.8,10.7,27.4,1006,,1.5707963267949,6.55186037543834E-16,10.7
2020-10-07 17:40,139,174,85,0,345,20.2,9.3,27.4,1006,,1.67551608191456,-0.972114708389176,9.24905362692494
2020-10-07 17:30,163,179,86,0,320,18.7,10.5,27.3,1006.1,,1.58824961931484,-0.183250267591477,10.4984007991421
2020-10-07 17:20,168,183,86,0,325,18,11.4,27.1,1006,,1.51843644923507,0.596629901169561,11.3843766962021
2020-10-07 17:10,196,187,87,0,322,20.5,10.2,26.9,1005.9,,1.44862327915529,1.2430673027325,10.1239707467415
2020-10-07 17:00,191,184,88,0,263,19.1,10.2,26.7,1005.7,,1.50098315671512,0.71151603219008,10.1751533126502
2020-10-07 16:50,182,174,89,0,243,21.2,10.7,26.4,1005.5,,1.67551608191456,-1.11845455696389,10.6413842804405
2020-10-07 16:40,195,183,90,0,186,21.2,11.3,26.3,1005.5,,1.51843644923507,0.591396305545267,11.2845137427267
2020-10-07 16:30,190,184,90,0,149,18.4,8.9,26.2,1005.4,,1.50098315671512,0.620832616322717,8.87832004731244
2020-10-07 16:20,195,178,90,0,146,20.2,11.3,26.1,1005.4,,1.60570291183478,-0.394364312738258,11.2931163453158
2020-10-07 16:10,164,177,91,0,116,19.8,9.7,26,1005.4,,1.62315620435473,-0.507658775556553,9.68670648711937
2020-10-07 16:00,166,179,91,0,81,17.3,9.2,26.1,1005.3,,1.58824961931484,-0.160562139223008,9.1985987954388
2020-10-07 15:50,196,176,91,0,124,23,10.2,26,1005.2,,1.64060949687467,-0.711516032190078,10.1751533126502
2020-10-07 15:40,180,178,92,0,99,20.9,9.7,26,1005.2,,1.60570291183478,-0.338525118014257,9.69409102208523
2020-10-07 15:30,198,185,92,0,97,20.2,10.6,26,1005,,1.48352986419518,0.923850873125176,10.5596637997725
2020-10-07 15:20,200,191,93,0,109,20.2,11.5,25.9,1004.6,,1.37881010907552,2.19430344683027,11.2887126096481
2020-10-07 15:10,185,189,93,0,74,20.2,10.7,25.8,1004.3,,1.41371669411541,1.67384877593047,10.568265244368
2020-10-07 15:00,205,184,94,0,78,23,11,25.7,1003.8,,1.50098315671512,0.76732121118538,10.9732045528581
2020-10-07 14:50,167,188,94,0,72,22,9.7,25.6,1003.6,,1.43116998663535,1.34997907931264,9.60560026679323
2020-10-07 14:40,190,187,95,0,66,23.4,11.4,25.5,1003.2,,1.44862327915529,1.38931051481868,11.3150261287111
2020-10-07 14:30,202,185,95,0,67,20.9,9.8,25.4,1002.9,,1.48352986419518,0.85412627892705,9.76270804129911
2020-10-07 14:20,194,188,95,0,62,25.6,13.2,25.4,1002.9,,1.43116998663535,1.83708493267287,13.0715385073887
2020-10-07 14:10,184,192,96,0,55,23,12.1,25.3,1002.6,,1.36135681655558,2.51573145889489,11.835585968879
2020-10-07 14:00,195,186,96,0,41,27.7,13.9,25.4,1002.1,,1.46607657167524,1.45294563942038,13.823854345619
2020-10-07 13:50,208,194,96,0,27,26.3,13.2,25.3,1002.1,,1.32645023151569,3.19336902191562,12.8079035868432
2020-10-07 13:40,201,187,96,0,13,25.6,11.7,25.3,1001.8,,1.44862327915529,1.42587131784023,11.6127899742035
2020-10-07 13:30,192,188,96,0,16,34.6,16.2,25.2,1001.2,,1.43116998663535,2.25460423555306,16.0423427136134
2020-10-07 13:20,203,192,96,0,12,32.4,14.7,25.1,1000.9,,1.36135681655558,3.05630185502106,14.3787697307869
2020-10-07 13:10,174,194,96,0,11,31.7,16.3,25.1,1000.3,,1.32645023151569,3.94332689827459,15.8158203382987
2020-10-07 13:00,205,195,96,0,8,29.5,16.2,25.2,999.8,,1.30899693899575,4.19286853066084,15.6479983858829
2020-10-07 12:50,199,195,96,0,4,32.4,18,25.2,999.6,,1.30899693899575,4.65874281184537,17.3866648732032
2020-10-07 12:40,180,195,96,0,3,36.4,20.2,25.3,999.3,,1.30899693899575,5.22814471107092,19.5117016910392
2020-10-07 12:30,196,197,96,0,1,31.3,18.3,25.5,998.6,,1.27409035395586,5.35040219642608,17.5003770341236
2020-10-07 12:20,205,194,96,0,0,29.2,17.7,25.5,998.1,,1.32645023151569,4.28201755211412,17.1742343550851
2020-10-07 12:10,204,195,97,0,0,31,18.7,25.5,997.5,,1.30899693899575,4.83991614341714,18.0628129516056
2020-10-07 12:00,204,193,97,0,0,38.2,19.7,25.4,996.9,,1.34390352403563,4.43153577057414,19.1950902762691
2020-10-07 11:50,203,188,97,0,0,39.2,22.6,25.4,996.5,,1.43116998663535,3.14531208169748,22.3800583535595
2020-10-07 11:40,198,188,97,0,0,34.2,20.7,25.4,995.3,,1.43116998663535,2.88088318987336,20.4985490229505
2020-10-07 11:30,245,223,97,0,0,47.2,25.3,25.2,992.9,,0.820304748437335,17.2545585095812,18.503248650965
2020-10-07 11:20,233,228,97,0,0,48.6,25.3,25.2,992.7,,0.733038285837618,18.8015640845781,16.9290043408791
2020-10-07 11:10,217,224,97,0,0,44.6,22.8,25.2,992.8,,0.802851455917391,15.8382108464651,16.4009474477212
2020-10-07 11:00,233,224,97,0,0,37.4,23.5,25.3,992.8,,0.802851455917391,16.3244717057864,16.9044853079583
2020-10-07 10:50,222,227,97,0,0,46.8,24.7,25.2,992.7,,0.750491578357562,18.0644364299935,16.8453594935437
2020-10-07 10:40,236,226,97,0,0,39.2,23.8,25.2,992.4,,0.767944870877505,17.1202872480599,16.5328692169241
2020-10-07 10:30,222,219,97,0,0,35.3,20.9,25.3,992.1,,0.890117918517108,13.1527961729416,16.2423505944507
2020-10-07 10:20,209,219,97,0,0,37.8,26.4,25.3,992.2,,0.890117918517108,16.6140583237157,20.516653382464
2020-10-07 10:10,228,217,97,0,0,41.8,23.8,25.2,991.9,,0.925024503556995,14.3231975510188,19.0075251391256
2020-10-07 10:00,230,227,97,0,0,45.7,24.3,25.2,991.6,,0.750491578357562,17.7718949493458,16.5725601495187
2020-10-07 09:50,234,233,97,0,0,48.2,24.5,25.3,991.7,,0.645771823237902,19.5665699961587,14.7444680672252
2020-10-07 09:40,251,237,97,0,0,43.6,21.2,25.5,992,,0.575958653158129,17.779816040443,11.5463475423186
2020-10-07 09:30,252,246,97,0,0,40.3,19.6,25.5,992.5,,0.418879020478639,17.905490969795,7.97203820428568
2020-10-07 09:20,262,257,97,0,0,27.7,14.3,25.5,992.9,,0.226892802759263,13.9334919264289,3.21680007711727
2020-10-07 09:10,288,272,97,0,0,27.7,13.9,25.6,993.7,,-0.034906585039887,13.8915324955654,-0.485103004164763
2020-10-07 09:00,276,280,97,0,0,27.7,12.2,25.6,993.6,,-0.174532925199433,12.0146545867489,-2.11850776753655
2020-10-07 08:50,250,275,97,0,0,22.3,11.5,25.7,994.7,,-0.087266462599717,11.4562390280551,-1.00229104159807
2020-10-07 08:40,291,290,97,0,0,23.4,10.8,25.8,996.1,,-0.349065850398866,10.1486803044878,-3.69381754791722
2020-10-07 08:30,311,296,97,0,0,22,11,25.8,996.9,,-0.453785605518526,9.88673450929084,-4.82208261467985
2020-10-07 08:20,292,300,97,0,0,22.3,9.7,25.8,996.6,,-0.523598775598299,8.40044641670906,-4.85
2020-10-07 08:10,317,306,97,0,0,27,12.3,25.8,996.5,,-0.628318530717959,9.95090903081185,-7.22975860319742
2020-10-07 08:00,343,310,97,0,0,29.5,13.2,25.7,996.6,,-0.698131700797732,10.1117866491705,-8.48479644786232
2020-10-07 07:50,311,317,97,0,0,23.8,12.7,25.5,997.2,,-0.820304748437335,8.66137917279373,-9.28819201056346
2020-10-07 07:40,326,318,97,0,0,19.1,12.5,25.4,997.6,,-0.837758040957278,8.36413257948573,-9.28931031846743
2020-10-07 07:30,337,338,97,0,0,35.6,14.8,25.3,998.4,,-1.18682389135614,5.5441775825555,-13.7223210475885
2020-10-07 07:20,331,342,97,0,0,27.4,12.1,25.3,999.1,,-1.25663706143592,3.73910563193686,-11.5077838471714
2020-10-07 07:10,358,353,97,0,0,28.4,13.9,25.6,999.9,,-1.44862327915529,1.69398387333155,-13.7963915078144
2020-10-07 07:00,357,346,97,0,0,26.6,12.3,25.8,999.9,,-1.32645023151569,2.97563931587592,-11.9346374331948
2020-10-07 06:50,321,328,97,0,0,25.6,10,25.7,1000.1,,-1.01229096615671,5.29919264233205,-8.48048096156426
2020-10-07 06:40,6,346,97,0,0,20.2,10.5,25.5,1000.7,,-1.32645023151569,2.54017990379651,-10.188105125898
2020-10-07 06:30,3,6,97,0,0,18.4,8.8,25.6,1001.5,,4.60766922526503,-0.91985047675535,-8.75179267924081
2020-10-07 06:20,16,12,97,0,0,23,11.4,25.6,1001.6,,4.50294947014537,-2.37019327532246,-11.1508826483654
2020-10-07 06:10,35,12,97,0,0,22.7,11.8,25.5,1002.1,,4.50294947014537,-2.45335795164957,-11.5421416886589
2020-10-07 06:00,4,3,97,0,0,21.6,9.5,25.3,1002.4,,4.66002910282486,-0.497191584307971,-9.48698058016845
2020-10-07 05:50,17,1,97,0,0,18,9.8,25.4,1002.7,,4.69493568786475,-0.171033583085378,-9.79850741253263
2020-10-07 05:40,16,10,97,0,0,16.9,8.2,25.4,1003,,4.53785605518526,-1.42391505686883,-8.07542357470011
2020-10-07 05:30,4,10,97,0,0,22,10.5,25.3,1003.3,,4.53785605518526,-1.82330586550277,-10.3404814066282
2020-10-07 05:20,27,21,97,0,0,33.5,11.9,25,1003.7,,4.34586983746588,-4.26457859958908,-11.1096070753167
2020-10-07 05:10,4,3,97,0,0,13.7,7.1,24.7,1003.7,,4.66002910282486,-0.371585289324905,-7.09026969675747
2020-10-07 05:00,10,3,97,0,0,20.5,9.1,24.7,1003.7,,4.66002910282486,-0.476257201810793,-9.08752876626662
2020-10-07 04:50,12,15,97,0,0,28.8,14.9,25.1,1004.1,,4.45058959258554,-3.85640377202756,-14.3922948117071
2020-10-07 04:40,22,18,97,0,0,29.9,15.7,25.6,1004.5,,4.39822971502571,-4.85156681168668,-14.9315873058339
2020-10-07 04:30,18,19,97,0,0,25.6,11.4,26.2,1004.1,,4.38077642250577,-3.71147696081159,-10.7789117618322
2020-10-07 04:20,14,14,97,0,0,14.4,6.5,26.1,1003.9,,4.46804288510548,-1.57249232139784,-6.30692222079398
2020-10-07 04:10,35,20,97,0,0,13.7,7.4,26.1,1004,,4.36332312998582,-2.53094906060995,-6.95372539381572
2020-10-07 04:00,31,21,97,0,0,15.1,7.6,26.1,1004.3,,4.34586983746588,-2.72359641654429,-7.09521124137873
2020-10-07 03:50,338,357,97,0,0,12.6,4.9,26.1,1004.3,,-1.51843644923507,0.256446185590425,-4.89328472029741
2020-10-07 03:40,19,1,97,0,0,19.8,8.4,26,1004.6,,4.69493568786475,-0.146600214073181,-8.39872063931369
2020-10-07 03:30,340,359,97,0,0,22,9.2,26,1004.5,,-1.55334303427495,0.160562139223007,-9.1985987954388
2020-10-07 03:20,350,336,97,0,0,18.4,9.7,26,1004.7,,-1.15191730631626,3.94534543783526,-8.86139093913323
2020-10-07 03:10,330,321,97,0,0,14.4,7.7,26,1004.7,,-0.890117918517108,4.84576701108375,-5.98402390321868
2020-10-07 03:00,345,1,97,0,0,13.7,6,26,1004.9,,4.69493568786475,-0.104714438623701,-5.99908617093835
2020-10-07 02:50,346,325,97,0,0,9.4,4.8,26,1004.8,,-0.959931088596881,2.75316689448502,-3.93192981258716
2020-10-07 02:40,334,323,97,0,0,11.9,5.3,25.9,1005.1,,-0.925024503556995,3.18961962270586,-4.23276820325065
2020-10-07 02:30,331,327,97,0,0,9.4,3.9,25.8,1005.3,,-0.994837673636768,2.12409223655861,-3.27081521498715
2020-10-07 02:20,335,327,97,0,0,4,2.7,25.8,1005.4,,-0.994837673636768,1.47052539454057,-2.26441053345264
2020-10-07 02:10,350,332,97,0,0,4.3,2.3,25.7,1005.5,,-1.08210413623648,1.07978459440755,-2.03077946357553
2020-10-07 02:00,332,335,96,0,0,5.4,3.1,25.7,1005.6,,-1.13446401379631,1.31011661139617,-2.80955413981361
2020-10-07 01:50,2,353,96,0,0,3.6,1.6,25.7,1005.6,,-1.44862327915529,0.194990949448236,-1.58807384262612
2020-10-07 01:40,345,355,96,0,0,6.5,3.2,25.7,1005.5,,-1.48352986419518,0.278898376792506,-3.18782303389359
2020-10-07 01:30,3,327,96,0,0,6.5,2.9,25.6,1005.4,,-0.994837673636768,1.57945320154358,-2.43214464704173
2020-10-07 01:20,347,324,96,0,0,5,2.5,25.6,1005.4,,-0.942477796076938,1.46946313073118,-2.02254248593737
2020-10-07 01:10,337,335,96,0,0,4.7,2.1,25.6,1005.5,,-1.13446401379631,0.887498349655469,-1.90324635277696
2020-10-07 01:00,332,327,96,0,0,2.9,1.4,25.7,1005.5,,-0.994837673636768,0.762494649021038,-1.17413879512359
