Red,SMN EMAS,,,,,,,,,,,,
Estación,Kantunilkin,,,,,,,,,,,,
Ubicación,Quintana Roo,,UTM,,,,,,,,,,
Latitud (N),21.10194,,49542.2,,,,,,,,,,
Longitud (O),-87.48583,,33506.7,,,,,,,,,,
Altitud,32.4,,,,,,,,,,,,
,,,,,,,,,,,,,
,,,,,,,,,,,,,
AAAA/MM/DD HH:MM HORAZ,Dirección de ráfaga (grados),Dirección del Viento (grados),Humedad relativa (%),Precipitación (mm),Radiación Solar (W/m²),Rapidez de ráfaga (km/h),Rapidez de viento (km/h),Temperatura del Aire (°C),Presión Atmosférica,,TEMP,U,V
2020-10-07 20:10,162,156,82,0,73,29.8,16.2,26.8,1001.9,,1.98967534727354,-6.58913361782796,14.7994364138101
2020-10-07 20:00,156,162,82,0,160,28.4,16.4,26.8,1001.8,,1.88495559215388,-5.06787870774914,15.5973268672405
2020-10-07 19:50,167,164,82,0,130,29.5,17.8,26.7,1001.8,,1.85004900711399,-4.90634493354258,17.1104581877021
2020-10-07 19:40,161,162,83,0,121,28.1,15.9,26.7,1001.8,,1.88495559215388,-4.91337021056166,15.1217986090929
2020-10-07 19:30,145,161,83,0,128,32,18.2,26.6,1001.7,,1.90240888467382,-5.92534041112025,17.2084380759076
2020-10-07 19:20,164,161,83,0,105,33.6,17.9,26.6,1001.6,,1.90240888467382,-5.8276699647831,16.9247825032278
2020-10-07 19:10,157,158,83,0,113,33.7,19.4,26.7,1001.5,,1.95476876223365,-7.26736791226869,17.9873667785957
2020-10-07 19:00,145,157,83,0,214,38.4,21,26.7,1001.4,,1.97222205475359,-8.20535369827475,19.3306019225012
2020-10-07 18:50,150,160,84,0,313,37,21.2,26.4,1001.3,,1.91986217719376,-7.25082703850418,19.9214835606613
2020-10-07 18:40,159,168,85,0,223,36.6,19.4,26.2,1001.4,,1.78023583703422,-4.03348680186453,18.9760634542358
2020-10-07 18:30,164,172,86,0,189,39.9,18.6,26.1,1001.3,,1.71042266695444,-2.58861967785722,18.4189860785932
2020-10-07 18:20,166,173,86,0,176,37.8,19.6,25.9,1001.3,,1.6929693744345,-2.38863913074089,19.4539045721699
2020-10-07 18:10,159,173,88,0,174,41.5,20.7,25.8,1001.3,,1.6929693744345,-2.52269540848655,20.5457053389754
2020-10-07 18:00,155,171,88,0,127,37.8,19,25.7,1001.1,,1.72787595947439,-2.97225483576439,18.7660784713076
2020-10-07 17:50,163,167,89,0,165,45.8,21.1,25.6,1000.9,,1.79768912955416,-4.74646724665555,20.5592083669685
2020-10-07 17:40,165,173,90,0,170,40.6,20.8,25.5,1000.8,,1.6929693744345,-2.53488234282707,20.6449599541395
2020-10-07 17:30,153,168,92,0,203,45.1,20.4,25.4,1000.7,,1.78023583703422,-4.24139849268229,19.9542110549696
2020-10-07 17:20,168,165,93,0,149,39.7,19.5,25.2,1000.7,,1.83259571459405,-5.04697137949916,18.8355536126368
2020-10-07 17:10,161,169,95,0,90,46.2,20.3,25.1,1000.7,,1.76278254451427,-3.87342260614386,19.9270318239876
2020-10-07 17:00,157,169,97,0,65,43.5,22.5,25,1000.5,,1.76278254451427,-4.29320239597226,22.0866116275724
2020-10-07 16:50,178,171,100,0,76,41.9,24.6,24.9,1000.2,,1.72787595947439,-3.84828783998968,24.2971331786404
2020-10-07 16:40,197,171,100,0,55,54.4,24.4,24.7,1000,,1.72787595947439,-3.81700094698164,24.0995955105214
2020-10-07 16:30,199,175,100,0,63,47.1,24.5,24.7,999.7,,1.65806278939461,-2.13531569731763,24.4067701032478
2020-10-07 16:20,163,173,100,0.2,59,49.4,26.4,24.6,999.4,,1.6929693744345,-3.21735066589589,26.2032184033309
2020-10-07 16:10,171,173,100,0.4,42,54.7,26.5,24.7,999.2,,1.6929693744345,-3.22953760023641,26.302473018495
2020-10-07 16:00,150,173,100,0.6,39,53.6,28.1,24.7,998.6,,1.6929693744345,-3.42452854968464,27.8905468611212
2020-10-07 15:50,160,170,100,0.4,38,50.4,29,24.8,998.1,,1.74532925199433,-5.03579715234098,28.559424837354
2020-10-07 15:40,155,162,100,0.2,25,63.8,34.3,24.8,997.7,,1.88495559215388,-10.5992829070607,32.6212385089238
2020-10-07 15:30,161,166,98,1,22,67.6,32.3,24.9,997.2,,1.8151424220741,-7.81407722786927,31.3405519587147
2020-10-07 15:20,164,168,98,0.2,25,71.6,34.2,25.1,996.6,,1.78023583703422,-7.11057982596736,33.4526479450962
2020-10-07 15:10,203,171,98,0,24,64.2,32.2,25.2,995.8,,1.72787595947439,-5.03718977429544,31.8035645671634
2020-10-07 15:00,163,167,100,0,21,69.2,37.9,25.2,994.7,,1.79768912955416,-8.52564495963248,36.9286254553604
2020-10-07 14:50,158,165,100,0,11,90.2,42.9,25.3,993.9,,1.83259571459405,-11.1033370348981,41.438217947801
2020-10-07 14:40,148,160,100,0.2,4,90.3,49.7,25.1,992.9,,1.91986217719376,-16.9984011232857,46.7027232530597
2020-10-07 14:30,140,152,100,0,3,103.5,52.5,25.2,991.3,,2.05948851735331,-24.6472570462593,46.3547486250937
2020-10-07 14:20,129,154,100,0.2,3,80,43.9,25.3,990.1,,2.02458193231342,-19.2444933440405,39.4570586325334
2020-10-07 14:10,163,165,100,0.2,4,78.3,39.3,25.2,989.4,,1.83259571459405,-10.1715884725291,37.9608849731604
2020-10-07 14:00,197,185,100,0.2,7,89.1,39.5,25.1,986.9,,1.48352986419518,3.4426518385325,39.3496905746239
2020-10-07 13:50,212,191,100,2,7,91.4,50.4,25,984.3,,1.37881010907552,9.61677336697786,49.4740100457623
2020-10-07 13:40,203,200,100,3.2,6,108.1,48.7,25.3,981.9,,1.22173047639603,16.6563809799601,45.7630306322737
2020-10-07 13:30,177,184,100,0,6,69.5,30.3,25.4,980.7,,1.50098315671512,2.113621154447,30.2261907228727
2020-10-07 13:20,164,154,100,0.2,7,40.4,20.1,25.5,979.7,,2.02458193231342,-8.81126005046046,18.0657603306133
2020-10-07 13:10,154,147,100,0,7,26.4,16.3,25.7,978.9,,2.14675497995303,-8.87761627074494,13.6703302575104
2020-10-07 13:00,71,79,100,0.2,2,29.2,13.6,25.6,978.7,,3.33357887130917,-13.3501296948882,-2.59500233712101
2020-10-07 12:50,53,52,100,0,1,44.3,23.8,25.5,978.3,,3.80481776934764,-18.75465593584,-14.6527431127507
2020-10-07 12:40,26,36,100,0,1,58.9,27.4,25.5,978.8,,4.08407044966673,-16.1053159128138,-22.1670656458736
2020-10-07 12:30,18,22,99,0,1,55.6,28.8,25.6,979.3,,4.32841654494594,-10.7886698903783,-26.7028950115235
2020-10-07 12:20,342,7,98,1.4,0,81.7,38.7,25.7,980.2,,4.59021593274509,-4.7163435897792,-38.4115360685192
2020-10-07 12:10,357,351,99,7,1,104.1,55.9,25.8,980.6,,-1.41371669411541,8.74468659574891,-55.2117782392682
2020-10-07 12:00,13,353,100,2,0,88.6,46,25.8,981.7,,-1.44862327915529,5.60598979663678,-45.6571229755008
2020-10-07 11:50,348,349,100,2.2,0,87.8,44.9,25.9,983.2,,-1.37881010907552,8.56732389240687,-44.0750605368001
2020-10-07 11:40,9,345,100,7,1,99.5,51.2,25.9,984.6,,-1.30899693899575,13.2515351092491,-49.4554023060003
2020-10-07 11:30,348,350,100,3.6,0,89.1,43.3,25.8,986.6,,-1.39626340159546,7.51896609297809,-42.6421757054286
2020-10-07 11:20,339,347,100,0.6,0,78.2,37.6,25.7,988,,-1.34390352403563,8.45815964332932,-36.6363144359248
2020-10-07 11:10,338,335,100,1.8,0,78.4,40.5,25.6,989.4,,-1.13446401379631,17.1160396004983,-36.7054653749843
2020-10-07 11:00,330,336,100,2.6,0,80.6,39.5,25.6,990.2,,-1.15191730631626,16.0660974014941,-36.0850455768827
2020-10-07 10:50,329,332,100,1.8,0,72.1,40.5,25.6,991,,-1.08210413623648,19.0135982928286,-35.7593775107865
2020-10-07 10:40,344,329,100,4.8,0,61,32.9,25.6,992.3,,-1.02974425867665,16.9447526645408,-28.2008041930995
2020-10-07 10:30,337,336,100,7.8,0,47.9,29.4,25.8,993.6,,-1.15191730631626,11.9580573064285,-26.8582364546925
2020-10-07 10:20,332,342,100,1,0,46.7,23.8,25.8,994.5,,-1.25663706143592,7.35460446612375,-22.6351450878247
2020-10-07 10:10,347,340,100,0.8,0,47.3,25.2,25.9,994.9,,-1.22173047639603,8.61890761180685,-23.6802540438049
2020-10-07 10:00,347,344,100,0.6,0,40.8,24,25.9,995.3,,-1.2915436464758,6.61529653960798,-23.0702807025197
2020-10-07 09:50,338,345,100,0.6,0,43.1,23.3,25.9,995.8,,-1.30899693899575,6.03048375088873,-22.5060717525353
2020-10-07 09:40,3,346,100,0.8,0,42.2,21.6,25.9,996.5,,-1.32645023151569,5.22551294495283,-20.9583876875615
2020-10-07 09:30,4,347,100,0.4,0,38.6,17.9,25.9,996.9,,-1.34390352403563,4.02662387275518,-17.4412241596557
2020-10-07 09:20,7,357,100,0.4,0,29.4,16.6,26,997.3,,-1.51843644923507,0.86877687363287,-16.5772502769259
2020-10-07 09:10,7,0,100,0.2,0,38,18.5,26,997.5,,4.71238898038469,-3.3983948676339E-15,-18.5
2020-10-07 09:00,9,354,100,0.4,0,36.1,17.9,26,997.3,,-1.46607657167524,1.871059492491,-17.8019419270921
2020-10-07 08:50,336,346,100,0.2,0,35.7,18.9,26,997.1,,-1.32645023151569,4.57232382683372,-18.3385892266163
2020-10-07 08:40,345,353,100,0,0,31.9,16.5,26,998.1,,-1.44862327915529,2.01084416618493,-16.3770115020818
2020-10-07 08:30,23,358,100,0.2,1,36.8,21.1,25.7,998.4,,-1.53588974175501,0.736379380422773,-21.0871464501029
2020-10-07 08:20,351,0,100,3.6,0,46.2,24.8,25.8,998.9,,4.71238898038469,-4.55568609282815E-15,-24.8
2020-10-07 08:10,345,340,100,1.8,0,34.6,17.2,25.9,999.3,,-1.22173047639603,5.8827464652015,-16.1627130775176
2020-10-07 08:00,321,345,100,0.2,0,24.7,12.9,25.9,999.6,,-1.30899693899575,3.33876568182252,-12.460443159129
2020-10-07 07:50,331,345,100,0,0,27.7,14.5,25.8,1000.1,,-1.30899693899575,3.75287615398655,-14.0059244811915
2020-10-07 07:40,344,348,100,0.4,0,22.7,13.7,25.8,1000.5,,-1.36135681655558,2.8483901642033,-13.4006221300531
2020-10-07 07:30,333,4,100,,,26.6,13.4,25.7,1000.7,,4.64257581030492,-0.934736748171283,-13.3673582734816
2020-10-07 07:20,323,334,100,,,21.5,10.6,25.6,1000.7,,-1.11701072127637,4.64673415596422,-9.52721689077117
2020-10-07 07:10,335,326,100,0.4,0,23.9,12.9,25.6,1001.1,,-0.977384381116825,7.21358845477263,-10.69458468596
2020-10-07 07:00,342,340,100,0.6,0,19.2,10.9,25.7,1001.6,,-1.22173047639603,3.72801956224979,-10.2426495665664
2020-10-07 06:50,320,339,100,0.2,0,16.2,10.3,25.7,1001.9,,-1.20427718387609,3.69118988031659,-9.61587839292118
2020-10-07 06:40,339,346,100,0,0,21.2,10.6,25.7,1002.1,,-1.32645023151569,2.56437209335648,-10.2851346985256
2020-10-07 06:30,323,350,100,0,0,16.9,10.5,25.8,1002.5,,-1.39626340159546,1.82330586550277,-10.3404814066282
2020-10-07 06:20,3,351,100,0.2,0,17.9,9.5,25.8,1002.8,,-1.41371669411541,1.48612741788219,-9.38303923565381
2020-10-07 06:10,325,350,100,0.2,0,16.1,8.8,25.8,1003.1,,-1.39626340159546,1.52810396346899,-8.66630822650743
2020-10-07 06:00,341,354,100,0.4,0,12.3,7.3,25.8,1003.3,,-1.46607657167524,0.76305778185387,-7.2600098361884
2020-10-07 05:50,22,3,100,0.2,0,13.4,8.1,25.9,1003.3,,4.66002910282486,-0.423921245567849,-8.08889923151205
2020-10-07 05:40,358,6,100,0,0,15.1,8.1,25.9,1003.3,,4.60766922526503,-0.846680552467992,-8.05562735248301
2020-10-07 05:30,26,8,100,0.2,0,19.7,8.7,25.9,1003.4,,4.57276264022514,-1.21080597835256,-8.61533219805166
2020-10-07 05:20,25,14,100,0.4,0,17.5,8,25.9,1003.6,,4.46804288510548,-1.93537516479734,-7.76236581020797
2020-10-07 05:10,14,8,100,0,0,17,9.9,25.8,1003.6,,4.57276264022514,-1.37781369950464,-9.80365388054155
2020-10-07 05:00,6,12,100,0,0,15.3,8.7,25.8,1003.8,,4.50294947014537,-1.80883171011451,-8.50988412638411
2020-10-07 04:50,347,16,100,0,0,18.8,10.1,25.8,1003.8,,4.4331363000656,-2.78393729375169,-9.70874312897702
2020-10-07 04:40,29,20,100,0,0,16.5,8.6,25.7,1003.8,,4.36332312998582,-2.94137323260076,-8.08135653875881
2020-10-07 04:30,11,11,100,0,0,15.7,8.9,25.6,1003.8,,4.52040276266531,-1.69820005885125,-8.73648193268421
2020-10-07 04:20,11,6,100,0,0,13.9,7.9,25.6,1003.8,,4.60766922526503,-0.825774859814461,-7.85672297340936
2020-10-07 04:10,353,360,100,0,0,14.3,8.7,25.6,1003.8,,-1.5707963267949,5.32721357629099E-16,-8.7
2020-10-07 04:00,10,360,100,0,0,15.8,9,25.6,1004,,-1.5707963267949,5.51091059616309E-16,-9
2020-10-07 03:50,23,3,100,0,0,12,6.8,25.5,1004.1,,4.66002910282486,-0.355884502452021,-6.7906808363311
2020-10-07 03:40,2,4,100,0,0,12.7,8.1,25.5,1004.2,,4.64257581030492,-0.565027437327417,-8.08026880710458
2020-10-07 03:30,20,3,100,0,0,12.7,6.7,25.5,1004.2,,4.66002910282486,-0.350650906827727,-6.69081788285564
2020-10-07 03:20,31,5,100,0,0,11.3,5.3,25.5,1004.3,,4.62512251778497,-0.461925436562589,-5.27983189988625
2020-10-07 03:10,2,4,100,0,0,8.3,4.5,25.5,1004.3,,4.64257581030492,-0.313904131848565,-4.48903822616921
2020-10-07 03:00,7,357,100,0,0,10.3,4.6,25.5,1004.2,,-1.51843644923507,0.240745398717542,-4.59369585987104
2020-10-07 02:50,357,2,100,0,0,20.5,6.2,25.5,1004.3,,4.6774823953448,-0.21637687955551,-6.19622312751839
2020-10-07 02:40,356,12,100,0,0,8.1,4.6,25.6,1004.5,,4.50294947014537,-0.956393777761695,-4.49947896337551
2020-10-07 02:30,1,349,100,0,0,9.9,4.8,25.6,1004.4,,-1.37881010907552,0.915883177807416,-4.71181048054879
2020-10-07 02:20,358,358,100,0,0,9.3,5.7,25.7,1004.7,,-1.53588974175501,0.198927131204256,-5.69652771400885
2020-10-07 02:10,359,9,100,0,0,7.8,3.4,25.7,1004.8,,4.5553093477052,-0.531877181136785,-3.35814035802347
2020-10-07 02:00,354,356,100,0,0,7.9,4.2,25.7,1004.8,,-1.50098315671512,0.292977189725327,-4.18976901109126
2020-10-07 01:50,344,355,100,0,0,8.7,4.4,25.8,1004.8,,-1.48352986419518,0.383485268089696,-4.38325667160368
2020-10-07 01:40,318,338,100,0,0,7.2,3.9,25.8,1004.7,,-1.18682389135614,1.46096571432206,-3.61601703281047
2020-10-07 01:30,338,336,100,0,0,7.6,4.2,25.8,1004.6,,-1.15191730631626,1.70829390091836,-3.83689092209892
2020-10-07 01:20,23,358,100,0,0,10.9,5.5,25.9,1004.8,,-1.53588974175501,0.191947231863756,-5.49664954860503
2020-10-07 01:10,5,16,100,0,0,8.5,4.9,25.9,1004.8,,4.4331363000656,-1.35062304350329,-4.71018231009776
2020-10-07 01:00,34,7,100,0,0,8.1,4.2,25.9,1004.9,,4.59021593274509,-0.511851242301618,-4.16869383689355
2020-10-07 00:50,39,22,100,0,0,8.9,4.5,25.9,1005,,4.32841654494594,-1.68572967037161,-4.17232734555054
2020-10-07 00:40,14,26,100,0,0,9.8,4.7,25.9,1005.1,,4.25860337486616,-2.06034438990867,-4.22433201760608
2020-10-07 00:30,35,45,99,0,0,6.6,3.9,25.9,1005.1,,3.92699081698724,-2.75771644662754,-2.75771644662754
2020-10-07 00:20,47,39,98,0,0,10.3,4.9,26,1005,,4.0317105721069,-3.0836699161442,-3.80801521113916
2020-10-07 00:10,64,47,98,0,0,9.8,5.4,26.1,1004.9,,3.89208423194735,-3.94930998874352,-3.68279114433749
2020-10-07 00:00,17,29,96,0,0,13.4,7.2,26.1,1004.7,,4.20624349730633,-3.49062926577362,-6.29726189140365
2020-10-06 23:50,50,49,95,0.2,0,13.2,6.6,26.2,1004.7,,3.85717764690747,-4.98108322947029,-4.32998959133735
2020-10-06 23:40,50,29,94,0,0,14.3,8.3,26.3,1004.4,,4.20624349730633,-4.0239198480446,-7.25934356925699
2020-10-06 23:30,62,35,93,0,1,16.9,8.1,26.4,1004.4,,4.10152374218667,-4.64596913444348,-6.63513155874083
2020-10-06 23:20,6,37,92,0,3,13.1,6,26.4,1004.3,,4.06661715714679,-3.61089013891229,-4.79181306028376
2020-10-06 23:10,64,43,,,,,5.3,,,,3.96189740202713,-3.61459130833124,-3.8761746185816
2020-10-06 23:00,46,51,,,,,4.8,,,,3.82227106186758,-3.73030061499346,-3.02073787703922
2020-10-06 22:50,73,56,,,,,4.9,,,,3.73500459926786,-4.06228410551971,-2.74004522700666
2020-10-06 22:40,74,57,,,,,5.4,,,,3.71755130674792,-4.52882106690529,-2.94105078908115
2020-10-06 22:30,82,56,,,,,6.1,,,,3.73500459926786,-5.05712919258576,-3.41107671117155
2020-10-06 22:20,57,77,,,,,6.9,,,,3.36848545634906,-6.72315344701812,-1.55216227497267
2020-10-06 22:10,78,88,81,0,59,19.9,8.4,28,1004.1,,3.17649923862968,-8.3948829469604,-0.293155772301008
2020-10-06 22:00,83,97,80,0,62,17.2,7.2,28.3,1004.1,,3.01941960595019,-7.14633229181752,0.877459272517062
