{
    "so2_parameter":"CDMX",
    "date":"2021-03-28T12:00",
    "origin":[0,0],
    "x_imit":[10,0],
    "y_imit":[0,10],
    "coords":
    [
        {
            "name": "ACO",
            "xy":[396161.4,2389552.5],
            "z":[-4.57299701695549]
            
        },        
        {
            "name": "Tizimn",
            "xy":[224888.2,2354251.3],
            "z":[-0.892006165897972]
            
        },      
        {
            "name": "Palenque",
            "xy":[223496.1,2317579.7],
            "z":[-2.67601849769391]
            
        },
        {
            "name": "La union",
            "xy":[526957.4,2348731.6],
            "z":[-1.53976545054084]
            
        },
        {
            "name": "Isla del Carmen",
            "xy":[504827.8,2266747.2],
            "z":[-0.398581329457882]
            
        },
        {
            "name": "Tantaquin",
            "xy":[360332,2164176.7],
            "z":[-1.01435198560257]
            
        },
        {
            "name": "Cozumel",
            "xy":[359440,2046521.3],
            "z":[1.01435198560257]
            
        },
        {
            "name": "Cancun",
            "xy":[625782.5,2064988],
            "z":[-2.02870397120515]            
        },
        {
            "name": "Progreso",
            "xy":[225070.1,2357660.7],
            "z":[0.398735868834458]            
        }
    ]            
}
