Red,SMN EMAS,,,,,,,,
Estación,NICOLAS BRAVO,,,,,,,,
Ubicación,QUINTANA ROO,,,,,,,,
Latitud (N),18.4552777777778,,,,,,,,
Longitud (O),-88.9238888888889,,,,,,,,
Altitud,104,,,,,,,,
,,,,,,,,,
,,,,,,,,,
AAAA/MM/DD HH:MM HORAZ,Dirección de ráfaga (grados),Dirección del Viento (grados),Humedad relativa (%),Precipitación (mm),Radiación Solar (W/m²),Rapidez de ráfaga (km/h),Rapidez de viento (km/h),Temperatura del Aire (°C),Presión Atmosférica
2020-10-08 00:20,1,1,80,0,0,0.9,0.9,25.6,996.4
2020-10-08 00:10,1,1,79,0,0,0.9,0.9,25.7,996.3
2020-10-08 00:00,1,1,79,0,0,0.9,0.9,25.8,996.1
2020-10-07 23:50,1,1,78,0,2,0.9,0.9,26.2,996
2020-10-07 23:40,1,1,76,0,8,0.9,0.9,26.5,996
2020-10-07 23:30,1,1,75,0,17,0.9,0.9,26.6,995.9
2020-10-07 23:20,1,1,92,0,17,0.9,0.9,25.8,996.3
2020-10-07 23:10,1,1,91,0.2,31,0.9,0.9,26,996.3
2020-10-07 23:00,1,1,91,0,35,0.9,0.9,26.1,996.4
2020-10-07 22:50,1,1,90,0,52,0.9,0.9,26.3,996.4
2020-10-07 22:40,1,1,90,0,91,0.9,0.9,26.3,996.3
2020-10-07 22:30,1,1,90,0,94,0.9,0.9,26.3,996.1
2020-10-07 22:20,1,1,89,0,80,0.9,0.9,26.4,996.1
2020-10-07 22:10,1,1,89,0.2,90,0.9,0.9,26.5,996
2020-10-07 22:00,1,1,88,0,152,0.9,0.9,26.6,996
2020-10-07 21:50,1,1,89,0,171,0.9,0.9,26.6,996
2020-10-07 21:40,1,1,89,0,146,0.9,0.9,26.5,996
2020-10-07 21:30,1,1,89,0,99,0.9,0.9,26.5,996.1
2020-10-07 21:20,1,1,88,0,125,0.9,0.9,26.7,996
2020-10-07 21:10,1,1,88,0.2,197,0.9,0.9,26.6,995.8
2020-10-07 21:00,1,1,88,0,170,0.9,0.9,26.4,995.9
2020-10-07 20:50,1,1,87,0,102,0.9,0.9,26.7,995.8
2020-10-07 20:40,1,1,86,0,234,0.9,0.9,27.2,995.6
2020-10-07 20:30,1,1,87,0,291,0.9,0.9,26.8,995.6
2020-10-07 20:20,1,1,87,0,169,0.9,0.9,26.9,995.5
2020-10-07 20:10,1,1,87,0,228,0.9,0.9,27.1,995.4
2020-10-07 20:00,1,1,88,0,430,0.9,0.9,27,995.4
2020-10-07 19:50,1,1,90,0,194,0.9,0.9,26.2,995.5
2020-10-07 19:40,1,1,89,0,94,0.9,0.9,26.3,995.5
2020-10-07 19:30,1,1,89,0,140,1,0.9,26.3,995.5
2020-10-07 19:20,1,1,88,0,126,0.9,0.9,26.4,995.5
2020-10-07 19:10,1,1,88,0.2,156,0.9,0.9,26.6,995.6
2020-10-07 19:00,1,1,87,0,123,0.9,0.9,27,995.6
2020-10-07 18:50,1,1,86,0,200,0.9,0.9,27.2,995.6
2020-10-07 18:40,1,1,85,0,225,0.9,0.9,27.6,995.7
2020-10-07 18:30,1,1,84,0,349,0.9,0.9,28.2,995.8
2020-10-07 18:20,1,1,84,0,494,0.9,0.9,28,995.9
2020-10-07 18:10,1,1,85,0,445,0.9,0.8,27.9,996.1
2020-10-07 18:00,1,1,87,0,425,0.9,0.8,27.4,996.1
2020-10-07 17:50,1,1,86,0,248,0.9,0.9,27.5,996.2
2020-10-07 17:40,1,1,86,0,349,0.9,0.9,27.5,996.1
2020-10-07 17:30,1,1,87,0,427,0.9,0.9,27.3,996.1
2020-10-07 17:20,1,1,87,0,403,0.9,0.9,27.2,996.2
2020-10-07 17:10,1,1,87,0.2,388,0.9,0.8,27.2,996.2
2020-10-07 17:00,1,1,87,0,430,0.9,0.8,27.3,996.1
2020-10-07 16:50,1,1,88,0,434,0.9,0.8,27,996.2
2020-10-07 16:40,1,1,88,0,327,0.9,0.9,26.7,996.3
2020-10-07 16:20,1,1,89,0,418,0.9,0.8,26.3,996.3
2020-10-07 16:10,1,1,89,0.2,498,0.9,0.9,26.1,996.3
2020-10-07 16:00,1,1,90,0,389,0.9,0.9,25.7,996.2
2020-10-07 15:50,1,1,91,0.2,284,0.9,0.9,25.4,996.4
2020-10-07 15:40,1,1,91,0.2,230,0.9,0.9,25.4,996.3
2020-10-07 15:30,1,1,90,0,304,0.9,0.9,25.4,996.3
2020-10-07 15:20,1,1,91,0.2,348,0.9,0.8,25.2,996.3
2020-10-07 15:10,1,1,92,0.2,254,0.9,0.9,24.9,996.3
2020-10-07 15:00,1,1,92,0.2,218,0.9,0.9,24.8,996.4
2020-10-07 14:50,1,1,92,0.2,208,0.9,0.9,24.6,996.5
2020-10-07 14:40,1,1,92,0.2,219,0.9,0.9,24.5,996.5
2020-10-07 14:30,1,1,92,0.2,274,0.9,0.9,24.4,996.4
2020-10-07 14:20,1,1,93,0.2,260,0.9,0.9,24.2,996.3
2020-10-07 14:10,1,1,94,0.2,244,0.9,0.9,23.9,995.9
2020-10-07 14:00,1,1,95,0.2,203,0.9,0.9,23.6,995.8
2020-10-07 13:50,1,1,96,0.2,172,0.9,0.9,23.3,995.8
2020-10-07 13:40,1,1,96,0.2,140,0.9,0.9,23,995.8
2020-10-07 13:30,1,1,96,0.2,106,0.9,0.9,22.8,995.7
2020-10-07 13:20,1,1,96,0.2,90,0.9,0.9,22.6,995.7
2020-10-07 13:10,1,1,97,0.2,73,0.9,0.9,22.4,995.6
2020-10-07 13:00,1,1,97,0,56,0.9,0.9,22.3,995.6
2020-10-07 12:50,1,1,97,0.2,43,0.9,0.9,22.3,995.6
2020-10-07 12:40,1,1,97,0.2,34,0.9,0.9,22.2,995.4
2020-10-07 12:30,1,1,97,0.2,26,0.9,0.9,22.2,995.2
2020-10-07 12:20,1,1,97,0.2,17,0.9,0.9,22.1,995.2
2020-10-07 12:10,1,1,97,0.2,9,0.9,0.9,22.1,995.1
2020-10-07 12:00,1,1,97,0.2,3,0.9,0.9,22,995
2020-10-07 11:50,1,1,97,0,1,0.9,0.9,22,994.8
2020-10-07 11:40,1,1,97,0.2,0,0.9,0.9,22,994.8
2020-10-07 11:30,1,1,97,0.2,0,0.9,0.9,22,994.8
2020-10-07 11:20,1,1,97,0.2,0,0.9,0.9,21.9,994.8
2020-10-07 11:10,1,1,97,0.2,0,0.9,0.9,21.9,994.8
2020-10-07 11:00,1,1,97,0.2,0,0.9,0.9,21.9,994.8
2020-10-07 10:50,1,1,97,0.2,0,0.9,0.9,21.9,995
2020-10-07 10:40,1,1,97,0.2,0,0.9,0.9,21.9,995
2020-10-07 10:30,1,1,97,0,0,0.9,0.9,21.9,995.1
2020-10-07 10:20,1,1,97,0.4,0,0.9,0.9,21.9,995
2020-10-07 10:10,1,1,97,0.2,0,0.9,0.9,21.9,995.1
2020-10-07 10:00,1,1,97,0.2,0,0.9,0.9,21.9,995
2020-10-07 09:50,1,1,97,0.2,0,0.9,0.9,21.9,995
2020-10-07 09:40,1,1,97,0,0,0.9,0.9,21.9,995
2020-10-07 09:30,1,1,98,0.2,0,0.9,0.9,21.9,994.8
2020-10-07 09:20,1,1,98,0.2,0,0.9,0.9,21.9,994.6
2020-10-07 09:10,1,1,98,0.2,0,0.9,0.9,21.9,994.5
2020-10-07 09:00,1,1,98,0,0,0.9,0.9,21.9,994.5
2020-10-07 08:50,1,1,98,0.2,0,0.9,0.9,21.9,994.5
2020-10-07 08:40,1,1,98,0.2,0,0.9,0.9,21.9,994.6
2020-10-07 08:30,1,1,98,0.2,0,0.9,0.9,21.9,994.8
2020-10-07 08:20,1,1,98,0.2,0,0.9,0.9,21.9,994.8
2020-10-07 08:10,1,1,98,0.2,0,0.9,0.9,21.9,994.9
2020-10-07 08:00,1,1,97,0.2,0,0.9,0.9,22,995.1
2020-10-07 07:50,1,1,97,0.2,0,0.9,0.9,22,995.3
2020-10-07 07:40,1,1,97,0,0,0.9,0.9,22,995.4
2020-10-07 07:30,1,1,97,0.2,0,0.9,0.9,22,995.3
2020-10-07 07:20,1,1,97,0.2,0,0.9,0.9,22,995.3
2020-10-07 07:10,1,1,97,0,0,0.9,0.9,22,995.5
2020-10-07 07:00,1,1,98,0.2,0,0.9,0.9,21.9,995.6
2020-10-07 06:50,1,1,98,0,0,0.9,0.9,21.9,995.8
2020-10-07 06:40,1,1,98,0.2,0,0.9,0.9,21.9,995.9
2020-10-07 06:30,1,1,98,0.2,0,0.9,0.9,21.9,995.8
2020-10-07 06:20,1,1,98,0,0,0.9,0.9,21.9,996.1
2020-10-07 06:10,1,1,98,0.2,0,0.9,0.9,21.9,996.4
2020-10-07 06:00,1,1,98,0,0,0.9,0.9,21.9,996.4
2020-10-07 05:50,1,1,97,0.2,0,0.9,0.9,21.9,996.5
2020-10-07 05:40,1,1,97,0,0,0.9,0.9,22,996.9
2020-10-07 05:30,1,1,97,0.2,0,0.9,0.9,22.2,997
2020-10-07 05:20,1,1,97,0,0,0.9,0.9,22.4,997.1
2020-10-07 05:10,1,1,97,0.2,0,0.9,0.9,22.3,996.9
2020-10-07 05:00,1,1,97,0,0,0.9,0.9,22.4,996.8
2020-10-07 04:50,1,1,97,0,0,0.9,0.9,22.3,996.7
2020-10-07 04:40,1,1,97,0.2,0,0.9,0.9,22.3,996.6
2020-10-07 04:30,1,1,97,0,1,0.9,0.9,22.2,996.7
2020-10-07 04:20,1,1,97,0,1,0.9,0.8,22.2,996.7
2020-10-07 04:10,1,1,97,0,1,0.9,0.9,22.2,996.7
2020-10-07 04:00,1,1,97,0,0,0.9,0.9,22.2,996.7
2020-10-07 03:50,1,1,97,0.2,0,0.9,0.9,22.2,996.6
2020-10-07 03:40,1,1,97,0,0,0.9,0.9,22.2,996.6
2020-10-07 03:30,1,1,97,0,0,0.9,0.9,22.2,996.7
2020-10-07 03:20,1,1,97,0,0,0.9,0.9,22.1,996.7
2020-10-07 03:10,1,1,97,0,0,0.9,0.8,22.1,996.6
2020-10-07 03:00,1,1,97,0,0,0.9,0.8,22.1,996.7
2020-10-07 02:50,1,1,97,0,0,0.9,0.8,22.1,996.7
2020-10-07 02:40,1,1,96,0,0,0.9,0.8,22.1,996.8
2020-10-07 02:30,1,1,96,0,0,0.9,0.9,22,996.8
2020-10-07 02:20,1,1,96,0.2,0,0.9,0.8,22.1,996.9
2020-10-07 02:10,1,1,96,0,0,0.9,0.8,22.4,997
2020-10-07 02:00,1,1,96,0,0,0.9,0.8,22.5,996.9
2020-10-07 01:50,1,1,96,0,0,0.9,0.8,22.5,997.3
2020-10-07 01:40,1,1,96,0,0,0.9,0.8,22.6,997.2
2020-10-07 01:30,1,1,96,0,0,0.9,0.9,22.6,997.1
2020-10-07 01:20,1,1,95,0,0,0.9,0.9,22.8,997.1
