\babel@toc {spanish}{}
\contentsline {section}{\numberline {1}Introducci\IeC {\'o}n}{1}{section.1}
\contentsline {section}{\numberline {2}Estado del Arte}{1}{section.2}
\contentsline {section}{\numberline {3}Bibliograf\IeC {\'\i }a}{1}{section.3}
