\contentsline {section}{\numberline {1}Introduction}{1}
\contentsline {section}{\numberline {2}Problem statement}{1}
\contentsline {section}{\numberline {3}Results}{4}
\contentsline {section}{\numberline {4}References}{7}
