















E1: ii->4 jj->0 
E1: ii->4 jj->1 
E1: ii->4 jj->2 
E1: ii->4 jj->3 
E1: ii->4 jj->4

E1: ii->0 jj->0
E1: ii->0 jj->1
E1: ii->0 jj->2
E1: ii->0 jj->3
E1: ii->0 jj->4

E1: ii->1 jj->0
E1: ii->1 jj->1
E1: ii->1 jj->2
E1: ii->1 jj->3
E1: ii->1 jj->4 

E1: ii->2 jj->0
E1: ii->2 jj->1
E1: ii->2 jj->2
E1: ii->2 jj->3
E1: ii->2 jj->4

E1: ii->3 jj->0
E1: ii->3 jj->1
E1: ii->3 jj->2
E1: ii->3 jj->3
E1: ii->3 jj->4 
