\relax 
\@writefile{toc}{\contentsline {section}{\numberline {1}Introduction}{1}}
\newlabel{sec:intr}{{1}{1}}
\@writefile{toc}{\contentsline {section}{\numberline {2}Problem statement}{1}}
\@writefile{toc}{\contentsline {section}{\numberline {3}Discontinuous Galerkin Method}{1}}
\newlabel{sec:dg}{{3}{1}}
\newlabel{eq2}{{1}{1}}
\newlabel{eq3}{{2}{1}}
\newlabel{eq4}{{4}{2}}
\newlabel{eq5}{{5}{2}}
\newlabel{eq:eq6}{{8}{3}}
\@writefile{toc}{\contentsline {subsection}{\numberline {3.1}Initial conditions}{6}}
\@writefile{toc}{\contentsline {subsection}{\numberline {3.2}Dirichlet boundary conditions}{6}}
\bibcite{timburton}{1}
\@writefile{toc}{\contentsline {subsection}{\numberline {3.3}Basis functions on $\mathcal  {C}_{k,l}$}{7}}
\newlabel{sec:bf}{{3.3}{7}}
\@writefile{toc}{\contentsline {section}{\numberline {4}Results}{7}}
\newlabel{sec:results}{{4}{7}}
\@writefile{toc}{\contentsline {section}{\numberline {5}References}{7}}
\newlabel{sec:fc}{{5}{7}}
\@writefile{lof}{\contentsline {figure}{\numberline {1}{\ignorespaces Anomalous diffusion: 4 simetric voxels and 1 delta (center)}}{8}}
\newlabel{fig:1}{{1}{8}}
