8
1.000000 0.000000 0.000000 0.000000 0.000000 0.000000 0.000000 0.000000 
0.000000 1.000000 0.000000 0.000000 0.000000 0.000000 0.000000 0.000000 
0.000000 0.000000 1.000000 0.000000 0.000000 0.000000 0.000000 0.000000 
-0.000000 -0.000000 0.000000 1.000000 0.000000 0.000000 0.000000 0.000000 
-0.000000 0.000000 -0.000000 -0.000000 1.000000 0.000000 0.000000 0.000000 
0.000000 0.000000 0.000000 0.000000 0.000000 1.000000 0.000000 0.000000 
-0.000000 -0.000000 0.000000 0.000000 0.000000 -0.000000 1.000000 0.000000 
0.000000 -0.000000 -0.000000 0.000000 -0.000000 0.000000 -0.000000 1.000000 
1.085813 7.633491 -4.911104 3.401169 5.630617 -3.361812 -2.398513 -4.936032 
