\relax 
\@writefile{toc}{\contentsline {section}{\numberline {1}Introduction}{1}}
\newlabel{sec:intr}{{1}{1}}
\@writefile{toc}{\contentsline {section}{\numberline {2}Problem statement}{1}}
\newlabel{eq2}{{1}{1}}
\newlabel{eq3}{{2}{1}}
\newlabel{eq4}{{3}{3}}
\newlabel{eq5}{{4}{3}}
\@writefile{toc}{\contentsline {section}{\numberline {3}Results}{4}}
\newlabel{sec:rs}{{3}{4}}
\@writefile{lot}{\contentsline {table}{\numberline {1}{\ignorespaces Tiempos de ejecuci\'on}}{4}}
\newlabel{tab:tab1}{{1}{4}}
\@writefile{lof}{\contentsline {figure}{\numberline {1}{\ignorespaces Difusi\'on libre, malla 50x50x50 tiempo final 10, 7.42 sec. Nsteps 333 dx=dy=dz=1 }}{5}}
\newlabel{fig:1}{{1}{5}}
\bibcite{timburton}{1}
\@writefile{lof}{\contentsline {figure}{\numberline {2}{\ignorespaces Difusi\'on an\'omala, malla 50x50x50 tiempo final 10, 7.42 sec. Nsteps 333 dx=dy=dz=1}}{6}}
\newlabel{fig:1}{{2}{6}}
\@writefile{lof}{\contentsline {figure}{\numberline {3}{\ignorespaces Axones y deltas caso 200x200x200.}}{7}}
\newlabel{fig:1}{{3}{7}}
\@writefile{lof}{\contentsline {figure}{\numberline {4}{\ignorespaces Difusi\'on an\'omala, malla 200x200x200 tiempo final 0.5, 346.9 sec. Nsteps 266 dx=dy=dz = 0.25 }}{7}}
\newlabel{fig:1}{{4}{7}}
\@writefile{toc}{\contentsline {section}{\numberline {4}References}{7}}
\newlabel{sec:fc}{{4}{7}}
