{"airplaneCode": 33123, "airplaneName": "airbus", "airplaneType": "A380", "airplanePrice": 380000}
{"airplaneCode": 42343, "airplaneName": "airbus", "airplaneType": "A350", "airplanePrice": 350000}
{"airplaneCode": 34534, "airplaneName": "airbus", "airplaneType": "A340", "airplanePrice": 340000}
{"airplaneCode": 65433, "airplaneName": "airbus", "airplaneType": "A330", "airplanePrice": 330000}
{"airplaneCode": 58833, "airplaneName": "airbus", "airplaneType": "A320", "airplanePrice": 320000}
{"airplaneCode": 54233, "airplaneName": "Boeing", "airplaneType": "747", "airplanePrice": 370000}
{"airplaneCode": 23330, "airplaneName": "Boeing", "airplaneType": "777", "airplanePrice": 360000}
{"airplaneCode": 89045, "airplaneName": "Boeing", "airplaneType": "787", "airplanePrice": 350000}
{"airplaneCode": 12294, "airplaneName": "Boeing", "airplaneType": "767", "airplanePrice": 340000}
{"airplaneCode": 70500, "airplaneName": "Boeing", "airplaneType": "737", "airplanePrice": 330000}