{
  "de": [
    {
      "name": "Stanley AIRBOSS Kompressor",
      "images": ["/assets/img/product-image-1.webp", "/assets/img/product-image-1.webp"],
      "pros": ["Füllt sich in 165 Sekunden", "Ölfrei", "1 HP", "Ruhig", "Nicht teuer"],
      "cons": ["Nicht für schwere Arbeiten geeignet"],
      "description": "Für die meisten Zwecke ist der Stanley AIRBOSS Kompressor die beste Option. Es ist ziemlich groß, aber das bedeutet, dass es viel Kapazität hat. Es hat genug Kapazität für die meisten Jobs. <br />Es ist auch sehr ruhig, was einer der Gründe ist, warum wir es so hoch bewertet haben. Wenn Sie Nachbarn haben oder keinen extrem lauten Luftkompressor möchten, ist dieser perfekt.<br /><br />Es kann sich in wenigen Minuten von leer bis voll füllen und ist ölfrei. Diese Funktion bedeutet, dass weitaus weniger Wartung erforderlich ist als bei anderen Modellen.<br />Es ist auch auf Rädern, was es einfach macht, es von Ort zu Ort zu bewegen. Der Motor ist mit 1 PS anständig leistungsstark, obwohl es auf dem Markt einige stärkere Optionen gibt.<br /><br />Insgesamt ist dies der beste Luftkompressor für die meisten Heimwerker und Profis. Es kann fast alles und verfügt über alle Funktionen, die Sie benötigen - ohne die, die Sie nicht benötigen. Wir haben auch den anständig niedrigen Preis geschätzt."
    },
    {
      "name": "Einhell Kompressor TC-AC 190/6/8 OF - Bester Wert 1",
      "images": ["/assets/img/item-card__image.webp", "/assets/img/item-card__image.webp"],
      "pros": ["Kann direkt an eine leichtere Steckdose angeschlossen werden", "Automatische Abschaltung", "Adapter enthalten", "tragbar"],
      "cons": ["Nicht für schwere Arbeiten geeignet"],
      "description": "Für die meisten Zwecke ist der Stanley AIRBOSS Kompressor die beste Option. Es ist ziemlich groß, aber das bedeutet, dass es viel Kapazität hat. Es hat genug Kapazität für die meisten Jobs. <br />Es ist auch sehr ruhig, was einer der Gründe ist, warum wir es so hoch bewertet haben. Wenn Sie Nachbarn haben oder keinen extrem lauten Luftkompressor möchten, ist dieser perfekt.<br /><br />Es kann sich in wenigen Minuten von leer bis voll füllen und ist ölfrei. Diese Funktion bedeutet, dass weitaus weniger Wartung erforderlich ist als bei anderen Modellen.<br />Es ist auch auf Rädern, was es einfach macht, es von Ort zu Ort zu bewegen. Der Motor ist mit 1 PS anständig leistungsstark, obwohl es auf dem Markt einige stärkere Optionen gibt.<br /><br />Insgesamt ist dies der beste Luftkompressor für die meisten Heimwerker und Profis. Es kann fast alles und verfügt über alle Funktionen, die Sie benötigen - ohne die, die Sie nicht benötigen. Wir haben auch den anständig niedrigen Preis geschätzt."
    },
    {
      "name": "Einhell Kompressor TC-AC 190/6/8 OF - Bester Wert 2",
      "images": ["/assets/img/item-card__image-2.webp", "/assets/img/item-card__image-2.webp", "/assets/img/item-card__image-2.webp"],
      "pros": ["Kann direkt an eine leichtere Steckdose angeschlossen werden", "Automatische Abschaltung", "Adapter enthalten", "tragbar"],
      "cons": ["Nicht für schwere Arbeiten geeignet"],
      "description": "Für die meisten Zwecke ist der Stanley AIRBOSS Kompressor die beste Option. Es ist ziemlich groß, aber das bedeutet, dass es viel Kapazität hat. Es hat genug Kapazität für die meisten Jobs. <br />Es ist auch sehr ruhig, was einer der Gründe ist, warum wir es so hoch bewertet haben. Wenn Sie Nachbarn haben oder keinen extrem lauten Luftkompressor möchten, ist dieser perfekt.<br /><br />Es kann sich in wenigen Minuten von leer bis voll füllen und ist ölfrei. Diese Funktion bedeutet, dass weitaus weniger Wartung erforderlich ist als bei anderen Modellen.<br />Es ist auch auf Rädern, was es einfach macht, es von Ort zu Ort zu bewegen. Der Motor ist mit 1 PS anständig leistungsstark, obwohl es auf dem Markt einige stärkere Optionen gibt.<br /><br />Insgesamt ist dies der beste Luftkompressor für die meisten Heimwerker und Profis. Es kann fast alles und verfügt über alle Funktionen, die Sie benötigen - ohne die, die Sie nicht benötigen. Wir haben auch den anständig niedrigen Preis geschätzt."
    },
    {
      "name": "Einhell Kompressor TC-AC 190/6/8 OF - Bester Wert 3",
      "images": ["/assets/img/item-card__image-3.webp"],
      "pros": ["Kann direkt an eine leichtere Steckdose angeschlossen werden", "Automatische Abschaltung", "Adapter enthalten", "tragbar"],
      "cons": ["Nicht für schwere Arbeiten geeignet"],
      "description": "Für die meisten Zwecke ist der Stanley AIRBOSS Kompressor die beste Option. Es ist ziemlich groß, aber das bedeutet, dass es viel Kapazität hat. Es hat genug Kapazität für die meisten Jobs. <br />Es ist auch sehr ruhig, was einer der Gründe ist, warum wir es so hoch bewertet haben. Wenn Sie Nachbarn haben oder keinen extrem lauten Luftkompressor möchten, ist dieser perfekt.<br /><br />Es kann sich in wenigen Minuten von leer bis voll füllen und ist ölfrei. Diese Funktion bedeutet, dass weitaus weniger Wartung erforderlich ist als bei anderen Modellen.<br />Es ist auch auf Rädern, was es einfach macht, es von Ort zu Ort zu bewegen. Der Motor ist mit 1 PS anständig leistungsstark, obwohl es auf dem Markt einige stärkere Optionen gibt.<br /><br />Insgesamt ist dies der beste Luftkompressor für die meisten Heimwerker und Profis. Es kann fast alles und verfügt über alle Funktionen, die Sie benötigen - ohne die, die Sie nicht benötigen. Wir haben auch den anständig niedrigen Preis geschätzt."
    },
    {
      "name": "Einhell Kompressor TC-AC 190/6/8 OF - Bester Wert 4",
      "images": ["/assets/img/item-card__image-4.webp"],
      "pros": ["Kann direkt an eine leichtere Steckdose angeschlossen werden", "Automatische Abschaltung", "Adapter enthalten", "tragbar"],
      "cons": ["Nicht für schwere Arbeiten geeignet"],
      "description": "Für die meisten Zwecke ist der Stanley AIRBOSS Kompressor die beste Option. Es ist ziemlich groß, aber das bedeutet, dass es viel Kapazität hat. Es hat genug Kapazität für die meisten Jobs. <br />Es ist auch sehr ruhig, was einer der Gründe ist, warum wir es so hoch bewertet haben. Wenn Sie Nachbarn haben oder keinen extrem lauten Luftkompressor möchten, ist dieser perfekt.<br /><br />Es kann sich in wenigen Minuten von leer bis voll füllen und ist ölfrei. Diese Funktion bedeutet, dass weitaus weniger Wartung erforderlich ist als bei anderen Modellen.<br />Es ist auch auf Rädern, was es einfach macht, es von Ort zu Ort zu bewegen. Der Motor ist mit 1 PS anständig leistungsstark, obwohl es auf dem Markt einige stärkere Optionen gibt.<br /><br />Insgesamt ist dies der beste Luftkompressor für die meisten Heimwerker und Profis. Es kann fast alles und verfügt über alle Funktionen, die Sie benötigen - ohne die, die Sie nicht benötigen. Wir haben auch den anständig niedrigen Preis geschätzt."
    },
    {
      "name": "Einhell Kompressor TC-AC 190/6/8 OF - Bester Wert 5",
      "images": ["/assets/img/item-card__image-5.webp"],
      "pros": ["Kann direkt an eine leichtere Steckdose angeschlossen werden", "Automatische Abschaltung", "Adapter enthalten", "tragbar"],
      "cons": ["Nicht für schwere Arbeiten geeignet"],
      "description": "Für die meisten Zwecke ist der Stanley AIRBOSS Kompressor die beste Option. Es ist ziemlich groß, aber das bedeutet, dass es viel Kapazität hat. Es hat genug Kapazität für die meisten Jobs. <br />Es ist auch sehr ruhig, was einer der Gründe ist, warum wir es so hoch bewertet haben. Wenn Sie Nachbarn haben oder keinen extrem lauten Luftkompressor möchten, ist dieser perfekt.<br /><br />Es kann sich in wenigen Minuten von leer bis voll füllen und ist ölfrei. Diese Funktion bedeutet, dass weitaus weniger Wartung erforderlich ist als bei anderen Modellen.<br />Es ist auch auf Rädern, was es einfach macht, es von Ort zu Ort zu bewegen. Der Motor ist mit 1 PS anständig leistungsstark, obwohl es auf dem Markt einige stärkere Optionen gibt.<br /><br />Insgesamt ist dies der beste Luftkompressor für die meisten Heimwerker und Profis. Es kann fast alles und verfügt über alle Funktionen, die Sie benötigen - ohne die, die Sie nicht benötigen. Wir haben auch den anständig niedrigen Preis geschätzt."
    },
    {
      "name": "Einhell Kompressor TC-AC 190/6/8 OF - Bester Wert 6",
      "images": ["/assets/img/item-card__image-6.webp"],
      "pros": ["Kann direkt an eine leichtere Steckdose angeschlossen werden", "Automatische Abschaltung", "Adapter enthalten", "tragbar"],
      "cons": ["Nicht für schwere Arbeiten geeignet"],
      "description": "Für die meisten Zwecke ist der Stanley AIRBOSS Kompressor die beste Option. Es ist ziemlich groß, aber das bedeutet, dass es viel Kapazität hat. Es hat genug Kapazität für die meisten Jobs. <br />Es ist auch sehr ruhig, was einer der Gründe ist, warum wir es so hoch bewertet haben. Wenn Sie Nachbarn haben oder keinen extrem lauten Luftkompressor möchten, ist dieser perfekt.<br /><br />Es kann sich in wenigen Minuten von leer bis voll füllen und ist ölfrei. Diese Funktion bedeutet, dass weitaus weniger Wartung erforderlich ist als bei anderen Modellen.<br />Es ist auch auf Rädern, was es einfach macht, es von Ort zu Ort zu bewegen. Der Motor ist mit 1 PS anständig leistungsstark, obwohl es auf dem Markt einige stärkere Optionen gibt.<br /><br />Insgesamt ist dies der beste Luftkompressor für die meisten Heimwerker und Profis. Es kann fast alles und verfügt über alle Funktionen, die Sie benötigen - ohne die, die Sie nicht benötigen. Wir haben auch den anständig niedrigen Preis geschätzt."
    }
  ],
  "en": [
    {
      "name": "Stanley AIRBOSS Compressor",
      "images": ["/assets/img/product-image-1.webp", "/assets/img/product-image-1.webp"
      ],
      "pros": ["Fills up in 165 seconds", "Oil-free", "1 HP", "Quiet", "Not expensive"],
      "cons": ["Not suitable for heavy work"],
      "description": "For most purposes, the Stanley AIRBOSS compressor is the best option. It's pretty big, but that means it has a lot of capacity. It has enough capacity for most jobs. <br /> It's also very quiet which is one of the reasons we rated it so highly. If you have neighbors or don't want an extremely loud air compressor, this is perfect. <br /> <br /> It can fill from empty to full in minutes and is oil-free. This feature means it requires far less maintenance than other models. <br /> It is also on wheels which makes it easy to move from place to place. The motor is decently powerful at 1hp, although there are some more powerful options on the market. <br /> <br /> Overall, this is the best air compressor for most DIYers and professionals. It can do almost anything, and has all the features you need, without the ones you don't. We also appreciated the decently low price."
    },
    {
      "name": "Einhell Compressor TC-AC 190/6/8 OF - Best valuet 1",
      "images": ["/assets/img/item-card__image.webp", "/assets/img/item-card__image.webp"],
      "pros": ["Can be plugged directly into a lighter socket", "Auto shutdown", "Adapter included", "Portable"],
      "cons": ["Not suitable for heavy work"],
      "description": "For most purposes, the Stanley AIRBOSS compressor is the best option. It's pretty big, but that means it has a lot of capacity. It has enough capacity for most jobs. <br /> It's also very quiet which is one of the reasons we rated it so highly. If you have neighbors or don't want an extremely loud air compressor, this is perfect. <br /> <br /> It can fill from empty to full in minutes and is oil-free. This feature means it requires far less maintenance than other models. <br /> It is also on wheels which makes it easy to move from place to place. The motor is decently powerful at 1hp, although there are some more powerful options on the market. <br /> <br /> Overall, this is the best air compressor for most DIYers and professionals. It can do almost anything, and has all the features you need, without the ones you don't. We also appreciated the decently low price."
    },
    {
      "name": "Einhell Compressor TC-AC 190/6/8 OF - Best valuet 2",
      "images": ["/assets/img/item-card__image-2.webp", "/assets/img/item-card__image-2.webp", "/assets/img/item-card__image-2.webp"],
      "pros": ["Can be plugged directly into a lighter socket", "Auto shutdown", "Adapter included", "Portable"],
      "cons": ["Not suitable for heavy work"],
      "description": "For most purposes, the Stanley AIRBOSS compressor is the best option. It's pretty big, but that means it has a lot of capacity. It has enough capacity for most jobs. <br /> It's also very quiet which is one of the reasons we rated it so highly. If you have neighbors or don't want an extremely loud air compressor, this is perfect. <br /> <br /> It can fill from empty to full in minutes and is oil-free. This feature means it requires far less maintenance than other models. <br /> It is also on wheels which makes it easy to move from place to place. The motor is decently powerful at 1hp, although there are some more powerful options on the market. <br /> <br /> Overall, this is the best air compressor for most DIYers and professionals. It can do almost anything, and has all the features you need, without the ones you don't. We also appreciated the decently low price."
    },
    {
      "name": "Einhell Compressor TC-AC 190/6/8 OF - Best valuet 3",
      "images": ["/assets/img/item-card__image-3.webp"],
      "pros": ["Can be plugged directly into a lighter socket", "Auto shutdown", "Adapter included", "Portable"],
      "cons": ["Not suitable for heavy work"],
      "description": "For most purposes, the Stanley AIRBOSS compressor is the best option. It's pretty big, but that means it has a lot of capacity. It has enough capacity for most jobs. <br /> It's also very quiet which is one of the reasons we rated it so highly. If you have neighbors or don't want an extremely loud air compressor, this is perfect. <br /> <br /> It can fill from empty to full in minutes and is oil-free. This feature means it requires far less maintenance than other models. <br /> It is also on wheels which makes it easy to move from place to place. The motor is decently powerful at 1hp, although there are some more powerful options on the market. <br /> <br /> Overall, this is the best air compressor for most DIYers and professionals. It can do almost anything, and has all the features you need, without the ones you don't. We also appreciated the decently low price."
    },
    {
      "name": "Einhell Compressor TC-AC 190/6/8 OF - Best valuet 4",
      "images": ["/assets/img/item-card__image-4.webp"],
      "pros": ["Can be plugged directly into a lighter socket", "Auto shutdown", "Adapter included", "Portable"],
      "cons": ["Not suitable for heavy work"],
      "description": "For most purposes, the Stanley AIRBOSS compressor is the best option. It's pretty big, but that means it has a lot of capacity. It has enough capacity for most jobs. <br /> It's also very quiet which is one of the reasons we rated it so highly. If you have neighbors or don't want an extremely loud air compressor, this is perfect. <br /> <br /> It can fill from empty to full in minutes and is oil-free. This feature means it requires far less maintenance than other models. <br /> It is also on wheels which makes it easy to move from place to place. The motor is decently powerful at 1hp, although there are some more powerful options on the market. <br /> <br /> Overall, this is the best air compressor for most DIYers and professionals. It can do almost anything, and has all the features you need, without the ones you don't. We also appreciated the decently low price."
    },
    {
      "name": "Einhell Compressor TC-AC 190/6/8 OF - Best valuet 5",
      "images": ["/assets/img/item-card__image-5.webp"],
      "pros": ["Can be plugged directly into a lighter socket", "Auto shutdown", "Adapter included", "Portable"],
      "cons": ["Not suitable for heavy work"],
      "description": "For most purposes, the Stanley AIRBOSS compressor is the best option. It's pretty big, but that means it has a lot of capacity. It has enough capacity for most jobs. <br /> It's also very quiet which is one of the reasons we rated it so highly. If you have neighbors or don't want an extremely loud air compressor, this is perfect. <br /> <br /> It can fill from empty to full in minutes and is oil-free. This feature means it requires far less maintenance than other models. <br /> It is also on wheels which makes it easy to move from place to place. The motor is decently powerful at 1hp, although there are some more powerful options on the market. <br /> <br /> Overall, this is the best air compressor for most DIYers and professionals. It can do almost anything, and has all the features you need, without the ones you don't. We also appreciated the decently low price."
    },
    {
      "name": "Einhell Compressor TC-AC 190/6/8 OF - Best valuet 6",
      "images": ["/assets/img/item-card__image-6.webp"],
      "pros": ["Can be plugged directly into a lighter socket", "Auto shutdown", "Adapter included", "Portable"],
      "cons": ["Not suitable for heavy work"],
      "description": "For most purposes, the Stanley AIRBOSS compressor is the best option. It's pretty big, but that means it has a lot of capacity. It has enough capacity for most jobs. <br /> It's also very quiet which is one of the reasons we rated it so highly. If you have neighbors or don't want an extremely loud air compressor, this is perfect. <br /> <br /> It can fill from empty to full in minutes and is oil-free. This feature means it requires far less maintenance than other models. <br /> It is also on wheels which makes it easy to move from place to place. The motor is decently powerful at 1hp, although there are some more powerful options on the market. <br /> <br /> Overall, this is the best air compressor for most DIYers and professionals. It can do almost anything, and has all the features you need, without the ones you don't. We also appreciated the decently low price."
    }
  ]
}
