{
  "port": "{{ server_port }}",

  "use_auth": true,
  "_jwt": "{{ jwt_private_key }}",
  "jwt": {
    "admin": {
      "key": "{{ jwt_admin_key }}"
    },
    "user": {
      "key": "{{ jwt_user_key }}"
    }
  },

  "glusterfs": {
    "executor": "ssh",
    "sshexec": {
      "keyfile": "{{ heketi_ssh_key }}",
      "user": "root",
      "port": "22",
      "fstab": "/etc/fstab"
    },

    "db": "{{ heketi_db_file }}",

    "loglevel" : "{{ log_level }}",

    "auto_create_block_hosting_volume": true,
    "block_hosting_volume_size": 500
  }
}
