<svg width="8" height="8" viewBox="0 0 8 8" fill="none" xmlns="http://www.w3.org/2000/svg">
<path d="M0.146447 7.21751C-0.0488155 7.02225 -0.0488155 6.70567 0.146447 6.51041L6.51041 0.146447C6.70567 -0.0488155 7.02225 -0.0488156 7.21751 0.146447C7.41278 0.341709 7.41278 0.658291 7.21751 0.853553L0.853553 7.21751C0.658291 7.41278 0.341709 7.41278 0.146447 7.21751Z" fill="#505C67"/>
<path d="M0.146463 0.146454C0.341725 -0.0488081 0.658307 -0.0488081 0.853569 0.146454L7.21753 6.51042C7.41279 6.70568 7.41279 7.02226 7.21753 7.21752C7.02227 7.41278 6.70569 7.41278 6.51042 7.21752L0.146463 0.853561C-0.0487994 0.658299 -0.0487995 0.341716 0.146463 0.146454Z" fill="#505C67"/>
</svg>
