<svg width="16" height="10" viewBox="0 0 16 10" fill="none" xmlns="http://www.w3.org/2000/svg">
<path fill-rule="evenodd" clip-rule="evenodd" d="M15.5556 5C15.5556 5 12.6389 0 7.77778 0C2.91667 0 0 5 0 5C0 5 2.91667 10 7.77778 10C12.6389 10 15.5556 5 15.5556 5ZM1.14042 5C1.61051 5.66807 2.15118 6.29028 2.75431 6.85727C4.00556 8.02909 5.71667 9.09091 7.77778 9.09091C9.83889 9.09091 11.549 8.02909 12.8022 6.85727C13.4053 6.29028 13.946 5.66807 14.4161 5C13.946 4.33193 13.4053 3.70971 12.8022 3.14273C11.549 1.97091 9.83792 0.909091 7.77778 0.909091C5.71667 0.909091 4.00653 1.97091 2.75333 3.14273C2.15021 3.70971 1.6105 4.33193 1.14042 5Z" fill="#397DFB"/>
<path fill-rule="evenodd" clip-rule="evenodd" d="M7.77778 2.72727C7.13315 2.72727 6.51493 2.96672 6.05912 3.39294C5.6033 3.81916 5.34722 4.39724 5.34722 5C5.34722 5.60276 5.6033 6.18084 6.05912 6.60706C6.51493 7.03328 7.13315 7.27273 7.77778 7.27273C8.4224 7.27273 9.04062 7.03328 9.49644 6.60706C9.95226 6.18084 10.2083 5.60276 10.2083 5C10.2083 4.39724 9.95226 3.81916 9.49644 3.39294C9.04062 2.96672 8.4224 2.72727 7.77778 2.72727ZM4.375 5C4.375 4.15613 4.73351 3.34682 5.37165 2.75011C6.0098 2.15341 6.87531 1.81818 7.77778 1.81818C8.68025 1.81818 9.54576 2.15341 10.1839 2.75011C10.822 3.34682 11.1806 4.15613 11.1806 5C11.1806 5.84387 10.822 6.65318 10.1839 7.24989C9.54576 7.84659 8.68025 8.18182 7.77778 8.18182C6.87531 8.18182 6.0098 7.84659 5.37165 7.24989C4.73351 6.65318 4.375 5.84387 4.375 5Z" fill="#397DFB"/>
</svg>
