<svg width="50" height="50" viewBox="0 0 50 50" fill="none" xmlns="http://www.w3.org/2000/svg">
<path fill-rule="evenodd" clip-rule="evenodd" d="M12.8759 21.2152C10.5531 22.042 8.70956 22.8329 7.34536 23.5878C0.229404 28.4409 -1.72472 34.4802 1.51986 41.7059C7.08727 50.1178 17.1897 52.1309 31.7903 47.7452C61.6921 35.343 49.4881 3.34885 32.159 9.81957C30.3524 10.4666 28.6564 11.8327 26.9972 13.8458C23.8264 16.8295 19.1438 19.274 12.8759 21.2152Z" fill="url(#paint0_linear)"/>
<path d="M14.8637 20.328C14.4108 20.328 14.0436 20.6952 14.0436 21.1481C14.0436 21.601 14.4108 21.9681 14.8637 21.9681V20.328ZM22.4866 21.9681C22.9395 21.9681 23.3066 21.601 23.3066 21.1481C23.3066 20.6952 22.9395 20.328 22.4866 20.328V21.9681ZM14.8637 26.0022C14.4108 26.0022 14.0436 26.3694 14.0436 26.8223C14.0436 27.2752 14.4108 27.6423 14.8637 27.6423V26.0022ZM30.1362 27.6423C30.5891 27.6423 30.9562 27.2752 30.9562 26.8223C30.9562 26.3694 30.5891 26.0022 30.1362 26.0022V27.6423ZM25.6851 1.99219L26.2398 1.38823C26.0885 1.24926 25.8905 1.17214 25.6851 1.17214V1.99219ZM36 11.4661H36.82C36.82 11.2365 36.7238 11.0174 36.5547 10.8621L36 11.4661ZM36 11.7003V12.5204C36.3362 12.5204 36.6383 12.3152 36.7623 12.0026C36.8862 11.6901 36.8068 11.3336 36.562 11.1032L36 11.7003ZM25.6851 9.04556L24.865 9.04556V9.04556H25.6851ZM14.8637 21.9681H22.4866V20.328H14.8637V21.9681ZM14.8637 27.6423H30.1362V26.0022H14.8637V27.6423ZM12.305 2.81223H25.6851V1.17214H12.305V2.81223ZM25.1304 2.59615L35.4453 12.07L36.5547 10.8621L26.2398 1.38823L25.1304 2.59615ZM35.18 11.4661V31.6372H36.82V11.4661H35.18ZM35.18 31.6372C35.18 32.9359 34.073 34.0445 32.695 34.0445V35.6846C34.9418 35.6846 36.82 33.8782 36.82 31.6372H35.18ZM32.695 34.0445H12.305V35.6846H32.695V34.0445ZM12.305 34.0445C10.927 34.0445 9.82005 32.9359 9.82005 31.6372H8.17995C8.17995 33.8782 10.0582 35.6846 12.305 35.6846V34.0445ZM9.82005 31.6372V5.21956H8.17995V31.6372H9.82005ZM9.82005 5.21956C9.82005 3.92088 10.927 2.81223 12.305 2.81223V1.17214C10.0582 1.17214 8.17995 2.97854 8.17995 5.21956H9.82005ZM36 10.8803H28.4304V12.5204H36V10.8803ZM28.4304 10.8803C27.3403 10.8803 26.5051 10.0268 26.5051 9.04556H24.865C24.865 10.9794 26.482 12.5204 28.4304 12.5204V10.8803ZM26.5051 9.04556L26.5051 1.99219L24.865 1.99219L24.865 9.04556L26.5051 9.04556ZM25.1231 2.58934L35.438 12.2975L36.562 11.1032L26.2471 1.39503L25.1231 2.58934Z" fill="#373A3C"/>
<defs>
<linearGradient id="paint0_linear" x1="49.9671" y1="29.4834" x2="0.00794477" y2="29.4834" gradientUnits="userSpaceOnUse">
<stop stop-color="#E9F3FF"/>
<stop offset="1" stop-color="#AECCFE"/>
</linearGradient>
</defs>
</svg>
