<svg width="40" height="40" viewBox="0 0 40 40" fill="none" xmlns="http://www.w3.org/2000/svg">
<circle cx="20" cy="20" r="20" fill="url(#paint0_linear)"/>
<path fill-rule="evenodd" clip-rule="evenodd" d="M32 20C32 26.6274 26.6274 32 20 32C13.3726 32 8 26.6274 8 20C8 13.3726 13.3726 8 20 8C26.6274 8 32 13.3726 32 20ZM33 20C33 27.1797 27.1797 33 20 33C12.8203 33 7 27.1797 7 20C7 12.8203 12.8203 7 20 7C27.1797 7 33 12.8203 33 20ZM27 15C27 16.1046 26.1046 17 25 17C23.8954 17 23 16.1046 23 15C23 13.8954 23.8954 13 25 13C26.1046 13 27 13.8954 27 15ZM28 15C28 16.6569 26.6569 18 25 18C23.3431 18 22 16.6569 22 15C22 13.3431 23.3431 12 25 12C26.6569 12 28 13.3431 28 15Z" fill="white"/>
<circle cx="16.5" cy="22.5" r="4" stroke="white"/>
<defs>
<linearGradient id="paint0_linear" x1="3" y1="4.5" x2="34.5" y2="35" gradientUnits="userSpaceOnUse">
<stop stop-color="#0045A0"/>
<stop offset="1" stop-color="#397DFB"/>
</linearGradient>
</defs>
</svg>
