<svg width="45" height="45" viewBox="0 0 45 45" fill="none" xmlns="http://www.w3.org/2000/svg">
<circle cx="22.5" cy="22.5" r="22.5" fill="url(#paint0_linear)"/>
<path d="M15.202 18.2843L15.202 18.2843C15.4528 18.456 16.2133 18.9687 17.4864 19.8242C18.759 20.6794 19.7348 21.3384 20.4133 21.801C20.4913 21.8541 20.6522 21.9661 20.8929 22.1349L20.893 22.135C21.1324 22.303 21.3285 22.4367 21.4822 22.5372C21.6316 22.6349 21.816 22.7468 22.037 22.8732C22.2412 22.9899 22.4231 23.0715 22.5838 23.1232L22.5849 23.1236C22.7467 23.176 22.8801 23.1966 22.9888 23.1966H23.0112C23.1198 23.1966 23.2534 23.176 23.4153 23.1235L23.4162 23.1232C23.5767 23.0716 23.7587 22.9899 23.9625 22.8735C24.1838 22.7467 24.3684 22.6347 24.5178 22.5371C24.6714 22.4367 24.8672 22.3031 25.1069 22.135C25.3486 21.9653 25.5094 21.8536 25.5872 21.8007L25.5888 21.7996C26.2734 21.3378 28.0146 20.1653 30.8115 18.2825C31.3058 17.9477 31.7153 17.5465 32.0437 17.0784L32.0438 17.0782C32.3564 16.6333 32.5 16.1873 32.5 15.7317C32.5 15.396 32.3819 15.1173 32.1236 14.8695L32.1235 14.8694C31.8619 14.6184 31.5669 14.5 31.2142 14.5H14.7856C14.3325 14.5 14.0456 14.6419 13.8492 14.8804L15.202 18.2843ZM15.202 18.2843L15.1941 18.2791M15.202 18.2843L15.1941 18.2791M15.1941 18.2791C14.788 18.0123 14.3919 17.6369 14.0097 17.1416L14.0097 17.1415M15.1941 18.2791L14.0097 17.1415M14.0097 17.1415C13.6373 16.6589 13.5 16.2721 13.5 15.9696C13.5 15.5035 13.6255 15.1523 13.8492 14.8805L14.0097 17.1415ZM23.0112 23.6966C23.1823 23.6966 23.3684 23.6643 23.5693 23.5992H22.4307C22.6317 23.6643 22.8177 23.6966 22.9888 23.6966H23.0112Z" stroke="white"/>
<path d="M13 15.9043V28.2852C13 29.3372 13.8528 30.19 14.9048 30.19H31.0952C32.1472 30.19 33 29.3372 33 28.2852V15.9043H32.0476V28.2852C32.0476 28.8112 31.6212 29.2376 31.0952 29.2376H14.9048C14.3788 29.2376 13.9524 28.8112 13.9524 28.2852V15.9043H13Z" fill="white"/>
<defs>
<linearGradient id="paint0_linear" x1="3.375" y1="5.0625" x2="38.8125" y2="39.375" gradientUnits="userSpaceOnUse">
<stop stop-color="#0045A0"/>
<stop offset="1" stop-color="#397DFB"/>
</linearGradient>
</defs>
</svg>
