<svg width="40" height="40" viewBox="0 0 40 40" fill="none" xmlns="http://www.w3.org/2000/svg">
<path d="M36.2117 0H3.7883C1.69608 0 0 1.69608 0 3.7883V36.2117C0 38.3039 1.69608 40 3.7883 40H36.2117C38.3039 40 40 38.3039 40 36.2117V3.7883C40 1.69608 38.3039 0 36.2117 0Z" fill="#16509D"/>
<path d="M20 36.0442C28.8612 36.0442 36.0446 28.8608 36.0446 19.9996C36.0446 11.1385 28.8612 3.95508 20 3.95508C11.1388 3.95508 3.95544 11.1385 3.95544 19.9996C3.95544 28.8608 11.1388 36.0442 20 36.0442Z" fill="#FEFEFE"/>
<path fill-rule="evenodd" clip-rule="evenodd" d="M16.2673 15.264C16.1002 15.5983 16.3788 15.7097 16.8244 15.7097C17.3815 15.7097 17.5487 15.7097 18.0501 15.7097C18.4958 15.654 18.83 15.3754 19.1086 15.0412C19.7214 14.3169 20.7242 13.0913 21.0027 12.7013H21.1141C20.947 12.9242 19.8328 14.3169 19.22 15.0969C18.9414 15.4311 18.6629 15.654 18.2729 15.7654C18.3286 15.7654 18.44 15.8211 18.4958 15.8211C18.5515 15.8211 18.5515 15.7654 18.6072 15.7654C18.83 15.654 19.0529 15.4869 19.3314 15.1526L21.337 12.7013C21.5598 12.4228 21.7269 12.2557 21.2813 12.3114H20.947C20.7242 12.3114 20.557 12.4228 20.3342 12.7013C19.7771 13.3141 19.22 13.9827 18.7186 14.6512C18.6629 15.0969 18.44 15.4311 17.9944 15.4869C17.8272 15.5426 17.7158 15.4869 17.6044 15.4869C17.5487 15.4869 17.5487 15.4869 17.5487 15.4869C17.4373 15.3754 17.3258 15.264 17.2701 15.0969C17.2701 14.9297 17.2701 14.7626 17.2701 14.6512L16.8244 15.1526H17.1587C17.2144 15.264 17.2144 15.3754 17.3258 15.4311H16.6573C16.1002 15.4869 16.323 15.2083 16.6016 14.9297L17.4373 13.8713L17.493 14.7626C17.493 15.0412 17.5487 15.3197 17.9386 15.3197C18.1058 15.3197 18.2729 15.264 18.3843 15.1526C18.5515 14.9855 18.5515 14.7069 18.5515 14.4284C18.6072 13.7598 18.6072 13.0913 18.6072 12.4228C18.6072 12.3114 18.6072 12.2557 18.44 12.2557C18.3286 12.2557 18.2172 12.2557 18.1615 12.2557C17.8272 12.2557 17.6044 12.5899 17.3815 12.8128C16.6573 13.7041 15.9331 14.5955 15.2088 15.4869C15.0974 15.654 15.0417 15.7097 15.0417 15.7654C15.0417 15.8211 15.0417 15.8211 15.0417 15.8211C15.0417 15.8768 15.1531 15.8768 15.2646 15.8768C15.2646 15.8768 15.2646 15.8768 15.3203 15.8768V15.8211C15.4874 15.5983 15.7102 15.3754 15.8774 15.1526C16.0445 15.1526 16.1559 15.2083 16.2673 15.264ZM17.5487 10.2501C17.6044 10.1944 17.6601 10.1387 17.7158 10.083L17.7715 10.1944C17.7158 10.1944 17.6601 10.2501 17.6044 10.3058C17.3258 10.5286 17.103 10.6958 16.8244 10.4172C17.103 10.5286 17.2701 10.4729 17.5487 10.2501ZM18.1615 15.0969C18.1058 15.0969 18.1058 15.1526 18.0501 15.0969C18.2172 14.874 18.2729 14.874 18.2729 14.5955C18.2729 14.5398 18.2729 14.5398 18.2729 14.4841V12.7013H18.3843V14.4284V14.4841C18.3843 14.8183 18.3843 14.8183 18.1615 15.0969ZM14.8189 16.044C14.7632 16.2111 14.8746 16.3225 15.2646 16.3225L17.8272 16.3782C18.2729 16.3782 18.6072 16.3225 18.8857 16.2111C19.0529 16.1554 19.1643 16.044 19.3314 15.9325C19.3314 15.9325 19.3871 15.9325 19.4428 15.9325L21.0584 14.1498H21.1698H23.7325H23.6768L23.454 14.4284H21.2813L20.8913 14.9297H22.6183H22.8412L22.7854 15.0412L22.6183 15.2083H20.6127L20.0556 15.8768H22.2841L22.0055 16.1554H19.4428L19.3314 16.3225H19.2757H19.3314L22.1169 16.3782C22.1169 16.3782 22.1726 16.3782 22.1726 16.3225L22.3398 16.0997C22.3398 16.0997 22.3955 16.0997 22.3398 16.0997C22.8969 16.044 23.3983 15.9882 23.8997 15.9325L25.0696 14.4284H23.8439L24.1225 14.1498H27.0194L26.7409 14.4284H25.571L24.1782 16.1554H23.8439L23.7325 16.2668C23.7325 16.3225 23.7325 16.3225 23.7325 16.3225H24.3453L24.791 15.7097C26.908 15.1526 27.9108 14.0384 27.0194 12.7013C26.8523 12.4228 26.6295 12.1999 26.4066 11.9771H11.5877C11.5877 11.9214 11.5877 11.9214 11.5877 11.8657H19.2757L22.2841 9.91582C21.7269 9.74869 21.1141 9.58156 20.5013 9.47014L20.8913 8.46735C20.947 8.30022 20.947 8.13309 20.8356 8.02167C20.8356 8.02167 20.8356 7.96596 20.7799 7.96596C20.7799 8.02167 20.7799 8.13309 20.7242 8.24451L19.8328 10.9186C19.7771 11.0857 19.7214 11.1972 19.61 11.3086C19.3871 11.5871 19.1086 11.7543 18.7743 11.7543C18.3843 11.81 18.0501 11.81 17.6601 11.81C17.103 11.81 16.6016 11.81 16.0445 11.81C15.8774 11.81 15.7102 11.81 15.5988 11.7543C15.376 11.6985 15.2646 11.5314 15.376 11.1414L15.7659 10.1387C15.2646 10.5843 14.7632 11.03 14.2618 11.42C13.9832 11.6985 13.8161 11.8657 13.3147 11.8657H12.869C12.7576 11.8657 12.5905 11.81 12.5347 11.5871C12.4233 11.3086 12.8133 11.03 12.9804 10.8629L14.2618 9.69298C14.3732 9.58156 14.5403 9.47014 14.6517 9.41443C12.0891 9.86011 10.9191 11.03 11.8105 12.4785C12.2005 13.0913 12.869 13.6484 13.7604 14.1498C14.2618 14.4284 14.7632 14.7069 15.3203 14.9297C15.9331 14.2055 16.4902 13.4813 17.103 12.757C17.3258 12.4785 17.6601 12.0885 18.0501 12.0328C18.1058 11.9771 18.1615 11.9771 18.2172 11.9771C18.3843 11.9771 18.6072 11.9771 18.7743 12.0328C18.83 12.0885 18.8857 12.1442 18.9414 12.1999C18.9414 12.2557 18.9414 12.3671 18.9414 12.4785C18.9414 12.4785 18.9414 12.4785 18.9414 12.5342C18.9414 12.9799 18.9414 13.4256 18.9414 13.927L19.4428 13.3141C19.61 13.0913 19.8328 12.8685 19.9999 12.6456C20.2228 12.3671 20.3899 12.1999 20.6127 12.0885C20.7242 12.0328 20.8913 12.0328 21.0027 12.0328H21.2813C21.7827 12.0328 21.9498 12.0885 21.9498 12.3114C21.9498 12.4785 21.6712 12.7013 21.5598 12.8685L19.4985 15.3197C19.22 15.7097 18.9971 15.8768 18.7186 15.9882C18.44 16.1554 18.0501 16.1554 17.5487 16.1554H15.2088C15.0417 16.1554 14.9303 16.0997 14.8189 16.044ZM26.2395 11.8657C25.9609 11.6428 25.6824 11.42 25.3481 11.1972L25.2924 11.1414L27.5765 10.0272C27.6322 10.0272 27.5765 9.97153 27.5765 9.97153H27.1308L25.0139 10.9743L25.4038 11.8657H26.2395ZM25.0139 10.5843L24.791 9.97153H24.5125L24.8467 10.6401L25.0139 10.5843ZM24.0111 9.97153H23.8997L24.1782 10.5843C23.7325 10.4172 23.2868 10.2501 22.7854 10.083L22.4512 11.81L24.401 10.8629L24.0111 9.97153ZM21.9498 11.8657H19.7771L20.6127 11.3086L22.0055 11.3643L21.9498 11.8657ZM22.0612 11.0857L22.2283 10.3058L21.0584 11.0857H22.0612ZM24.8467 11.8657H23.1754L24.5682 11.1972L24.8467 11.8657ZM17.9944 8.85732C18.0501 8.69019 18.1615 8.52306 18.1615 8.35593C18.2172 8.1888 18.2172 8.02167 18.1058 7.91025C18.0501 7.85454 17.9944 7.85454 17.9386 7.79883C17.9944 7.91025 17.9944 7.96596 17.9944 8.07738C17.9386 8.46735 17.7158 8.85732 17.6044 9.13588C17.7158 9.08017 17.8829 8.96874 17.9944 8.85732ZM19.9442 8.24451C19.7214 8.35593 19.5542 8.46735 19.3871 8.57877C19.0529 8.80161 18.7743 9.02445 18.4958 9.2473C18.7186 9.2473 18.9414 9.2473 19.1643 9.30301C18.7186 9.63727 18.2729 9.97153 17.8272 10.3058C17.6044 10.4729 17.3258 10.7515 16.9916 10.6958C16.9359 10.6958 16.8802 10.6958 16.8802 10.6401C16.7687 10.5843 16.6573 10.4729 16.6573 10.3615C16.6573 10.3058 16.713 10.1944 16.8244 10.1387C16.8802 10.0272 16.9916 9.97153 17.103 9.86011C17.493 9.63727 17.8272 9.35872 18.2172 9.08017C18.5515 8.80161 18.9414 8.52306 19.3314 8.30022C19.61 8.07738 19.8885 7.91025 20.2228 7.91025C20.3899 7.91025 20.5013 7.91025 20.4456 8.13309C20.3899 8.30022 20.3342 8.52306 20.2785 8.69019L19.5542 10.8629C19.3871 11.1972 19.1643 11.3643 18.7186 11.42C18.5515 11.4757 18.3843 11.4757 18.1615 11.4757H15.8774C15.6545 11.4757 15.5988 11.42 15.6545 11.1972L16.0445 10.1944L16.4345 9.2473C15.5988 9.86011 14.8746 10.5843 14.0946 11.1972C14.0389 11.2529 13.9832 11.3086 13.8718 11.3643C13.8161 11.42 13.7047 11.4757 13.5932 11.4757C13.5375 11.5314 13.4818 11.5314 13.3704 11.5314H12.9804C12.869 11.5314 12.8133 11.42 12.9247 11.3086C13.0919 11.0857 13.3704 10.9186 13.5375 10.7515C14.5403 9.91582 15.4874 9.08017 16.4902 8.30022C16.7687 8.07738 17.103 7.85454 17.493 7.91025C17.7158 7.91025 17.7158 8.07738 17.6601 8.24451L17.103 9.63727C17.0473 9.69298 16.9359 9.74869 16.8802 9.8044L17.493 8.30022C17.493 8.24451 17.493 8.1888 17.493 8.1888C17.4373 8.13309 17.2144 8.1888 17.1587 8.1888C16.9916 8.24451 16.8244 8.41164 16.6573 8.52306H16.6016L15.9888 9.02445L14.1503 10.4729C14.1503 10.5286 14.1503 10.5286 14.1503 10.5286C14.1503 10.5843 14.1503 10.5843 14.1503 10.5843C14.2061 10.6401 14.2061 10.6401 14.2618 10.5843L15.9331 9.2473C16.2673 9.19159 16.6573 9.19159 16.9916 9.19159L16.6573 9.97153C16.4902 10.1387 16.4345 10.3058 16.4345 10.4729C16.4902 10.5843 16.6573 10.7515 16.7687 10.8072C16.8244 10.8629 16.8802 10.8629 16.9359 10.8629C17.3258 10.9743 17.6044 10.6958 17.8829 10.4729L18.6072 9.91582L18.3286 10.6401C18.2172 10.6401 18.1058 10.6401 17.9944 10.6401C17.8829 10.7515 17.7715 10.8072 17.6601 10.9186C17.9386 10.9186 18.2172 10.9186 18.4958 10.9186C18.6072 10.9186 18.6629 10.8629 18.6629 10.8072C18.7186 10.6958 18.7743 10.5843 18.7743 10.4729L19.22 9.30301C19.3871 9.30301 19.5542 9.35872 19.7771 9.35872L19.2757 10.8072C19.2757 10.8629 19.2757 10.8629 19.3314 10.8629C19.3314 10.8629 19.3871 10.8629 19.3871 10.8072L20.2228 8.35593C20.2785 8.35593 20.2785 8.24451 20.2785 8.24451C20.2228 8.13309 19.9999 8.24451 19.9442 8.24451Z" fill="#16509D"/>
<path fill-rule="evenodd" clip-rule="evenodd" d="M27.1866 10.752C27.0194 10.752 26.8523 10.9191 26.8523 11.0862C26.8523 11.2533 27.0194 11.4205 27.1866 11.4205C27.3537 11.4205 27.5208 11.2533 27.5208 11.0862C27.5208 10.9191 27.3537 10.752 27.1866 10.752ZM27.1866 11.3091C27.0751 11.3091 26.9637 11.2533 26.9637 11.0862C26.9637 10.9748 27.0751 10.8634 27.1866 10.8634C27.298 10.8634 27.4094 10.9748 27.4094 11.0862C27.4094 11.2533 27.298 11.3091 27.1866 11.3091ZM27.298 11.0305C27.298 10.9748 27.2423 10.9748 27.1866 10.9748H27.0751V11.2533H27.1308V11.1419H27.1866L27.2423 11.2533H27.3537L27.2423 11.1419C27.298 11.1419 27.298 11.0862 27.298 11.0305ZM27.1866 11.0862H27.1308V11.0305H27.1866C27.2423 11.0305 27.2423 11.0305 27.2423 11.0305C27.2423 11.0862 27.2423 11.0862 27.1866 11.0862Z" fill="#16509D"/>
<path d="M20.5014 21.2818H17.2145V30.2512H14.9861V21.2818H11.6992V19.4434H20.5014V21.2818Z" fill="#16509D"/>
<path d="M21.3928 30.2512V19.4434H25.1811C26.5182 19.4434 27.4652 19.7219 28.1895 20.2233C28.858 20.7247 29.1923 21.4489 29.1923 22.4517C29.1923 22.9531 29.0251 23.4545 28.7466 23.8445C28.5237 24.2344 28.1338 24.513 27.6324 24.7358C28.1895 24.8473 28.6352 25.1258 28.9694 25.5715C29.248 25.9615 29.4151 26.5186 29.4151 27.0757C29.4151 28.1342 29.0808 28.9141 28.4123 29.4712C27.7438 29.9726 26.7967 30.2512 25.5711 30.2512H21.3928ZM23.6212 25.5715V28.4684H25.5154C26.0725 28.4684 26.4625 28.357 26.741 28.1342C27.0753 27.8556 27.1867 27.5214 27.1867 27.0757C27.1867 26.0729 26.6853 25.5715 25.6825 25.5715H23.6212ZM23.6212 24.0116H25.2925C26.4068 23.9559 26.9639 23.5102 26.9639 22.6746C26.9639 22.1732 26.7967 21.8389 26.5182 21.6161C26.2396 21.3932 25.7939 21.2818 25.1811 21.2818H23.6212V24.0116Z" fill="#16509D"/>
<path d="M11.8106 17.5494V17.6051H11.4764H11.4207V17.5494V16.9923C11.4207 16.9366 11.4207 16.9366 11.4207 16.9366H11.4764H11.8106C11.8106 16.9923 11.8106 16.9923 11.8106 16.9923V17.048H11.5321V17.2151H11.7549C11.7549 17.2151 11.7549 17.2151 11.7549 17.2708V17.3265H11.5321V17.4937H11.8106C11.8106 17.5494 11.8106 17.5494 11.8106 17.5494ZM12.5349 17.7722H12.4792H12.4234V17.6051H11.9778V17.7722C11.9778 17.7722 11.9778 17.7722 11.922 17.7722C11.8663 17.7722 11.8663 17.7722 11.8663 17.7722V17.4937H11.922V17.438C11.922 17.438 11.922 17.438 11.922 17.3823C11.922 17.3823 11.9778 17.3823 11.9778 17.3265V17.2708C11.9778 17.2151 11.9778 17.1594 11.9778 17.1594C12.0335 17.1037 12.0335 17.048 12.0335 16.9923C12.0335 16.9366 12.0335 16.9366 12.0335 16.9366C12.0335 16.9366 12.0335 16.9366 12.0892 16.9366H12.4234C12.4234 16.9366 12.4234 16.9366 12.4234 16.9923V17.4937H12.4792C12.5349 17.4937 12.5349 17.4937 12.5349 17.4937V17.7722ZM12.312 17.048H12.1449C12.1449 17.1037 12.1449 17.1594 12.1449 17.1594C12.1449 17.2151 12.1449 17.2708 12.0892 17.2708C12.0892 17.3265 12.0892 17.3265 12.0892 17.3823C12.0892 17.3823 12.0892 17.3823 12.0892 17.438C12.0892 17.438 12.0892 17.438 12.0335 17.438C12.0335 17.4937 12.0335 17.4937 12.0335 17.4937H12.312V17.048ZM13.1477 17.6051C13.092 17.6051 13.092 17.6051 13.092 17.6051C13.0363 17.6051 13.0363 17.6051 13.0363 17.6051H12.9805V17.2151C12.9805 17.1594 12.9805 17.1594 12.9805 17.1594C12.9805 17.1594 12.9805 17.1594 12.9805 17.2151L12.702 17.6051H12.6463C12.5906 17.6051 12.5906 17.6051 12.5906 17.6051V16.9366H12.6463C12.702 16.9366 12.702 16.9366 12.702 16.9366H12.7577V17.3265C12.7577 17.3265 12.7577 17.3265 12.702 17.3265V17.3823C12.7577 17.3823 12.7577 17.3265 12.7577 17.3265C12.7577 17.3265 12.7577 17.3265 12.7577 17.2708L13.0363 16.9366C13.0363 16.9366 13.0363 16.9366 13.092 16.9366C13.092 16.9366 13.092 16.9366 13.1477 16.9366V17.6051ZM13.7605 17.6051H13.7048C13.6491 17.6051 13.6491 17.6051 13.6491 17.6051V17.3265H13.3705V17.6051H13.3148C13.2591 17.6051 13.2591 17.6051 13.2591 17.6051V16.9366C13.2591 16.9366 13.2591 16.9366 13.3148 16.9366H13.3705V17.2151H13.6491V16.9366C13.6491 16.9366 13.6491 16.9366 13.7048 16.9366H13.7605V17.6051ZM14.3733 17.4937C14.3733 17.5494 14.3733 17.5494 14.3733 17.5494C14.3176 17.5494 14.3176 17.5494 14.3176 17.5494C14.3176 17.6051 14.3176 17.6051 14.2619 17.6051C14.2619 17.6051 14.2619 17.6051 14.2062 17.6051C14.2062 17.6051 14.2062 17.6051 14.1505 17.6051C14.0947 17.6051 14.0947 17.6051 14.039 17.6051C13.9833 17.5494 13.9833 17.5494 13.9276 17.5494C13.9276 17.4937 13.9276 17.438 13.8719 17.438C13.8719 17.3823 13.8719 17.3265 13.8719 17.2708C13.8719 17.2151 13.8719 17.1594 13.8719 17.1037C13.9276 17.1037 13.9276 17.048 13.9833 16.9923L14.039 16.9366C14.0947 16.9366 14.1505 16.9366 14.2062 16.9366C14.2619 16.9366 14.2619 16.9366 14.2619 16.9366C14.3176 16.9366 14.3176 16.9366 14.3176 16.9366V16.9923C14.3733 16.9923 14.3733 16.9923 14.3733 16.9923V17.048C14.3733 17.048 14.3733 17.048 14.3733 17.1037H14.3176V17.048C14.2619 17.048 14.2619 17.048 14.2619 17.048C14.2062 17.048 14.2062 17.048 14.2062 17.048C14.1505 17.048 14.1505 17.048 14.0947 17.048C14.0947 17.048 14.0947 17.1037 14.039 17.1037V17.1594C14.039 17.2151 14.039 17.2151 14.039 17.2708C14.039 17.3265 14.039 17.3265 14.039 17.3823V17.438C14.0947 17.438 14.0947 17.4937 14.0947 17.4937C14.1505 17.4937 14.1505 17.4937 14.2062 17.4937C14.2062 17.4937 14.2062 17.4937 14.2619 17.4937C14.2619 17.4937 14.2619 17.4937 14.3176 17.4937C14.3176 17.438 14.3176 17.438 14.3176 17.438C14.3733 17.438 14.3733 17.438 14.3733 17.438C14.3733 17.438 14.3733 17.438 14.3733 17.4937ZM14.8747 16.9923V17.048H14.7076V17.6051C14.7076 17.6051 14.7076 17.6051 14.6519 17.6051C14.5961 17.6051 14.5961 17.6051 14.5961 17.6051C14.5404 17.6051 14.5404 17.6051 14.5404 17.6051V17.048H14.3733V16.9923C14.3733 16.9923 14.3733 16.9923 14.3733 16.9366H14.8747C14.8747 16.9923 14.8747 16.9923 14.8747 16.9923ZM15.4318 17.3823C15.4318 17.438 15.4318 17.438 15.4318 17.438C15.3761 17.4937 15.3761 17.4937 15.3761 17.4937C15.3761 17.5494 15.3761 17.5494 15.3204 17.5494C15.3204 17.5494 15.3204 17.5494 15.2647 17.6051C15.2647 17.6051 15.2647 17.6051 15.209 17.6051H15.1532H14.9861H14.9304V17.5494V16.9923C14.9304 16.9366 14.9304 16.9366 14.9304 16.9366H14.9861H15.1532C15.209 16.9366 15.209 16.9366 15.2647 16.9366C15.2647 16.9366 15.3204 16.9366 15.3204 16.9923C15.3204 16.9923 15.3761 16.9923 15.3761 17.048C15.3761 17.048 15.3761 17.048 15.3761 17.1037V17.1594C15.3204 17.2151 15.3204 17.2151 15.3204 17.2151C15.3204 17.2151 15.3204 17.2151 15.2647 17.2151C15.3204 17.2151 15.3204 17.2708 15.3204 17.2708C15.3761 17.2708 15.3761 17.2708 15.3761 17.2708C15.3761 17.3265 15.3761 17.3265 15.4318 17.3265C15.4318 17.3823 15.4318 17.3823 15.4318 17.3823ZM15.2647 17.1037C15.2647 17.1037 15.2647 17.1037 15.209 17.1037C15.209 17.048 15.209 17.048 15.209 17.048C15.1532 17.048 15.1532 17.048 15.1532 17.048H15.0418V17.2151H15.1532C15.1532 17.2151 15.1532 17.2151 15.209 17.2151C15.209 17.2151 15.209 17.2151 15.209 17.1594C15.209 17.1594 15.209 17.1594 15.2647 17.1594V17.1037ZM15.2647 17.3823C15.2647 17.3265 15.2647 17.3265 15.2647 17.3265H15.209H15.1532H15.0418V17.4937H15.1532C15.209 17.4937 15.209 17.4937 15.209 17.4937H15.2647C15.2647 17.438 15.2647 17.438 15.2647 17.438C15.2647 17.438 15.2647 17.438 15.2647 17.3823ZM16.1003 17.2708C16.1003 17.3265 16.1003 17.3823 16.1003 17.3823C16.0446 17.438 16.0446 17.4937 16.0446 17.4937C15.9889 17.5494 15.9332 17.5494 15.9332 17.6051C15.8775 17.6051 15.8218 17.6051 15.7661 17.6051C15.7103 17.6051 15.7103 17.6051 15.6546 17.6051C15.5989 17.5494 15.5989 17.5494 15.5432 17.5494C15.5432 17.4937 15.4875 17.438 15.4875 17.438C15.4875 17.3823 15.4875 17.3265 15.4875 17.2708C15.4875 17.2151 15.4875 17.1594 15.4875 17.1037C15.4875 17.1037 15.5432 17.048 15.5432 16.9923C15.5989 16.9923 15.5989 16.9366 15.6546 16.9366C15.7103 16.9366 15.7661 16.9366 15.7661 16.9366C15.8218 16.9366 15.8775 16.9366 15.9332 16.9366C15.9889 16.9366 15.9889 16.9923 16.0446 16.9923C16.0446 17.048 16.0446 17.048 16.1003 17.1037C16.1003 17.1594 16.1003 17.2151 16.1003 17.2708ZM15.9332 17.2708C15.9332 17.2151 15.9332 17.2151 15.9332 17.1594V17.1037C15.9332 17.048 15.8775 17.048 15.8775 17.048C15.8218 17.048 15.8218 17.048 15.7661 17.048H15.7103L15.6546 17.1037C15.6546 17.1037 15.6546 17.1594 15.5989 17.1594C15.5989 17.2151 15.5989 17.2151 15.5989 17.2708C15.5989 17.2708 15.5989 17.3265 15.5989 17.3823C15.6546 17.3823 15.6546 17.438 15.6546 17.438C15.6546 17.438 15.6546 17.4937 15.7103 17.4937H15.7661C15.8218 17.4937 15.8218 17.4937 15.8775 17.4937L15.9332 17.438C15.9332 17.3823 15.9332 17.3823 15.9332 17.3823C15.9332 17.3265 15.9332 17.2708 15.9332 17.2708ZM16.9917 17.7722H16.936H16.8803V17.6051H16.4346V17.5494V16.9366H16.4903H16.546V17.4937H16.7688V16.9366H16.8246C16.8246 16.9366 16.8246 16.9366 16.8803 16.9366C16.8803 16.9366 16.8803 16.9366 16.936 16.9366V17.4937H16.9917V17.7722ZM17.6045 17.6051C17.5488 17.6051 17.5488 17.6051 17.5488 17.6051C17.5488 17.6051 17.5488 17.6051 17.4931 17.6051V17.2151C17.4931 17.1594 17.4931 17.1594 17.4931 17.1594C17.4931 17.1594 17.4931 17.1594 17.4374 17.2151L17.2145 17.6051C17.2145 17.6051 17.2145 17.6051 17.1588 17.6051C17.1031 17.6051 17.1031 17.6051 17.1031 17.6051V16.9366H17.1588C17.2145 16.9366 17.2145 16.9366 17.2145 16.9366V17.3265V17.3823V17.3265C17.2702 17.3265 17.2702 17.3265 17.2702 17.2708L17.4931 16.9366H17.5488H17.6045V17.6051ZM18.3844 17.2708V17.3265C18.3844 17.3823 18.3287 17.3823 18.3287 17.438C18.3287 17.438 18.273 17.438 18.2173 17.4937C18.2173 17.4937 18.1616 17.4937 18.1059 17.4937V17.6051C18.0502 17.6051 18.0502 17.6051 18.0502 17.6051C18.0502 17.6051 18.0502 17.6051 17.9945 17.6051V17.4937C17.9388 17.4937 17.883 17.4937 17.883 17.4937C17.8273 17.4937 17.8273 17.438 17.7716 17.438L17.7159 17.3823C17.7159 17.3265 17.7159 17.2708 17.7159 17.2708C17.7159 17.2151 17.7159 17.1594 17.7159 17.1594C17.7159 17.1037 17.7716 17.1037 17.7716 17.048C17.8273 17.048 17.8273 17.048 17.883 16.9923C17.883 16.9923 17.9388 16.9923 17.9945 16.9923V16.9366V16.8809C18.0502 16.8809 18.0502 16.8809 18.0502 16.8809C18.0502 16.8809 18.0502 16.8809 18.1059 16.8809V16.9366V16.9923C18.1616 16.9923 18.2173 16.9923 18.2173 16.9923C18.273 17.048 18.3287 17.048 18.3287 17.048C18.3287 17.1037 18.3844 17.1037 18.3844 17.1594C18.3844 17.1594 18.3844 17.2151 18.3844 17.2708ZM18.273 17.2708C18.273 17.2151 18.273 17.2151 18.273 17.2151C18.273 17.1594 18.2173 17.1594 18.2173 17.1594C18.2173 17.1594 18.2173 17.1037 18.1616 17.1037C18.1616 17.1037 18.1616 17.1037 18.1059 17.1037V17.3823C18.1616 17.3823 18.1616 17.3823 18.1616 17.3823C18.2173 17.3823 18.2173 17.3823 18.2173 17.3265H18.273C18.273 17.2708 18.273 17.2708 18.273 17.2708ZM17.9945 17.1037C17.9388 17.1037 17.9388 17.1037 17.9388 17.1037C17.883 17.1037 17.883 17.1594 17.883 17.1594C17.883 17.1594 17.883 17.1594 17.8273 17.2151C17.8273 17.2151 17.8273 17.2151 17.8273 17.2708C17.8273 17.2708 17.8273 17.2708 17.8273 17.3265C17.883 17.3265 17.883 17.3265 17.883 17.3265C17.883 17.3823 17.883 17.3823 17.9388 17.3823C17.9388 17.3823 17.9388 17.3823 17.9945 17.3823V17.1037ZM18.9415 17.1594V17.2151C18.8858 17.2708 18.8858 17.2708 18.8858 17.3265C18.8301 17.3265 18.8301 17.3265 18.7744 17.3265C18.7744 17.3823 18.7187 17.3823 18.663 17.3823H18.6073V17.6051C18.5516 17.6051 18.5516 17.6051 18.5516 17.6051C18.5516 17.6051 18.5516 17.6051 18.4959 17.6051V16.9923C18.4959 16.9366 18.4959 16.9366 18.4959 16.9366C18.4959 16.9366 18.4959 16.9366 18.5516 16.9366H18.663C18.7187 16.9366 18.7187 16.9366 18.7187 16.9366H18.7744H18.8301C18.8858 16.9923 18.8858 16.9923 18.8858 16.9923L18.9415 17.048C18.9415 17.1037 18.9415 17.1037 18.9415 17.1594ZM18.7744 17.1594C18.7744 17.1037 18.7744 17.1037 18.7744 17.1037C18.7744 17.048 18.7744 17.048 18.7744 17.048C18.7187 17.048 18.7187 17.048 18.7187 17.048H18.663H18.6073V17.2708H18.663C18.7187 17.2708 18.7187 17.2708 18.7187 17.2708C18.7744 17.2708 18.7744 17.2151 18.7744 17.2151C18.7744 17.1594 18.7744 17.1594 18.7744 17.1594ZM19.6101 17.2708C19.6101 17.3265 19.6101 17.3823 19.6101 17.3823C19.6101 17.438 19.5544 17.4937 19.5544 17.4937C19.4986 17.5494 19.4986 17.5494 19.4429 17.6051C19.3872 17.6051 19.3315 17.6051 19.2758 17.6051C19.2201 17.6051 19.2201 17.6051 19.1644 17.6051C19.1087 17.5494 19.1087 17.5494 19.053 17.5494C19.053 17.4937 18.9973 17.438 18.9973 17.438C18.9973 17.3823 18.9973 17.3265 18.9973 17.2708C18.9973 17.2151 18.9973 17.1594 18.9973 17.1037C18.9973 17.1037 19.053 17.048 19.053 16.9923C19.1087 16.9923 19.1087 16.9366 19.1644 16.9366C19.2201 16.9366 19.2758 16.9366 19.3315 16.9366C19.3872 16.9366 19.3872 16.9366 19.4429 16.9366C19.4986 16.9366 19.4986 16.9923 19.5544 16.9923C19.5544 17.048 19.6101 17.048 19.6101 17.1037C19.6101 17.1594 19.6101 17.2151 19.6101 17.2708ZM19.4986 17.2708C19.4986 17.2151 19.4986 17.2151 19.4429 17.1594V17.1037C19.4429 17.048 19.3872 17.048 19.3872 17.048H19.3315C19.2758 17.048 19.2201 17.048 19.2201 17.048L19.1644 17.1037V17.1594C19.1087 17.2151 19.1087 17.2151 19.1087 17.2708C19.1087 17.2708 19.1087 17.3265 19.1644 17.3823V17.438L19.2201 17.4937H19.2758C19.3315 17.4937 19.3872 17.4937 19.3872 17.4937L19.4429 17.438C19.4429 17.3823 19.4429 17.3823 19.4429 17.3823C19.4986 17.3265 19.4986 17.2708 19.4986 17.2708ZM20.1672 17.3823C20.1672 17.438 20.1672 17.438 20.1672 17.438C20.1672 17.4937 20.1672 17.4937 20.1672 17.4937C20.1672 17.5494 20.1115 17.5494 20.1115 17.5494C20.1115 17.5494 20.0558 17.5494 20.0558 17.6051H20H19.9443H19.7772C19.7215 17.6051 19.7215 17.6051 19.7215 17.6051V17.5494V16.9923C19.7215 16.9366 19.7215 16.9366 19.7215 16.9366C19.7215 16.9366 19.7215 16.9366 19.7772 16.9366H19.9443H20C20.0558 16.9366 20.0558 16.9366 20.1115 16.9923C20.1115 16.9923 20.1115 16.9923 20.1115 17.048C20.1672 17.048 20.1672 17.048 20.1672 17.1037V17.1594H20.1115C20.1115 17.2151 20.1115 17.2151 20.1115 17.2151H20.0558L20.1115 17.2708H20.1672C20.1672 17.3265 20.1672 17.3265 20.1672 17.3265C20.1672 17.3823 20.1672 17.3823 20.1672 17.3823ZM20 17.1037C20 17.048 20 17.048 20 17.048C20 17.048 20 17.048 19.9443 17.048C19.9443 17.048 19.9443 17.048 19.8886 17.048H19.8329V17.2151H19.9443C20 17.2151 20 17.2151 20 17.1594V17.1037ZM20.0558 17.3823C20.0558 17.3265 20.0558 17.3265 20 17.3265C19.9443 17.3265 19.9443 17.3265 19.9443 17.3265H19.8329V17.4937H19.9443H20C20.0558 17.438 20.0558 17.438 20.0558 17.438C20.0558 17.438 20.0558 17.438 20.0558 17.3823Z" fill="#16509D"/>
<path d="M21.0028 17.6043H20.9471C20.9471 17.6043 20.9471 17.6043 20.8914 17.6043H20.8357V16.9357H20.8914C20.9471 16.9357 20.9471 16.9357 20.9471 16.9357H21.0028V17.6043ZM20.78 17.3814C20.78 17.3814 20.78 17.4371 20.7242 17.4371C20.7242 17.4928 20.7242 17.4928 20.7242 17.5485C20.6685 17.5485 20.6685 17.5485 20.6128 17.6043C20.5571 17.6043 20.5571 17.6043 20.5014 17.6043H20.3343C20.3343 17.6043 20.3343 17.6043 20.2786 17.6043C20.2786 17.6043 20.2786 17.6043 20.2786 17.5485V16.9357C20.2786 16.9357 20.2786 16.9357 20.3343 16.9357H20.39V17.1586H20.5014C20.5571 17.1586 20.6128 17.1586 20.6128 17.2143C20.6685 17.2143 20.6685 17.2143 20.6685 17.2143C20.7242 17.27 20.7242 17.27 20.7242 17.27C20.78 17.3257 20.78 17.3257 20.78 17.3814ZM20.6128 17.3814C20.6128 17.3814 20.6128 17.3814 20.6128 17.3257C20.5571 17.3257 20.5571 17.27 20.5571 17.27H20.5014H20.39V17.4928H20.5014H20.5571C20.5571 17.4928 20.5571 17.4928 20.6128 17.4371V17.3814ZM21.5599 17.5485C21.5599 17.6043 21.5599 17.6043 21.5599 17.6043C21.5599 17.6043 21.5599 17.6043 21.5042 17.6043C21.5042 17.6043 21.5042 17.6043 21.4485 17.6043L21.3371 17.3257L21.1699 17.6043C21.1142 17.6043 21.1142 17.6043 21.1142 17.6043H21.0585C21.0585 17.6043 21.0585 17.6043 21.0585 17.5485L21.2256 17.27L21.0585 16.9914V16.9357C21.1142 16.9357 21.1142 16.9357 21.1142 16.9357H21.1699C21.1699 16.9357 21.1699 16.9357 21.2256 16.9357L21.3371 17.1586L21.4485 16.9357C21.5042 16.9357 21.5042 16.9357 21.5042 16.9357H21.5599V16.9914L21.3928 17.27L21.5599 17.5485ZM22.2841 16.9914V17.0472H22.117V17.6043C22.0613 17.6043 22.0613 17.6043 22.0613 17.6043C22.0613 17.6043 22.0613 17.6043 22.0056 17.6043V17.0472H21.8385H21.7827V16.9914C21.7827 16.9914 21.7827 16.9914 21.7827 16.9357H21.8385H22.2841C22.2841 16.9914 22.2841 16.9914 22.2841 16.9914ZM22.7855 17.5485C22.7855 17.5485 22.7855 17.6043 22.7298 17.6043H22.3956V17.5485V16.9914C22.3956 16.9357 22.3956 16.9357 22.3956 16.9357H22.7298H22.7855C22.7855 16.9914 22.7855 16.9914 22.7855 16.9914L22.7298 17.0472H22.507V17.2143H22.7298C22.7298 17.2143 22.7298 17.2143 22.7298 17.27V17.3257H22.507V17.4928H22.7298C22.7855 17.4928 22.7855 17.4928 22.7855 17.4928C22.7855 17.5485 22.7855 17.5485 22.7855 17.5485ZM23.3426 17.5485C23.3426 17.6043 23.3426 17.6043 23.3426 17.6043C23.2869 17.6043 23.2869 17.6043 23.2869 17.6043H23.2312C23.1755 17.6043 23.1755 17.6043 23.1755 17.6043L23.0641 17.3257L22.9527 17.6043C22.8969 17.6043 22.8969 17.6043 22.8969 17.6043C22.8412 17.6043 22.8412 17.6043 22.8412 17.6043H22.7855C22.7855 17.6043 22.7855 17.6043 22.7855 17.5485C22.7855 17.5485 22.7855 17.5485 22.8412 17.5485L22.9527 17.27L22.8412 16.9914V16.9357C22.8412 16.9357 22.8412 16.9357 22.8969 16.9357C22.8969 16.9357 22.8969 16.9357 22.9527 16.9357L23.0641 17.1586L23.1755 16.9357C23.1755 16.9357 23.1755 16.9357 23.2312 16.9357C23.2312 16.9357 23.2312 16.9357 23.2869 16.9357C23.3426 16.9357 23.3426 16.9357 23.3426 16.9357V16.9914L23.1755 17.27L23.3426 17.5485ZM23.9554 17.6043H23.8997C23.8997 17.6043 23.8997 17.6043 23.844 17.6043C23.844 17.6043 23.844 17.6043 23.7883 17.6043V17.3257H23.5655V17.6043C23.5098 17.6043 23.5098 17.6043 23.5098 17.6043C23.4541 17.6043 23.4541 17.6043 23.4541 17.6043C23.3983 17.6043 23.3983 17.6043 23.3983 17.6043V16.9357C23.3983 16.9357 23.3983 16.9357 23.4541 16.9357C23.4541 16.9357 23.4541 16.9357 23.5098 16.9357C23.5098 16.9357 23.5098 16.9357 23.5655 16.9357V17.2143H23.7883V16.9357C23.844 16.9357 23.844 16.9357 23.844 16.9357C23.8997 16.9357 23.8997 16.9357 23.8997 16.9357H23.9554V17.6043ZM24.6797 17.27C24.6797 17.3257 24.624 17.3814 24.624 17.3814C24.624 17.4371 24.624 17.4928 24.5683 17.4928C24.5683 17.5485 24.5125 17.5485 24.4568 17.6043C24.4568 17.6043 24.4011 17.6043 24.3454 17.6043C24.2897 17.6043 24.234 17.6043 24.1783 17.6043C24.1783 17.5485 24.1226 17.5485 24.1226 17.5485C24.0669 17.4928 24.0669 17.4371 24.0669 17.4371C24.0112 17.3814 24.0112 17.3257 24.0112 17.27C24.0112 17.2143 24.0112 17.1586 24.0669 17.1029C24.0669 17.1029 24.0669 17.0472 24.1226 16.9914C24.1226 16.9914 24.1783 16.9357 24.234 16.9357C24.234 16.9357 24.2897 16.9357 24.3454 16.9357C24.4011 16.9357 24.4568 16.9357 24.4568 16.9357C24.5125 16.9357 24.5683 16.9914 24.5683 16.9914C24.624 17.0472 24.624 17.0472 24.624 17.1029C24.624 17.1586 24.6797 17.2143 24.6797 17.27ZM24.5125 17.27C24.5125 17.2143 24.5125 17.2143 24.5125 17.1586C24.5125 17.1586 24.5125 17.1029 24.4568 17.1029C24.4568 17.0472 24.4568 17.0472 24.4011 17.0472C24.4011 17.0472 24.4011 17.0472 24.3454 17.0472C24.2897 17.0472 24.2897 17.0472 24.234 17.0472V17.1029C24.1783 17.1029 24.1783 17.1586 24.1783 17.1586C24.1783 17.2143 24.1783 17.2143 24.1783 17.27C24.1783 17.27 24.1783 17.3257 24.1783 17.3814V17.4371C24.234 17.4371 24.234 17.4928 24.234 17.4928C24.2897 17.4928 24.2897 17.4928 24.3454 17.4928C24.4011 17.4928 24.4011 17.4928 24.4011 17.4928C24.4568 17.4928 24.4568 17.4371 24.4568 17.4371C24.5125 17.3814 24.5125 17.3814 24.5125 17.3814C24.5125 17.3257 24.5125 17.27 24.5125 17.27ZM25.2368 17.6043C25.2368 17.6043 25.2368 17.6043 25.1811 17.6043H25.1254V17.0472H24.9582C24.9582 17.1029 24.9582 17.2143 24.9582 17.27C24.9025 17.3257 24.9025 17.3814 24.9025 17.3814C24.9025 17.4371 24.9025 17.4928 24.8468 17.4928C24.8468 17.5485 24.8468 17.5485 24.7911 17.5485C24.7911 17.6043 24.7911 17.6043 24.7354 17.6043C24.7354 17.6043 24.7354 17.6043 24.6797 17.6043C24.6797 17.5485 24.6797 17.5485 24.6797 17.5485C24.6797 17.5485 24.6797 17.5485 24.6797 17.4928C24.7354 17.4928 24.7354 17.4928 24.7354 17.4371C24.7354 17.4371 24.7354 17.4371 24.7354 17.3814C24.7911 17.3814 24.7911 17.3257 24.7911 17.3257C24.7911 17.27 24.7911 17.2143 24.7911 17.1586C24.7911 17.1029 24.8468 17.0472 24.8468 16.9914C24.8468 16.9357 24.8468 16.9357 24.8468 16.9357H25.1811C25.2368 16.9357 25.2368 16.9357 25.2368 16.9357C25.2368 16.9357 25.2368 16.9357 25.2368 16.9914V17.6043ZM25.961 17.27C25.961 17.3257 25.961 17.3814 25.961 17.3814C25.9053 17.4371 25.9053 17.4928 25.9053 17.4928C25.8496 17.5485 25.7939 17.5485 25.7939 17.6043C25.7382 17.6043 25.6825 17.6043 25.6268 17.6043C25.571 17.6043 25.5153 17.6043 25.5153 17.6043C25.4596 17.5485 25.4596 17.5485 25.4039 17.5485C25.4039 17.4928 25.3482 17.4371 25.3482 17.4371C25.3482 17.3814 25.3482 17.3257 25.3482 17.27C25.3482 17.2143 25.3482 17.1586 25.3482 17.1029C25.3482 17.1029 25.4039 17.0472 25.4039 16.9914C25.4596 16.9914 25.4596 16.9357 25.5153 16.9357C25.571 16.9357 25.571 16.9357 25.6268 16.9357C25.6825 16.9357 25.7382 16.9357 25.7939 16.9357C25.8496 16.9357 25.8496 16.9914 25.9053 16.9914C25.9053 17.0472 25.9053 17.0472 25.961 17.1029C25.961 17.1586 25.961 17.2143 25.961 17.27ZM25.7939 17.27C25.7939 17.2143 25.7939 17.2143 25.7939 17.1586V17.1029C25.7939 17.0472 25.7382 17.0472 25.7382 17.0472C25.6825 17.0472 25.6825 17.0472 25.6268 17.0472H25.571C25.5153 17.0472 25.5153 17.1029 25.5153 17.1029L25.4596 17.1586C25.4596 17.2143 25.4596 17.2143 25.4596 17.27C25.4596 17.27 25.4596 17.3257 25.4596 17.3814L25.5153 17.4371C25.5153 17.4371 25.5153 17.4928 25.571 17.4928H25.6268C25.6825 17.4928 25.6825 17.4928 25.7382 17.4928L25.7939 17.4371C25.7939 17.3814 25.7939 17.3814 25.7939 17.3814C25.7939 17.3257 25.7939 17.27 25.7939 17.27ZM26.4067 16.9914V17.0472H26.1839V17.6043C26.1839 17.6043 26.1839 17.6043 26.1281 17.6043H26.0724V16.9914C26.0724 16.9357 26.0724 16.9357 26.0724 16.9357H26.4067V16.9914ZM27.0195 17.6043C27.0195 17.6043 27.0195 17.6043 26.9638 17.6043H26.9081V17.2143C26.9081 17.1586 26.9081 17.1586 26.9081 17.1586C26.8524 17.1586 26.8524 17.1586 26.8524 17.2143L26.6295 17.6043C26.6295 17.6043 26.6295 17.6043 26.5738 17.6043C26.5181 17.6043 26.5181 17.6043 26.5181 17.6043H26.4624V16.9357H26.5181C26.5181 16.9357 26.5181 16.9357 26.5738 16.9357C26.5738 16.9357 26.5738 16.9357 26.6295 16.9357V17.3257V17.3814V17.3257C26.6295 17.3257 26.6852 17.3257 26.6852 17.27L26.9081 16.9357C26.9638 16.9357 26.9638 16.9357 26.9638 16.9357C26.9638 16.9357 26.9638 16.9357 27.0195 16.9357V17.6043ZM27.688 17.6043C27.688 17.6043 27.688 17.6043 27.6323 17.6043H27.5766V17.2143C27.5766 17.1586 27.5766 17.1586 27.5766 17.1586C27.5766 17.1586 27.5766 17.1586 27.5209 17.1586C27.5209 17.1586 27.5209 17.1586 27.5209 17.2143L27.2981 17.6043H27.2424C27.2424 17.6043 27.2424 17.6043 27.1866 17.6043C27.1309 17.6043 27.1309 17.6043 27.1309 17.6043V16.9357C27.1309 16.9357 27.1309 16.9357 27.1866 16.9357C27.1866 16.9357 27.1866 16.9357 27.2424 16.9357C27.2981 16.9357 27.2981 16.9357 27.2981 16.9357V17.3257V17.3814V17.3257C27.2981 17.3257 27.2981 17.3257 27.3538 17.27L27.5766 16.9357C27.6323 16.9357 27.6323 16.9357 27.6323 16.9357C27.688 16.9357 27.688 16.9357 27.688 16.9357V17.6043ZM27.6323 16.7686C27.6323 16.7686 27.6323 16.7686 27.5766 16.8243C27.5766 16.88 27.5209 16.88 27.5209 16.88C27.4652 16.88 27.4652 16.88 27.4095 16.88H27.3538C27.2981 16.88 27.2981 16.88 27.2981 16.88C27.2424 16.8243 27.2424 16.8243 27.2424 16.8243C27.2424 16.7686 27.2424 16.7686 27.2424 16.7686C27.2424 16.7686 27.2424 16.7686 27.2424 16.7129C27.2981 16.7129 27.2981 16.7129 27.2981 16.7129C27.3538 16.7129 27.3538 16.7129 27.3538 16.7129C27.3538 16.7686 27.3538 16.7686 27.3538 16.7686C27.3538 16.8243 27.4095 16.8243 27.4095 16.8243H27.4652C27.4652 16.8243 27.4652 16.8243 27.4652 16.7686C27.5209 16.7686 27.5209 16.7686 27.5209 16.7686C27.5209 16.7686 27.5209 16.7686 27.5209 16.7129C27.5209 16.7129 27.5209 16.7129 27.5766 16.7129H27.6323C27.6323 16.7686 27.6323 16.7686 27.6323 16.7686Z" fill="#16509D"/>
</svg>
