<svg width="45" height="45" viewBox="0 0 45 45" fill="none" xmlns="http://www.w3.org/2000/svg">
<path d="M45 22.5C45 34.9264 34.9264 45 22.5 45C10.0736 45 0 34.9264 0 22.5C0 10.0736 10.0736 0 22.5 0C34.9264 0 45 10.0736 45 22.5Z" fill="url(#paint0_linear)"/>
<path d="M13.5922 28.034C13.3161 28.034 13.0922 28.2578 13.0922 28.534C13.0922 28.8101 13.3161 29.034 13.5922 29.034V28.034ZM25.4369 29.034C25.713 29.034 25.9369 28.8101 25.9369 28.534C25.9369 28.2578 25.713 28.034 25.4369 28.034V29.034ZM28.932 28.034C28.6559 28.034 28.432 28.2578 28.432 28.534C28.432 28.8101 28.6559 29.034 28.932 29.034V28.034ZM31.3592 29.034C31.6354 29.034 31.8592 28.8101 31.8592 28.534C31.8592 28.2578 31.6354 28.034 31.3592 28.034V29.034ZM13.5922 29.034C13.6006 29.034 13.6089 29.034 13.6173 29.034C13.6256 29.034 13.6339 29.034 13.6423 29.034C13.6506 29.034 13.659 29.034 13.6673 29.034C13.6756 29.034 13.684 29.034 13.6923 29.034C13.7006 29.034 13.709 29.034 13.7173 29.034C13.7256 29.034 13.734 29.034 13.7423 29.034C13.7506 29.034 13.759 29.034 13.7673 29.034C13.7756 29.034 13.7839 29.034 13.7923 29.034C13.8006 29.034 13.8089 29.034 13.8172 29.034C13.8256 29.034 13.8339 29.034 13.8422 29.034C13.8505 29.034 13.8588 29.034 13.8672 29.034C13.8755 29.034 13.8838 29.034 13.8921 29.034C13.9004 29.034 13.9087 29.034 13.9171 29.034C13.9254 29.034 13.9337 29.034 13.942 29.034C13.9503 29.034 13.9586 29.034 13.9669 29.034C13.9752 29.034 13.9836 29.034 13.9919 29.034C14.0002 29.034 14.0085 29.034 14.0168 29.034C14.0251 29.034 14.0334 29.034 14.0417 29.034C14.05 29.034 14.0583 29.034 14.0666 29.034C14.0749 29.034 14.0832 29.034 14.0915 29.034C14.0998 29.034 14.1081 29.034 14.1164 29.034C14.1247 29.034 14.133 29.034 14.1413 29.034C14.1496 29.034 14.1579 29.034 14.1662 29.034C14.1745 29.034 14.1827 29.034 14.191 29.034C14.1993 29.034 14.2076 29.034 14.2159 29.034C14.2242 29.034 14.2325 29.034 14.2408 29.034C14.249 29.034 14.2573 29.034 14.2656 29.034C14.2739 29.034 14.2822 29.034 14.2905 29.034C14.2987 29.034 14.307 29.034 14.3153 29.034C14.3236 29.034 14.3318 29.034 14.3401 29.034C14.3484 29.034 14.3567 29.034 14.3649 29.034C14.3732 29.034 14.3815 29.034 14.3898 29.034C14.398 29.034 14.4063 29.034 14.4146 29.034C14.4228 29.034 14.4311 29.034 14.4394 29.034C14.4476 29.034 14.4559 29.034 14.4642 29.034C14.4724 29.034 14.4807 29.034 14.489 29.034C14.4972 29.034 14.5055 29.034 14.5138 29.034C14.522 29.034 14.5303 29.034 14.5385 29.034C14.5468 29.034 14.555 29.034 14.5633 29.034C14.5716 29.034 14.5798 29.034 14.5881 29.034C14.5963 29.034 14.6046 29.034 14.6128 29.034C14.6211 29.034 14.6293 29.034 14.6376 29.034C14.6458 29.034 14.6541 29.034 14.6623 29.034C14.6706 29.034 14.6788 29.034 14.6871 29.034C14.6953 29.034 14.7035 29.034 14.7118 29.034C14.72 29.034 14.7283 29.034 14.7365 29.034C14.7447 29.034 14.753 29.034 14.7612 29.034C14.7695 29.034 14.7777 29.034 14.7859 29.034C14.7942 29.034 14.8024 29.034 14.8106 29.034C14.8189 29.034 14.8271 29.034 14.8353 29.034C14.8436 29.034 14.8518 29.034 14.86 29.034C14.8682 29.034 14.8765 29.034 14.8847 29.034C14.8929 29.034 14.9011 29.034 14.9094 29.034C14.9176 29.034 14.9258 29.034 14.934 29.034C14.9423 29.034 14.9505 29.034 14.9587 29.034C14.9669 29.034 14.9751 29.034 14.9834 29.034C14.9916 29.034 14.9998 29.034 15.008 29.034C15.0162 29.034 15.0244 29.034 15.0326 29.034C15.0409 29.034 15.0491 29.034 15.0573 29.034C15.0655 29.034 15.0737 29.034 15.0819 29.034C15.0901 29.034 15.0983 29.034 15.1065 29.034C15.1147 29.034 15.1229 29.034 15.1311 29.034C15.1393 29.034 15.1475 29.034 15.1557 29.034C15.1639 29.034 15.1721 29.034 15.1803 29.034C15.1885 29.034 15.1967 29.034 15.2049 29.034C15.2131 29.034 15.2213 29.034 15.2295 29.034C15.2377 29.034 15.2459 29.034 15.2541 29.034C15.2623 29.034 15.2705 29.034 15.2787 29.034C15.2868 29.034 15.295 29.034 15.3032 29.034C15.3114 29.034 15.3196 29.034 15.3278 29.034C15.336 29.034 15.3441 29.034 15.3523 29.034C15.3605 29.034 15.3687 29.034 15.3769 29.034C15.385 29.034 15.3932 29.034 15.4014 29.034C15.4096 29.034 15.4178 29.034 15.4259 29.034C15.4341 29.034 15.4423 29.034 15.4505 29.034C15.4586 29.034 15.4668 29.034 15.475 29.034C15.4831 29.034 15.4913 29.034 15.4995 29.034C15.5076 29.034 15.5158 29.034 15.524 29.034C15.5321 29.034 15.5403 29.034 15.5485 29.034C15.5566 29.034 15.5648 29.034 15.573 29.034C15.5811 29.034 15.5893 29.034 15.5974 29.034C15.6056 29.034 15.6138 29.034 15.6219 29.034C15.6301 29.034 15.6382 29.034 15.6464 29.034C15.6545 29.034 15.6627 29.034 15.6708 29.034C15.679 29.034 15.6871 29.034 15.6953 29.034C15.7034 29.034 15.7116 29.034 15.7197 29.034C15.7279 29.034 15.736 29.034 15.7442 29.034C15.7523 29.034 15.7605 29.034 15.7686 29.034C15.7767 29.034 15.7849 29.034 15.793 29.034C15.8012 29.034 15.8093 29.034 15.8174 29.034C15.8256 29.034 15.8337 29.034 15.8418 29.034C15.85 29.034 15.8581 29.034 15.8662 29.034C15.8744 29.034 15.8825 29.034 15.8906 29.034C15.8988 29.034 15.9069 29.034 15.915 29.034C15.9232 29.034 15.9313 29.034 15.9394 29.034C15.9475 29.034 15.9557 29.034 15.9638 29.034C15.9719 29.034 15.98 29.034 15.9882 29.034C15.9963 29.034 16.0044 29.034 16.0125 29.034C16.0206 29.034 16.0287 29.034 16.0369 29.034C16.045 29.034 16.0531 29.034 16.0612 29.034C16.0693 29.034 16.0774 29.034 16.0855 29.034C16.0937 29.034 16.1018 29.034 16.1099 29.034C16.118 29.034 16.1261 29.034 16.1342 29.034C16.1423 29.034 16.1504 29.034 16.1585 29.034C16.1666 29.034 16.1747 29.034 16.1828 29.034C16.1909 29.034 16.199 29.034 16.2071 29.034C16.2152 29.034 16.2233 29.034 16.2314 29.034C16.2395 29.034 16.2476 29.034 16.2557 29.034C16.2638 29.034 16.2719 29.034 16.28 29.034C16.2881 29.034 16.2962 29.034 16.3043 29.034C16.3124 29.034 16.3205 29.034 16.3285 29.034C16.3366 29.034 16.3447 29.034 16.3528 29.034C16.3609 29.034 16.369 29.034 16.3771 29.034C16.3851 29.034 16.3932 29.034 16.4013 29.034C16.4094 29.034 16.4175 29.034 16.4255 29.034C16.4336 29.034 16.4417 29.034 16.4498 29.034C16.4578 29.034 16.4659 29.034 16.474 29.034C16.4821 29.034 16.4901 29.034 16.4982 29.034C16.5063 29.034 16.5144 29.034 16.5224 29.034C16.5305 29.034 16.5386 29.034 16.5466 29.034C16.5547 29.034 16.5628 29.034 16.5708 29.034C16.5789 29.034 16.5869 29.034 16.595 29.034C16.6031 29.034 16.6111 29.034 16.6192 29.034C16.6272 29.034 16.6353 29.034 16.6434 29.034C16.6514 29.034 16.6595 29.034 16.6675 29.034C16.6756 29.034 16.6836 29.034 16.6917 29.034C16.6997 29.034 16.7078 29.034 16.7158 29.034C16.7239 29.034 16.7319 29.034 16.74 29.034C16.748 29.034 16.7561 29.034 16.7641 29.034C16.7722 29.034 16.7802 29.034 16.7883 29.034C16.7963 29.034 16.8043 29.034 16.8124 29.034C16.8204 29.034 16.8285 29.034 16.8365 29.034C16.8445 29.034 16.8526 29.034 16.8606 29.034C16.8686 29.034 16.8767 29.034 16.8847 29.034C16.8927 29.034 16.9008 29.034 16.9088 29.034C16.9168 29.034 16.9249 29.034 16.9329 29.034C16.9409 29.034 16.9489 29.034 16.957 29.034C16.965 29.034 16.973 29.034 16.981 29.034C16.9891 29.034 16.9971 29.034 17.0051 29.034C17.0131 29.034 17.0211 29.034 17.0292 29.034C17.0372 29.034 17.0452 29.034 17.0532 29.034C17.0612 29.034 17.0692 29.034 17.0773 29.034C17.0853 29.034 17.0933 29.034 17.1013 29.034C17.1093 29.034 17.1173 29.034 17.1253 29.034C17.1333 29.034 17.1413 29.034 17.1493 29.034C17.1574 29.034 17.1654 29.034 17.1734 29.034C17.1814 29.034 17.1894 29.034 17.1974 29.034C17.2054 29.034 17.2134 29.034 17.2214 29.034C17.2294 29.034 17.2374 29.034 17.2454 29.034C17.2534 29.034 17.2614 29.034 17.2693 29.034C17.2773 29.034 17.2853 29.034 17.2933 29.034C17.3013 29.034 17.3093 29.034 17.3173 29.034C17.3253 29.034 17.3333 29.034 17.3413 29.034C17.3492 29.034 17.3572 29.034 17.3652 29.034C17.3732 29.034 17.3812 29.034 17.3892 29.034C17.3971 29.034 17.4051 29.034 17.4131 29.034C17.4211 29.034 17.4291 29.034 17.437 29.034C17.445 29.034 17.453 29.034 17.461 29.034C17.4689 29.034 17.4769 29.034 17.4849 29.034C17.4929 29.034 17.5008 29.034 17.5088 29.034C17.5168 29.034 17.5247 29.034 17.5327 29.034C17.5407 29.034 17.5486 29.034 17.5566 29.034C17.5646 29.034 17.5725 29.034 17.5805 29.034C17.5884 29.034 17.5964 29.034 17.6044 29.034C17.6123 29.034 17.6203 29.034 17.6282 29.034C17.6362 29.034 17.6442 29.034 17.6521 29.034C17.6601 29.034 17.668 29.034 17.676 29.034C17.6839 29.034 17.6919 29.034 17.6998 29.034C17.7078 29.034 17.7157 29.034 17.7237 29.034C17.7316 29.034 17.7396 29.034 17.7475 29.034C17.7555 29.034 17.7634 29.034 17.7713 29.034C17.7793 29.034 17.7872 29.034 17.7952 29.034C17.8031 29.034 17.811 29.034 17.819 29.034C17.8269 29.034 17.8348 29.034 17.8428 29.034C17.8507 29.034 17.8587 29.034 17.8666 29.034C17.8745 29.034 17.8824 29.034 17.8904 29.034C17.8983 29.034 17.9062 29.034 17.9142 29.034C17.9221 29.034 17.93 29.034 17.9379 29.034C17.9459 29.034 17.9538 29.034 17.9617 29.034C17.9696 29.034 17.9776 29.034 17.9855 29.034C17.9934 29.034 18.0013 29.034 18.0092 29.034C18.0172 29.034 18.0251 29.034 18.033 29.034C18.0409 29.034 18.0488 29.034 18.0567 29.034C18.0646 29.034 18.0725 29.034 18.0805 29.034C18.0884 29.034 18.0963 29.034 18.1042 29.034C18.1121 29.034 18.12 29.034 18.1279 29.034C18.1358 29.034 18.1437 29.034 18.1516 29.034C18.1595 29.034 18.1674 29.034 18.1753 29.034C18.1832 29.034 18.1911 29.034 18.199 29.034C18.2069 29.034 18.2148 29.034 18.2227 29.034C18.2306 29.034 18.2385 29.034 18.2464 29.034C18.2543 29.034 18.2622 29.034 18.2701 29.034C18.278 29.034 18.2858 29.034 18.2937 29.034C18.3016 29.034 18.3095 29.034 18.3174 29.034C18.3253 29.034 18.3332 29.034 18.341 29.034C18.3489 29.034 18.3568 29.034 18.3647 29.034C18.3726 29.034 18.3804 29.034 18.3883 29.034C18.3962 29.034 18.4041 29.034 18.4119 29.034C18.4198 29.034 18.4277 29.034 18.4356 29.034C18.4434 29.034 18.4513 29.034 18.4592 29.034C18.4671 29.034 18.4749 29.034 18.4828 29.034C18.4907 29.034 18.4985 29.034 18.5064 29.034C18.5143 29.034 18.5221 29.034 18.53 29.034C18.5378 29.034 18.5457 29.034 18.5536 29.034C18.5614 29.034 18.5693 29.034 18.5771 29.034C18.585 29.034 18.5929 29.034 18.6007 29.034C18.6086 29.034 18.6164 29.034 18.6243 29.034C18.6321 29.034 18.64 29.034 18.6478 29.034C18.6557 29.034 18.6635 29.034 18.6714 29.034C18.6792 29.034 18.6871 29.034 18.6949 29.034C18.7028 29.034 18.7106 29.034 18.7184 29.034C18.7263 29.034 18.7341 29.034 18.742 29.034C18.7498 29.034 18.7576 29.034 18.7655 29.034C18.7733 29.034 18.7812 29.034 18.789 29.034C18.7968 29.034 18.8047 29.034 18.8125 29.034C18.8203 29.034 18.8282 29.034 18.836 29.034C18.8438 29.034 18.8516 29.034 18.8595 29.034C18.8673 29.034 18.8751 29.034 18.8829 29.034C18.8908 29.034 18.8986 29.034 18.9064 29.034C18.9142 29.034 18.9221 29.034 18.9299 29.034C18.9377 29.034 18.9455 29.034 18.9533 29.034C18.9611 29.034 18.969 29.034 18.9768 29.034C18.9846 29.034 18.9924 29.034 19.0002 29.034C19.008 29.034 19.0158 29.034 19.0237 29.034C19.0315 29.034 19.0393 29.034 19.0471 29.034C19.0549 29.034 19.0627 29.034 19.0705 29.034C19.0783 29.034 19.0861 29.034 19.0939 29.034C19.1017 29.034 19.1095 29.034 19.1173 29.034C19.1251 29.034 19.1329 29.034 19.1407 29.034C19.1485 29.034 19.1563 29.034 19.1641 29.034C19.1719 29.034 19.1797 29.034 19.1875 29.034C19.1953 29.034 19.203 29.034 19.2108 29.034C19.2186 29.034 19.2264 29.034 19.2342 29.034C19.242 29.034 19.2498 29.034 19.2575 29.034C19.2653 29.034 19.2731 29.034 19.2809 29.034C19.2887 29.034 19.2965 29.034 19.3042 29.034C19.312 29.034 19.3198 29.034 19.3276 29.034C19.3353 29.034 19.3431 29.034 19.3509 29.034C19.3587 29.034 19.3664 29.034 19.3742 29.034C19.382 29.034 19.3898 29.034 19.3975 29.034C19.4053 29.034 19.4131 29.034 19.4208 29.034C19.4286 29.034 19.4364 29.034 19.4441 29.034C19.4519 29.034 19.4596 29.034 19.4674 29.034C19.4752 29.034 19.4829 29.034 19.4907 29.034C19.4984 29.034 19.5062 29.034 19.514 29.034C19.5217 29.034 19.5295 29.034 19.5372 29.034C19.545 29.034 19.5527 29.034 19.5605 29.034C19.5682 29.034 19.576 29.034 19.5837 29.034C19.5915 29.034 19.5992 29.034 19.607 29.034C19.6147 29.034 19.6224 29.034 19.6302 29.034C19.6379 29.034 19.6457 29.034 19.6534 29.034C19.6612 29.034 19.6689 29.034 19.6766 29.034C19.6844 29.034 19.6921 29.034 19.6998 29.034C19.7076 29.034 19.7153 29.034 19.723 29.034C19.7308 29.034 19.7385 29.034 19.7462 29.034C19.754 29.034 19.7617 29.034 19.7694 29.034C19.7771 29.034 19.7849 29.034 19.7926 29.034C19.8003 29.034 19.808 29.034 19.8158 29.034C19.8235 29.034 19.8312 29.034 19.8389 29.034C19.8466 29.034 19.8544 29.034 19.8621 29.034C19.8698 29.034 19.8775 29.034 19.8852 29.034C19.8929 29.034 19.9007 29.034 19.9084 29.034C19.9161 29.034 19.9238 29.034 19.9315 29.034C19.9392 29.034 19.9469 29.034 19.9546 29.034C19.9623 29.034 19.97 29.034 19.9777 29.034C19.9854 29.034 19.9931 29.034 20.0008 29.034C20.0085 29.034 20.0162 29.034 20.0239 29.034C20.0316 29.034 20.0393 29.034 20.047 29.034C20.0547 29.034 20.0624 29.034 20.0701 29.034C20.0778 29.034 20.0855 29.034 20.0932 29.034C20.1009 29.034 20.1086 29.034 20.1163 29.034C20.124 29.034 20.1316 29.034 20.1393 29.034C20.147 29.034 20.1547 29.034 20.1624 29.034C20.1701 29.034 20.1777 29.034 20.1854 29.034C20.1931 29.034 20.2008 29.034 20.2085 29.034C20.2161 29.034 20.2238 29.034 20.2315 29.034C20.2392 29.034 20.2468 29.034 20.2545 29.034C20.2622 29.034 20.2699 29.034 20.2775 29.034C20.2852 29.034 20.2929 29.034 20.3005 29.034C20.3082 29.034 20.3159 29.034 20.3235 29.034C20.3312 29.034 20.3389 29.034 20.3465 29.034C20.3542 29.034 20.3618 29.034 20.3695 29.034C20.3772 29.034 20.3848 29.034 20.3925 29.034C20.4001 29.034 20.4078 29.034 20.4154 29.034C20.4231 29.034 20.4307 29.034 20.4384 29.034C20.446 29.034 20.4537 29.034 20.4613 29.034C20.469 29.034 20.4766 29.034 20.4843 29.034C20.4919 29.034 20.4996 29.034 20.5072 29.034C20.5149 29.034 20.5225 29.034 20.5301 29.034C20.5378 29.034 20.5454 29.034 20.5531 29.034C20.5607 29.034 20.5683 29.034 20.576 29.034C20.5836 29.034 20.5912 29.034 20.5989 29.034C20.6065 29.034 20.6141 29.034 20.6218 29.034C20.6294 29.034 20.637 29.034 20.6447 29.034C20.6523 29.034 20.6599 29.034 20.6675 29.034C20.6752 29.034 20.6828 29.034 20.6904 29.034C20.698 29.034 20.7057 29.034 20.7133 29.034C20.7209 29.034 20.7285 29.034 20.7361 29.034C20.7437 29.034 20.7514 29.034 20.759 29.034C20.7666 29.034 20.7742 29.034 20.7818 29.034C20.7894 29.034 20.797 29.034 20.8046 29.034C20.8123 29.034 20.8199 29.034 20.8275 29.034C20.8351 29.034 20.8427 29.034 20.8503 29.034C20.8579 29.034 20.8655 29.034 20.8731 29.034C20.8807 29.034 20.8883 29.034 20.8959 29.034C20.9035 29.034 20.9111 29.034 20.9187 29.034C20.9263 29.034 20.9339 29.034 20.9415 29.034C20.9491 29.034 20.9566 29.034 20.9642 29.034C20.9718 29.034 20.9794 29.034 20.987 29.034C20.9946 29.034 21.0022 29.034 21.0098 29.034C21.0174 29.034 21.0249 29.034 21.0325 29.034C21.0401 29.034 21.0477 29.034 21.0553 29.034C21.0628 29.034 21.0704 29.034 21.078 29.034C21.0856 29.034 21.0931 29.034 21.1007 29.034C21.1083 29.034 21.1159 29.034 21.1234 29.034C21.131 29.034 21.1386 29.034 21.1462 29.034C21.1537 29.034 21.1613 29.034 21.1689 29.034C21.1764 29.034 21.184 29.034 21.1915 29.034C21.1991 29.034 21.2067 29.034 21.2142 29.034C21.2218 29.034 21.2294 29.034 21.2369 29.034C21.2445 29.034 21.252 29.034 21.2596 29.034C21.2671 29.034 21.2747 29.034 21.2822 29.034C21.2898 29.034 21.2974 29.034 21.3049 29.034C21.3125 29.034 21.32 29.034 21.3275 29.034C21.3351 29.034 21.3426 29.034 21.3502 29.034C21.3577 29.034 21.3653 29.034 21.3728 29.034C21.3804 29.034 21.3879 29.034 21.3954 29.034C21.403 29.034 21.4105 29.034 21.4181 29.034C21.4256 29.034 21.4331 29.034 21.4407 29.034C21.4482 29.034 21.4557 29.034 21.4633 29.034C21.4708 29.034 21.4783 29.034 21.4859 29.034C21.4934 29.034 21.5009 29.034 21.5084 29.034C21.516 29.034 21.5235 29.034 21.531 29.034C21.5385 29.034 21.5461 29.034 21.5536 29.034C21.5611 29.034 21.5686 29.034 21.5761 29.034C21.5836 29.034 21.5912 29.034 21.5987 29.034C21.6062 29.034 21.6137 29.034 21.6212 29.034C21.6287 29.034 21.6362 29.034 21.6438 29.034C21.6513 29.034 21.6588 29.034 21.6663 29.034C21.6738 29.034 21.6813 29.034 21.6888 29.034C21.6963 29.034 21.7038 29.034 21.7113 29.034C21.7188 29.034 21.7263 29.034 21.7338 29.034C21.7413 29.034 21.7488 29.034 21.7563 29.034C21.7638 29.034 21.7713 29.034 21.7788 29.034C21.7863 29.034 21.7938 29.034 21.8013 29.034C21.8087 29.034 21.8162 29.034 21.8237 29.034C21.8312 29.034 21.8387 29.034 21.8462 29.034C21.8537 29.034 21.8612 29.034 21.8686 29.034C21.8761 29.034 21.8836 29.034 21.8911 29.034C21.8986 29.034 21.906 29.034 21.9135 29.034C21.921 29.034 21.9285 29.034 21.9359 29.034C21.9434 29.034 21.9509 29.034 21.9584 29.034C21.9658 29.034 21.9733 29.034 21.9808 29.034C21.9882 29.034 21.9957 29.034 22.0032 29.034C22.0106 29.034 22.0181 29.034 22.0256 29.034C22.033 29.034 22.0405 29.034 22.048 29.034C22.0554 29.034 22.0629 29.034 22.0703 29.034C22.0778 29.034 22.0852 29.034 22.0927 29.034C22.1002 29.034 22.1076 29.034 22.1151 29.034C22.1225 29.034 22.13 29.034 22.1374 29.034C22.1449 29.034 22.1523 29.034 22.1598 29.034C22.1672 29.034 22.1747 29.034 22.1821 29.034C22.1895 29.034 22.197 29.034 22.2044 29.034C22.2119 29.034 22.2193 29.034 22.2267 29.034C22.2342 29.034 22.2416 29.034 22.2491 29.034C22.2565 29.034 22.2639 29.034 22.2714 29.034C22.2788 29.034 22.2862 29.034 22.2937 29.034C22.3011 29.034 22.3085 29.034 22.3159 29.034C22.3234 29.034 22.3308 29.034 22.3382 29.034C22.3457 29.034 22.3531 29.034 22.3605 29.034C22.3679 29.034 22.3753 29.034 22.3828 29.034C22.3902 29.034 22.3976 29.034 22.405 29.034C22.4124 29.034 22.4198 29.034 22.4273 29.034C22.4347 29.034 22.4421 29.034 22.4495 29.034C22.4569 29.034 22.4643 29.034 22.4717 29.034C22.4791 29.034 22.4865 29.034 22.4939 29.034C22.5014 29.034 22.5088 29.034 22.5162 29.034C22.5236 29.034 22.531 29.034 22.5384 29.034C22.5458 29.034 22.5532 29.034 22.5606 29.034C22.568 29.034 22.5754 29.034 22.5828 29.034C22.5901 29.034 22.5975 29.034 22.6049 29.034C22.6123 29.034 22.6197 29.034 22.6271 29.034C22.6345 29.034 22.6419 29.034 22.6493 29.034C22.6567 29.034 22.664 29.034 22.6714 29.034C22.6788 29.034 22.6862 29.034 22.6936 29.034C22.7009 29.034 22.7083 29.034 22.7157 29.034C22.7231 29.034 22.7305 29.034 22.7378 29.034C22.7452 29.034 22.7526 29.034 22.76 29.034C22.7673 29.034 22.7747 29.034 22.7821 29.034C22.7894 29.034 22.7968 29.034 22.8042 29.034C22.8115 29.034 22.8189 29.034 22.8263 29.034C22.8336 29.034 22.841 29.034 22.8484 29.034C22.8557 29.034 22.8631 29.034 22.8704 29.034C22.8778 29.034 22.8851 29.034 22.8925 29.034C22.8999 29.034 22.9072 29.034 22.9146 29.034C22.9219 29.034 22.9293 29.034 22.9366 29.034C22.944 29.034 22.9513 29.034 22.9587 29.034C22.966 29.034 22.9734 29.034 22.9807 29.034C22.9881 29.034 22.9954 29.034 23.0027 29.034C23.0101 29.034 23.0174 29.034 23.0248 29.034C23.0321 29.034 23.0394 29.034 23.0468 29.034C23.0541 29.034 23.0614 29.034 23.0688 29.034C23.0761 29.034 23.0834 29.034 23.0908 29.034C23.0981 29.034 23.1054 29.034 23.1128 29.034C23.1201 29.034 23.1274 29.034 23.1347 29.034C23.1421 29.034 23.1494 29.034 23.1567 29.034C23.164 29.034 23.1713 29.034 23.1787 29.034C23.186 29.034 23.1933 29.034 23.2006 29.034C23.2079 29.034 23.2153 29.034 23.2226 29.034C23.2299 29.034 23.2372 29.034 23.2445 29.034C23.2518 29.034 23.2591 29.034 23.2664 29.034C23.2737 29.034 23.281 29.034 23.2883 29.034C23.2957 29.034 23.303 29.034 23.3103 29.034C23.3176 29.034 23.3249 29.034 23.3322 29.034C23.3395 29.034 23.3468 29.034 23.3541 29.034C23.3614 29.034 23.3686 29.034 23.3759 29.034C23.3832 29.034 23.3905 29.034 23.3978 29.034C23.4051 29.034 23.4124 29.034 23.4197 29.034C23.427 29.034 23.4343 29.034 23.4415 29.034C23.4488 29.034 23.4561 29.034 23.4634 29.034C23.4707 29.034 23.478 29.034 23.4852 29.034C23.4925 29.034 23.4998 29.034 23.5071 29.034C23.5144 29.034 23.5216 29.034 23.5289 29.034C23.5362 29.034 23.5435 29.034 23.5507 29.034C23.558 29.034 23.5653 29.034 23.5725 29.034C23.5798 29.034 23.5871 29.034 23.5943 29.034C23.6016 29.034 23.6089 29.034 23.6161 29.034C23.6234 29.034 23.6307 29.034 23.6379 29.034C23.6452 29.034 23.6524 29.034 23.6597 29.034C23.6669 29.034 23.6742 29.034 23.6815 29.034C23.6887 29.034 23.696 29.034 23.7032 29.034C23.7105 29.034 23.7177 29.034 23.725 29.034C23.7322 29.034 23.7395 29.034 23.7467 29.034C23.7539 29.034 23.7612 29.034 23.7684 29.034C23.7757 29.034 23.7829 29.034 23.7902 29.034C23.7974 29.034 23.8046 29.034 23.8119 29.034C23.8191 29.034 23.8263 29.034 23.8336 29.034C23.8408 29.034 23.848 29.034 23.8553 29.034C23.8625 29.034 23.8697 29.034 23.877 29.034C23.8842 29.034 23.8914 29.034 23.8987 29.034C23.9059 29.034 23.9131 29.034 23.9203 29.034C23.9275 29.034 23.9348 29.034 23.942 29.034C23.9492 29.034 23.9564 29.034 23.9636 29.034C23.9709 29.034 23.9781 29.034 23.9853 29.034C23.9925 29.034 23.9997 29.034 24.0069 29.034C24.0141 29.034 24.0213 29.034 24.0286 29.034C24.0358 29.034 24.043 29.034 24.0502 29.034C24.0574 29.034 24.0646 29.034 24.0718 29.034C24.079 29.034 24.0862 29.034 24.0934 29.034C24.1006 29.034 24.1078 29.034 24.115 29.034C24.1222 29.034 24.1294 29.034 24.1366 29.034C24.1438 29.034 24.151 29.034 24.1582 29.034C24.1653 29.034 24.1725 29.034 24.1797 29.034C24.1869 29.034 24.1941 29.034 24.2013 29.034C24.2085 29.034 24.2157 29.034 24.2228 29.034C24.23 29.034 24.2372 29.034 24.2444 29.034C24.2516 29.034 24.2587 29.034 24.2659 29.034C24.2731 29.034 24.2803 29.034 24.2874 29.034C24.2946 29.034 24.3018 29.034 24.309 29.034C24.3161 29.034 24.3233 29.034 24.3305 29.034C24.3376 29.034 24.3448 29.034 24.352 29.034C24.3591 29.034 24.3663 29.034 24.3735 29.034C24.3806 29.034 24.3878 29.034 24.3949 29.034C24.4021 29.034 24.4093 29.034 24.4164 29.034C24.4236 29.034 24.4307 29.034 24.4379 29.034C24.445 29.034 24.4522 29.034 24.4593 29.034C24.4665 29.034 24.4736 29.034 24.4808 29.034C24.4879 29.034 24.4951 29.034 24.5022 29.034C24.5094 29.034 24.5165 29.034 24.5237 29.034C24.5308 29.034 24.5379 29.034 24.5451 29.034C24.5522 29.034 24.5594 29.034 24.5665 29.034C24.5736 29.034 24.5808 29.034 24.5879 29.034C24.595 29.034 24.6022 29.034 24.6093 29.034C24.6164 29.034 24.6236 29.034 24.6307 29.034C24.6378 29.034 24.6449 29.034 24.6521 29.034C24.6592 29.034 24.6663 29.034 24.6734 29.034C24.6806 29.034 24.6877 29.034 24.6948 29.034C24.7019 29.034 24.709 29.034 24.7161 29.034C24.7233 29.034 24.7304 29.034 24.7375 29.034C24.7446 29.034 24.7517 29.034 24.7588 29.034C24.7659 29.034 24.773 29.034 24.7801 29.034C24.7873 29.034 24.7944 29.034 24.8015 29.034C24.8086 29.034 24.8157 29.034 24.8228 29.034C24.8299 29.034 24.837 29.034 24.8441 29.034C24.8512 29.034 24.8583 29.034 24.8654 29.034C24.8725 29.034 24.8796 29.034 24.8866 29.034C24.8937 29.034 24.9008 29.034 24.9079 29.034C24.915 29.034 24.9221 29.034 24.9292 29.034C24.9363 29.034 24.9434 29.034 24.9504 29.034C24.9575 29.034 24.9646 29.034 24.9717 29.034C24.9788 29.034 24.9858 29.034 24.9929 29.034C25 29.034 25.0071 29.034 25.0142 29.034C25.0212 29.034 25.0283 29.034 25.0354 29.034C25.0424 29.034 25.0495 29.034 25.0566 29.034C25.0637 29.034 25.0707 29.034 25.0778 29.034C25.0849 29.034 25.0919 29.034 25.099 29.034C25.106 29.034 25.1131 29.034 25.1202 29.034C25.1272 29.034 25.1343 29.034 25.1413 29.034C25.1484 29.034 25.1555 29.034 25.1625 29.034C25.1696 29.034 25.1766 29.034 25.1837 29.034C25.1907 29.034 25.1978 29.034 25.2048 29.034C25.2119 29.034 25.2189 29.034 25.226 29.034C25.233 29.034 25.2401 29.034 25.2471 29.034C25.2541 29.034 25.2612 29.034 25.2682 29.034C25.2753 29.034 25.2823 29.034 25.2893 29.034C25.2964 29.034 25.3034 29.034 25.3104 29.034C25.3175 29.034 25.3245 29.034 25.3315 29.034C25.3386 29.034 25.3456 29.034 25.3526 29.034C25.3597 29.034 25.3667 29.034 25.3737 29.034C25.3807 29.034 25.3878 29.034 25.3948 29.034C25.4018 29.034 25.4088 29.034 25.4158 29.034C25.4229 29.034 25.4299 29.034 25.4369 29.034V28.034C25.4299 28.034 25.4229 28.034 25.4158 28.034C25.4088 28.034 25.4018 28.034 25.3948 28.034C25.3878 28.034 25.3807 28.034 25.3737 28.034C25.3667 28.034 25.3597 28.034 25.3526 28.034C25.3456 28.034 25.3386 28.034 25.3315 28.034C25.3245 28.034 25.3175 28.034 25.3104 28.034C25.3034 28.034 25.2964 28.034 25.2893 28.034C25.2823 28.034 25.2753 28.034 25.2682 28.034C25.2612 28.034 25.2541 28.034 25.2471 28.034C25.2401 28.034 25.233 28.034 25.226 28.034C25.2189 28.034 25.2119 28.034 25.2048 28.034C25.1978 28.034 25.1907 28.034 25.1837 28.034C25.1766 28.034 25.1696 28.034 25.1625 28.034C25.1555 28.034 25.1484 28.034 25.1413 28.034C25.1343 28.034 25.1272 28.034 25.1202 28.034C25.1131 28.034 25.106 28.034 25.099 28.034C25.0919 28.034 25.0849 28.034 25.0778 28.034C25.0707 28.034 25.0637 28.034 25.0566 28.034C25.0495 28.034 25.0424 28.034 25.0354 28.034C25.0283 28.034 25.0212 28.034 25.0142 28.034C25.0071 28.034 25 28.034 24.9929 28.034C24.9858 28.034 24.9788 28.034 24.9717 28.034C24.9646 28.034 24.9575 28.034 24.9504 28.034C24.9434 28.034 24.9363 28.034 24.9292 28.034C24.9221 28.034 24.915 28.034 24.9079 28.034C24.9008 28.034 24.8937 28.034 24.8866 28.034C24.8796 28.034 24.8725 28.034 24.8654 28.034C24.8583 28.034 24.8512 28.034 24.8441 28.034C24.837 28.034 24.8299 28.034 24.8228 28.034C24.8157 28.034 24.8086 28.034 24.8015 28.034C24.7944 28.034 24.7873 28.034 24.7801 28.034C24.773 28.034 24.7659 28.034 24.7588 28.034C24.7517 28.034 24.7446 28.034 24.7375 28.034C24.7304 28.034 24.7233 28.034 24.7161 28.034C24.709 28.034 24.7019 28.034 24.6948 28.034C24.6877 28.034 24.6806 28.034 24.6734 28.034C24.6663 28.034 24.6592 28.034 24.6521 28.034C24.6449 28.034 24.6378 28.034 24.6307 28.034C24.6236 28.034 24.6164 28.034 24.6093 28.034C24.6022 28.034 24.595 28.034 24.5879 28.034C24.5808 28.034 24.5736 28.034 24.5665 28.034C24.5594 28.034 24.5522 28.034 24.5451 28.034C24.5379 28.034 24.5308 28.034 24.5237 28.034C24.5165 28.034 24.5094 28.034 24.5022 28.034C24.4951 28.034 24.4879 28.034 24.4808 28.034C24.4736 28.034 24.4665 28.034 24.4593 28.034C24.4522 28.034 24.445 28.034 24.4379 28.034C24.4307 28.034 24.4236 28.034 24.4164 28.034C24.4093 28.034 24.4021 28.034 24.3949 28.034C24.3878 28.034 24.3806 28.034 24.3735 28.034C24.3663 28.034 24.3591 28.034 24.352 28.034C24.3448 28.034 24.3376 28.034 24.3305 28.034C24.3233 28.034 24.3161 28.034 24.309 28.034C24.3018 28.034 24.2946 28.034 24.2874 28.034C24.2803 28.034 24.2731 28.034 24.2659 28.034C24.2587 28.034 24.2516 28.034 24.2444 28.034C24.2372 28.034 24.23 28.034 24.2228 28.034C24.2157 28.034 24.2085 28.034 24.2013 28.034C24.1941 28.034 24.1869 28.034 24.1797 28.034C24.1725 28.034 24.1653 28.034 24.1582 28.034C24.151 28.034 24.1438 28.034 24.1366 28.034C24.1294 28.034 24.1222 28.034 24.115 28.034C24.1078 28.034 24.1006 28.034 24.0934 28.034C24.0862 28.034 24.079 28.034 24.0718 28.034C24.0646 28.034 24.0574 28.034 24.0502 28.034C24.043 28.034 24.0358 28.034 24.0286 28.034C24.0213 28.034 24.0141 28.034 24.0069 28.034C23.9997 28.034 23.9925 28.034 23.9853 28.034C23.9781 28.034 23.9709 28.034 23.9636 28.034C23.9564 28.034 23.9492 28.034 23.942 28.034C23.9348 28.034 23.9275 28.034 23.9203 28.034C23.9131 28.034 23.9059 28.034 23.8987 28.034C23.8914 28.034 23.8842 28.034 23.877 28.034C23.8697 28.034 23.8625 28.034 23.8553 28.034C23.848 28.034 23.8408 28.034 23.8336 28.034C23.8263 28.034 23.8191 28.034 23.8119 28.034C23.8046 28.034 23.7974 28.034 23.7902 28.034C23.7829 28.034 23.7757 28.034 23.7684 28.034C23.7612 28.034 23.7539 28.034 23.7467 28.034C23.7395 28.034 23.7322 28.034 23.725 28.034C23.7177 28.034 23.7105 28.034 23.7032 28.034C23.696 28.034 23.6887 28.034 23.6815 28.034C23.6742 28.034 23.6669 28.034 23.6597 28.034C23.6524 28.034 23.6452 28.034 23.6379 28.034C23.6307 28.034 23.6234 28.034 23.6161 28.034C23.6089 28.034 23.6016 28.034 23.5943 28.034C23.5871 28.034 23.5798 28.034 23.5725 28.034C23.5653 28.034 23.558 28.034 23.5507 28.034C23.5435 28.034 23.5362 28.034 23.5289 28.034C23.5216 28.034 23.5144 28.034 23.5071 28.034C23.4998 28.034 23.4925 28.034 23.4852 28.034C23.478 28.034 23.4707 28.034 23.4634 28.034C23.4561 28.034 23.4488 28.034 23.4415 28.034C23.4343 28.034 23.427 28.034 23.4197 28.034C23.4124 28.034 23.4051 28.034 23.3978 28.034C23.3905 28.034 23.3832 28.034 23.3759 28.034C23.3686 28.034 23.3614 28.034 23.3541 28.034C23.3468 28.034 23.3395 28.034 23.3322 28.034C23.3249 28.034 23.3176 28.034 23.3103 28.034C23.303 28.034 23.2957 28.034 23.2883 28.034C23.281 28.034 23.2737 28.034 23.2664 28.034C23.2591 28.034 23.2518 28.034 23.2445 28.034C23.2372 28.034 23.2299 28.034 23.2226 28.034C23.2153 28.034 23.2079 28.034 23.2006 28.034C23.1933 28.034 23.186 28.034 23.1787 28.034C23.1713 28.034 23.164 28.034 23.1567 28.034C23.1494 28.034 23.1421 28.034 23.1347 28.034C23.1274 28.034 23.1201 28.034 23.1128 28.034C23.1054 28.034 23.0981 28.034 23.0908 28.034C23.0834 28.034 23.0761 28.034 23.0688 28.034C23.0614 28.034 23.0541 28.034 23.0468 28.034C23.0394 28.034 23.0321 28.034 23.0248 28.034C23.0174 28.034 23.0101 28.034 23.0027 28.034C22.9954 28.034 22.9881 28.034 22.9807 28.034C22.9734 28.034 22.966 28.034 22.9587 28.034C22.9513 28.034 22.944 28.034 22.9366 28.034C22.9293 28.034 22.9219 28.034 22.9146 28.034C22.9072 28.034 22.8999 28.034 22.8925 28.034C22.8851 28.034 22.8778 28.034 22.8704 28.034C22.8631 28.034 22.8557 28.034 22.8484 28.034C22.841 28.034 22.8336 28.034 22.8263 28.034C22.8189 28.034 22.8115 28.034 22.8042 28.034C22.7968 28.034 22.7894 28.034 22.7821 28.034C22.7747 28.034 22.7673 28.034 22.76 28.034C22.7526 28.034 22.7452 28.034 22.7378 28.034C22.7305 28.034 22.7231 28.034 22.7157 28.034C22.7083 28.034 22.7009 28.034 22.6936 28.034C22.6862 28.034 22.6788 28.034 22.6714 28.034C22.664 28.034 22.6567 28.034 22.6493 28.034C22.6419 28.034 22.6345 28.034 22.6271 28.034C22.6197 28.034 22.6123 28.034 22.6049 28.034C22.5975 28.034 22.5901 28.034 22.5828 28.034C22.5754 28.034 22.568 28.034 22.5606 28.034C22.5532 28.034 22.5458 28.034 22.5384 28.034C22.531 28.034 22.5236 28.034 22.5162 28.034C22.5088 28.034 22.5014 28.034 22.4939 28.034C22.4865 28.034 22.4791 28.034 22.4717 28.034C22.4643 28.034 22.4569 28.034 22.4495 28.034C22.4421 28.034 22.4347 28.034 22.4273 28.034C22.4198 28.034 22.4124 28.034 22.405 28.034C22.3976 28.034 22.3902 28.034 22.3828 28.034C22.3753 28.034 22.3679 28.034 22.3605 28.034C22.3531 28.034 22.3457 28.034 22.3382 28.034C22.3308 28.034 22.3234 28.034 22.3159 28.034C22.3085 28.034 22.3011 28.034 22.2937 28.034C22.2862 28.034 22.2788 28.034 22.2714 28.034C22.2639 28.034 22.2565 28.034 22.2491 28.034C22.2416 28.034 22.2342 28.034 22.2267 28.034C22.2193 28.034 22.2119 28.034 22.2044 28.034C22.197 28.034 22.1895 28.034 22.1821 28.034C22.1747 28.034 22.1672 28.034 22.1598 28.034C22.1523 28.034 22.1449 28.034 22.1374 28.034C22.13 28.034 22.1225 28.034 22.1151 28.034C22.1076 28.034 22.1002 28.034 22.0927 28.034C22.0852 28.034 22.0778 28.034 22.0703 28.034C22.0629 28.034 22.0554 28.034 22.048 28.034C22.0405 28.034 22.033 28.034 22.0256 28.034C22.0181 28.034 22.0106 28.034 22.0032 28.034C21.9957 28.034 21.9882 28.034 21.9808 28.034C21.9733 28.034 21.9658 28.034 21.9584 28.034C21.9509 28.034 21.9434 28.034 21.9359 28.034C21.9285 28.034 21.921 28.034 21.9135 28.034C21.906 28.034 21.8986 28.034 21.8911 28.034C21.8836 28.034 21.8761 28.034 21.8686 28.034C21.8612 28.034 21.8537 28.034 21.8462 28.034C21.8387 28.034 21.8312 28.034 21.8237 28.034C21.8162 28.034 21.8087 28.034 21.8013 28.034C21.7938 28.034 21.7863 28.034 21.7788 28.034C21.7713 28.034 21.7638 28.034 21.7563 28.034C21.7488 28.034 21.7413 28.034 21.7338 28.034C21.7263 28.034 21.7188 28.034 21.7113 28.034C21.7038 28.034 21.6963 28.034 21.6888 28.034C21.6813 28.034 21.6738 28.034 21.6663 28.034C21.6588 28.034 21.6513 28.034 21.6438 28.034C21.6362 28.034 21.6287 28.034 21.6212 28.034C21.6137 28.034 21.6062 28.034 21.5987 28.034C21.5912 28.034 21.5836 28.034 21.5761 28.034C21.5686 28.034 21.5611 28.034 21.5536 28.034C21.5461 28.034 21.5385 28.034 21.531 28.034C21.5235 28.034 21.516 28.034 21.5084 28.034C21.5009 28.034 21.4934 28.034 21.4859 28.034C21.4783 28.034 21.4708 28.034 21.4633 28.034C21.4557 28.034 21.4482 28.034 21.4407 28.034C21.4331 28.034 21.4256 28.034 21.4181 28.034C21.4105 28.034 21.403 28.034 21.3954 28.034C21.3879 28.034 21.3804 28.034 21.3728 28.034C21.3653 28.034 21.3577 28.034 21.3502 28.034C21.3426 28.034 21.3351 28.034 21.3275 28.034C21.32 28.034 21.3125 28.034 21.3049 28.034C21.2974 28.034 21.2898 28.034 21.2822 28.034C21.2747 28.034 21.2671 28.034 21.2596 28.034C21.252 28.034 21.2445 28.034 21.2369 28.034C21.2294 28.034 21.2218 28.034 21.2142 28.034C21.2067 28.034 21.1991 28.034 21.1915 28.034C21.184 28.034 21.1764 28.034 21.1689 28.034C21.1613 28.034 21.1537 28.034 21.1462 28.034C21.1386 28.034 21.131 28.034 21.1234 28.034C21.1159 28.034 21.1083 28.034 21.1007 28.034C21.0931 28.034 21.0856 28.034 21.078 28.034C21.0704 28.034 21.0628 28.034 21.0553 28.034C21.0477 28.034 21.0401 28.034 21.0325 28.034C21.0249 28.034 21.0174 28.034 21.0098 28.034C21.0022 28.034 20.9946 28.034 20.987 28.034C20.9794 28.034 20.9718 28.034 20.9642 28.034C20.9566 28.034 20.9491 28.034 20.9415 28.034C20.9339 28.034 20.9263 28.034 20.9187 28.034C20.9111 28.034 20.9035 28.034 20.8959 28.034C20.8883 28.034 20.8807 28.034 20.8731 28.034C20.8655 28.034 20.8579 28.034 20.8503 28.034C20.8427 28.034 20.8351 28.034 20.8275 28.034C20.8199 28.034 20.8123 28.034 20.8046 28.034C20.797 28.034 20.7894 28.034 20.7818 28.034C20.7742 28.034 20.7666 28.034 20.759 28.034C20.7514 28.034 20.7437 28.034 20.7361 28.034C20.7285 28.034 20.7209 28.034 20.7133 28.034C20.7057 28.034 20.698 28.034 20.6904 28.034C20.6828 28.034 20.6752 28.034 20.6675 28.034C20.6599 28.034 20.6523 28.034 20.6447 28.034C20.637 28.034 20.6294 28.034 20.6218 28.034C20.6141 28.034 20.6065 28.034 20.5989 28.034C20.5912 28.034 20.5836 28.034 20.576 28.034C20.5683 28.034 20.5607 28.034 20.5531 28.034C20.5454 28.034 20.5378 28.034 20.5301 28.034C20.5225 28.034 20.5149 28.034 20.5072 28.034C20.4996 28.034 20.4919 28.034 20.4843 28.034C20.4766 28.034 20.469 28.034 20.4613 28.034C20.4537 28.034 20.446 28.034 20.4384 28.034C20.4307 28.034 20.4231 28.034 20.4154 28.034C20.4078 28.034 20.4001 28.034 20.3925 28.034C20.3848 28.034 20.3772 28.034 20.3695 28.034C20.3618 28.034 20.3542 28.034 20.3465 28.034C20.3389 28.034 20.3312 28.034 20.3235 28.034C20.3159 28.034 20.3082 28.034 20.3005 28.034C20.2929 28.034 20.2852 28.034 20.2775 28.034C20.2699 28.034 20.2622 28.034 20.2545 28.034C20.2468 28.034 20.2392 28.034 20.2315 28.034C20.2238 28.034 20.2161 28.034 20.2085 28.034C20.2008 28.034 20.1931 28.034 20.1854 28.034C20.1777 28.034 20.1701 28.034 20.1624 28.034C20.1547 28.034 20.147 28.034 20.1393 28.034C20.1316 28.034 20.124 28.034 20.1163 28.034C20.1086 28.034 20.1009 28.034 20.0932 28.034C20.0855 28.034 20.0778 28.034 20.0701 28.034C20.0624 28.034 20.0547 28.034 20.047 28.034C20.0393 28.034 20.0316 28.034 20.0239 28.034C20.0162 28.034 20.0085 28.034 20.0008 28.034C19.9931 28.034 19.9854 28.034 19.9777 28.034C19.97 28.034 19.9623 28.034 19.9546 28.034C19.9469 28.034 19.9392 28.034 19.9315 28.034C19.9238 28.034 19.9161 28.034 19.9084 28.034C19.9007 28.034 19.8929 28.034 19.8852 28.034C19.8775 28.034 19.8698 28.034 19.8621 28.034C19.8544 28.034 19.8466 28.034 19.8389 28.034C19.8312 28.034 19.8235 28.034 19.8158 28.034C19.808 28.034 19.8003 28.034 19.7926 28.034C19.7849 28.034 19.7771 28.034 19.7694 28.034C19.7617 28.034 19.754 28.034 19.7462 28.034C19.7385 28.034 19.7308 28.034 19.723 28.034C19.7153 28.034 19.7076 28.034 19.6998 28.034C19.6921 28.034 19.6844 28.034 19.6766 28.034C19.6689 28.034 19.6612 28.034 19.6534 28.034C19.6457 28.034 19.6379 28.034 19.6302 28.034C19.6224 28.034 19.6147 28.034 19.607 28.034C19.5992 28.034 19.5915 28.034 19.5837 28.034C19.576 28.034 19.5682 28.034 19.5605 28.034C19.5527 28.034 19.545 28.034 19.5372 28.034C19.5295 28.034 19.5217 28.034 19.514 28.034C19.5062 28.034 19.4984 28.034 19.4907 28.034C19.4829 28.034 19.4752 28.034 19.4674 28.034C19.4596 28.034 19.4519 28.034 19.4441 28.034C19.4364 28.034 19.4286 28.034 19.4208 28.034C19.4131 28.034 19.4053 28.034 19.3975 28.034C19.3898 28.034 19.382 28.034 19.3742 28.034C19.3664 28.034 19.3587 28.034 19.3509 28.034C19.3431 28.034 19.3353 28.034 19.3276 28.034C19.3198 28.034 19.312 28.034 19.3042 28.034C19.2965 28.034 19.2887 28.034 19.2809 28.034C19.2731 28.034 19.2653 28.034 19.2575 28.034C19.2498 28.034 19.242 28.034 19.2342 28.034C19.2264 28.034 19.2186 28.034 19.2108 28.034C19.203 28.034 19.1953 28.034 19.1875 28.034C19.1797 28.034 19.1719 28.034 19.1641 28.034C19.1563 28.034 19.1485 28.034 19.1407 28.034C19.1329 28.034 19.1251 28.034 19.1173 28.034C19.1095 28.034 19.1017 28.034 19.0939 28.034C19.0861 28.034 19.0783 28.034 19.0705 28.034C19.0627 28.034 19.0549 28.034 19.0471 28.034C19.0393 28.034 19.0315 28.034 19.0237 28.034C19.0158 28.034 19.008 28.034 19.0002 28.034C18.9924 28.034 18.9846 28.034 18.9768 28.034C18.969 28.034 18.9611 28.034 18.9533 28.034C18.9455 28.034 18.9377 28.034 18.9299 28.034C18.9221 28.034 18.9142 28.034 18.9064 28.034C18.8986 28.034 18.8908 28.034 18.8829 28.034C18.8751 28.034 18.8673 28.034 18.8595 28.034C18.8516 28.034 18.8438 28.034 18.836 28.034C18.8282 28.034 18.8203 28.034 18.8125 28.034C18.8047 28.034 18.7968 28.034 18.789 28.034C18.7812 28.034 18.7733 28.034 18.7655 28.034C18.7576 28.034 18.7498 28.034 18.742 28.034C18.7341 28.034 18.7263 28.034 18.7184 28.034C18.7106 28.034 18.7028 28.034 18.6949 28.034C18.6871 28.034 18.6792 28.034 18.6714 28.034C18.6635 28.034 18.6557 28.034 18.6478 28.034C18.64 28.034 18.6321 28.034 18.6243 28.034C18.6164 28.034 18.6086 28.034 18.6007 28.034C18.5929 28.034 18.585 28.034 18.5771 28.034C18.5693 28.034 18.5614 28.034 18.5536 28.034C18.5457 28.034 18.5378 28.034 18.53 28.034C18.5221 28.034 18.5143 28.034 18.5064 28.034C18.4985 28.034 18.4907 28.034 18.4828 28.034C18.4749 28.034 18.4671 28.034 18.4592 28.034C18.4513 28.034 18.4434 28.034 18.4356 28.034C18.4277 28.034 18.4198 28.034 18.4119 28.034C18.4041 28.034 18.3962 28.034 18.3883 28.034C18.3804 28.034 18.3726 28.034 18.3647 28.034C18.3568 28.034 18.3489 28.034 18.341 28.034C18.3332 28.034 18.3253 28.034 18.3174 28.034C18.3095 28.034 18.3016 28.034 18.2937 28.034C18.2858 28.034 18.278 28.034 18.2701 28.034C18.2622 28.034 18.2543 28.034 18.2464 28.034C18.2385 28.034 18.2306 28.034 18.2227 28.034C18.2148 28.034 18.2069 28.034 18.199 28.034C18.1911 28.034 18.1832 28.034 18.1753 28.034C18.1674 28.034 18.1595 28.034 18.1516 28.034C18.1437 28.034 18.1358 28.034 18.1279 28.034C18.12 28.034 18.1121 28.034 18.1042 28.034C18.0963 28.034 18.0884 28.034 18.0805 28.034C18.0725 28.034 18.0646 28.034 18.0567 28.034C18.0488 28.034 18.0409 28.034 18.033 28.034C18.0251 28.034 18.0172 28.034 18.0092 28.034C18.0013 28.034 17.9934 28.034 17.9855 28.034C17.9776 28.034 17.9696 28.034 17.9617 28.034C17.9538 28.034 17.9459 28.034 17.9379 28.034C17.93 28.034 17.9221 28.034 17.9142 28.034C17.9062 28.034 17.8983 28.034 17.8904 28.034C17.8824 28.034 17.8745 28.034 17.8666 28.034C17.8587 28.034 17.8507 28.034 17.8428 28.034C17.8348 28.034 17.8269 28.034 17.819 28.034C17.811 28.034 17.8031 28.034 17.7952 28.034C17.7872 28.034 17.7793 28.034 17.7713 28.034C17.7634 28.034 17.7555 28.034 17.7475 28.034C17.7396 28.034 17.7316 28.034 17.7237 28.034C17.7157 28.034 17.7078 28.034 17.6998 28.034C17.6919 28.034 17.6839 28.034 17.676 28.034C17.668 28.034 17.6601 28.034 17.6521 28.034C17.6442 28.034 17.6362 28.034 17.6282 28.034C17.6203 28.034 17.6123 28.034 17.6044 28.034C17.5964 28.034 17.5884 28.034 17.5805 28.034C17.5725 28.034 17.5646 28.034 17.5566 28.034C17.5486 28.034 17.5407 28.034 17.5327 28.034C17.5247 28.034 17.5168 28.034 17.5088 28.034C17.5008 28.034 17.4929 28.034 17.4849 28.034C17.4769 28.034 17.4689 28.034 17.461 28.034C17.453 28.034 17.445 28.034 17.437 28.034C17.4291 28.034 17.4211 28.034 17.4131 28.034C17.4051 28.034 17.3971 28.034 17.3892 28.034C17.3812 28.034 17.3732 28.034 17.3652 28.034C17.3572 28.034 17.3492 28.034 17.3413 28.034C17.3333 28.034 17.3253 28.034 17.3173 28.034C17.3093 28.034 17.3013 28.034 17.2933 28.034C17.2853 28.034 17.2773 28.034 17.2693 28.034C17.2614 28.034 17.2534 28.034 17.2454 28.034C17.2374 28.034 17.2294 28.034 17.2214 28.034C17.2134 28.034 17.2054 28.034 17.1974 28.034C17.1894 28.034 17.1814 28.034 17.1734 28.034C17.1654 28.034 17.1574 28.034 17.1493 28.034C17.1413 28.034 17.1333 28.034 17.1253 28.034C17.1173 28.034 17.1093 28.034 17.1013 28.034C17.0933 28.034 17.0853 28.034 17.0773 28.034C17.0692 28.034 17.0612 28.034 17.0532 28.034C17.0452 28.034 17.0372 28.034 17.0292 28.034C17.0211 28.034 17.0131 28.034 17.0051 28.034C16.9971 28.034 16.9891 28.034 16.981 28.034C16.973 28.034 16.965 28.034 16.957 28.034C16.9489 28.034 16.9409 28.034 16.9329 28.034C16.9249 28.034 16.9168 28.034 16.9088 28.034C16.9008 28.034 16.8927 28.034 16.8847 28.034C16.8767 28.034 16.8686 28.034 16.8606 28.034C16.8526 28.034 16.8445 28.034 16.8365 28.034C16.8285 28.034 16.8204 28.034 16.8124 28.034C16.8043 28.034 16.7963 28.034 16.7883 28.034C16.7802 28.034 16.7722 28.034 16.7641 28.034C16.7561 28.034 16.748 28.034 16.74 28.034C16.7319 28.034 16.7239 28.034 16.7158 28.034C16.7078 28.034 16.6997 28.034 16.6917 28.034C16.6836 28.034 16.6756 28.034 16.6675 28.034C16.6595 28.034 16.6514 28.034 16.6434 28.034C16.6353 28.034 16.6272 28.034 16.6192 28.034C16.6111 28.034 16.6031 28.034 16.595 28.034C16.5869 28.034 16.5789 28.034 16.5708 28.034C16.5628 28.034 16.5547 28.034 16.5466 28.034C16.5386 28.034 16.5305 28.034 16.5224 28.034C16.5144 28.034 16.5063 28.034 16.4982 28.034C16.4901 28.034 16.4821 28.034 16.474 28.034C16.4659 28.034 16.4578 28.034 16.4498 28.034C16.4417 28.034 16.4336 28.034 16.4255 28.034C16.4175 28.034 16.4094 28.034 16.4013 28.034C16.3932 28.034 16.3851 28.034 16.3771 28.034C16.369 28.034 16.3609 28.034 16.3528 28.034C16.3447 28.034 16.3366 28.034 16.3285 28.034C16.3205 28.034 16.3124 28.034 16.3043 28.034C16.2962 28.034 16.2881 28.034 16.28 28.034C16.2719 28.034 16.2638 28.034 16.2557 28.034C16.2476 28.034 16.2395 28.034 16.2314 28.034C16.2233 28.034 16.2152 28.034 16.2071 28.034C16.199 28.034 16.1909 28.034 16.1828 28.034C16.1747 28.034 16.1666 28.034 16.1585 28.034C16.1504 28.034 16.1423 28.034 16.1342 28.034C16.1261 28.034 16.118 28.034 16.1099 28.034C16.1018 28.034 16.0937 28.034 16.0855 28.034C16.0774 28.034 16.0693 28.034 16.0612 28.034C16.0531 28.034 16.045 28.034 16.0369 28.034C16.0287 28.034 16.0206 28.034 16.0125 28.034C16.0044 28.034 15.9963 28.034 15.9882 28.034C15.98 28.034 15.9719 28.034 15.9638 28.034C15.9557 28.034 15.9475 28.034 15.9394 28.034C15.9313 28.034 15.9232 28.034 15.915 28.034C15.9069 28.034 15.8988 28.034 15.8906 28.034C15.8825 28.034 15.8744 28.034 15.8662 28.034C15.8581 28.034 15.85 28.034 15.8418 28.034C15.8337 28.034 15.8256 28.034 15.8174 28.034C15.8093 28.034 15.8012 28.034 15.793 28.034C15.7849 28.034 15.7767 28.034 15.7686 28.034C15.7605 28.034 15.7523 28.034 15.7442 28.034C15.736 28.034 15.7279 28.034 15.7197 28.034C15.7116 28.034 15.7034 28.034 15.6953 28.034C15.6871 28.034 15.679 28.034 15.6708 28.034C15.6627 28.034 15.6545 28.034 15.6464 28.034C15.6382 28.034 15.6301 28.034 15.6219 28.034C15.6138 28.034 15.6056 28.034 15.5974 28.034C15.5893 28.034 15.5811 28.034 15.573 28.034C15.5648 28.034 15.5566 28.034 15.5485 28.034C15.5403 28.034 15.5321 28.034 15.524 28.034C15.5158 28.034 15.5076 28.034 15.4995 28.034C15.4913 28.034 15.4831 28.034 15.475 28.034C15.4668 28.034 15.4586 28.034 15.4505 28.034C15.4423 28.034 15.4341 28.034 15.4259 28.034C15.4178 28.034 15.4096 28.034 15.4014 28.034C15.3932 28.034 15.385 28.034 15.3769 28.034C15.3687 28.034 15.3605 28.034 15.3523 28.034C15.3441 28.034 15.336 28.034 15.3278 28.034C15.3196 28.034 15.3114 28.034 15.3032 28.034C15.295 28.034 15.2868 28.034 15.2787 28.034C15.2705 28.034 15.2623 28.034 15.2541 28.034C15.2459 28.034 15.2377 28.034 15.2295 28.034C15.2213 28.034 15.2131 28.034 15.2049 28.034C15.1967 28.034 15.1885 28.034 15.1803 28.034C15.1721 28.034 15.1639 28.034 15.1557 28.034C15.1475 28.034 15.1393 28.034 15.1311 28.034C15.1229 28.034 15.1147 28.034 15.1065 28.034C15.0983 28.034 15.0901 28.034 15.0819 28.034C15.0737 28.034 15.0655 28.034 15.0573 28.034C15.0491 28.034 15.0409 28.034 15.0326 28.034C15.0244 28.034 15.0162 28.034 15.008 28.034C14.9998 28.034 14.9916 28.034 14.9834 28.034C14.9751 28.034 14.9669 28.034 14.9587 28.034C14.9505 28.034 14.9423 28.034 14.934 28.034C14.9258 28.034 14.9176 28.034 14.9094 28.034C14.9011 28.034 14.8929 28.034 14.8847 28.034C14.8765 28.034 14.8682 28.034 14.86 28.034C14.8518 28.034 14.8436 28.034 14.8353 28.034C14.8271 28.034 14.8189 28.034 14.8106 28.034C14.8024 28.034 14.7942 28.034 14.7859 28.034C14.7777 28.034 14.7695 28.034 14.7612 28.034C14.753 28.034 14.7447 28.034 14.7365 28.034C14.7283 28.034 14.72 28.034 14.7118 28.034C14.7035 28.034 14.6953 28.034 14.6871 28.034C14.6788 28.034 14.6706 28.034 14.6623 28.034C14.6541 28.034 14.6458 28.034 14.6376 28.034C14.6293 28.034 14.6211 28.034 14.6128 28.034C14.6046 28.034 14.5963 28.034 14.5881 28.034C14.5798 28.034 14.5716 28.034 14.5633 28.034C14.555 28.034 14.5468 28.034 14.5385 28.034C14.5303 28.034 14.522 28.034 14.5138 28.034C14.5055 28.034 14.4972 28.034 14.489 28.034C14.4807 28.034 14.4724 28.034 14.4642 28.034C14.4559 28.034 14.4476 28.034 14.4394 28.034C14.4311 28.034 14.4228 28.034 14.4146 28.034C14.4063 28.034 14.398 28.034 14.3898 28.034C14.3815 28.034 14.3732 28.034 14.3649 28.034C14.3567 28.034 14.3484 28.034 14.3401 28.034C14.3318 28.034 14.3236 28.034 14.3153 28.034C14.307 28.034 14.2987 28.034 14.2905 28.034C14.2822 28.034 14.2739 28.034 14.2656 28.034C14.2573 28.034 14.249 28.034 14.2408 28.034C14.2325 28.034 14.2242 28.034 14.2159 28.034C14.2076 28.034 14.1993 28.034 14.191 28.034C14.1827 28.034 14.1745 28.034 14.1662 28.034C14.1579 28.034 14.1496 28.034 14.1413 28.034C14.133 28.034 14.1247 28.034 14.1164 28.034C14.1081 28.034 14.0998 28.034 14.0915 28.034C14.0832 28.034 14.0749 28.034 14.0666 28.034C14.0583 28.034 14.05 28.034 14.0417 28.034C14.0334 28.034 14.0251 28.034 14.0168 28.034C14.0085 28.034 14.0002 28.034 13.9919 28.034C13.9836 28.034 13.9752 28.034 13.9669 28.034C13.9586 28.034 13.9503 28.034 13.942 28.034C13.9337 28.034 13.9254 28.034 13.9171 28.034C13.9087 28.034 13.9004 28.034 13.8921 28.034C13.8838 28.034 13.8755 28.034 13.8672 28.034C13.8588 28.034 13.8505 28.034 13.8422 28.034C13.8339 28.034 13.8256 28.034 13.8172 28.034C13.8089 28.034 13.8006 28.034 13.7923 28.034C13.7839 28.034 13.7756 28.034 13.7673 28.034C13.759 28.034 13.7506 28.034 13.7423 28.034C13.734 28.034 13.7256 28.034 13.7173 28.034C13.709 28.034 13.7006 28.034 13.6923 28.034C13.684 28.034 13.6756 28.034 13.6673 28.034C13.659 28.034 13.6506 28.034 13.6423 28.034C13.6339 28.034 13.6256 28.034 13.6173 28.034C13.6089 28.034 13.6006 28.034 13.5922 28.034V29.034ZM28.932 29.034C28.9343 29.034 28.9366 29.034 28.9389 29.034C28.9411 29.034 28.9434 29.034 28.9457 29.034C28.9479 29.034 28.9502 29.034 28.9525 29.034C28.9547 29.034 28.957 29.034 28.9593 29.034C28.9615 29.034 28.9638 29.034 28.9661 29.034C28.9683 29.034 28.9706 29.034 28.9728 29.034C28.9751 29.034 28.9774 29.034 28.9796 29.034C28.9819 29.034 28.9841 29.034 28.9864 29.034C28.9886 29.034 28.9909 29.034 28.9931 29.034C28.9954 29.034 28.9976 29.034 28.9999 29.034C29.0021 29.034 29.0043 29.034 29.0066 29.034C29.0088 29.034 29.0111 29.034 29.0133 29.034C29.0156 29.034 29.0178 29.034 29.02 29.034C29.0223 29.034 29.0245 29.034 29.0267 29.034C29.029 29.034 29.0312 29.034 29.0334 29.034C29.0357 29.034 29.0379 29.034 29.0401 29.034C29.0424 29.034 29.0446 29.034 29.0468 29.034C29.049 29.034 29.0513 29.034 29.0535 29.034C29.0557 29.034 29.0579 29.034 29.0601 29.034C29.0624 29.034 29.0646 29.034 29.0668 29.034C29.069 29.034 29.0712 29.034 29.0734 29.034C29.0757 29.034 29.0779 29.034 29.0801 29.034C29.0823 29.034 29.0845 29.034 29.0867 29.034C29.0889 29.034 29.0911 29.034 29.0933 29.034C29.0955 29.034 29.0977 29.034 29.0999 29.034C29.1021 29.034 29.1043 29.034 29.1065 29.034C29.1087 29.034 29.1109 29.034 29.1131 29.034C29.1153 29.034 29.1175 29.034 29.1197 29.034C29.1219 29.034 29.1241 29.034 29.1263 29.034C29.1285 29.034 29.1307 29.034 29.1329 29.034C29.135 29.034 29.1372 29.034 29.1394 29.034C29.1416 29.034 29.1438 29.034 29.146 29.034C29.1481 29.034 29.1503 29.034 29.1525 29.034C29.1547 29.034 29.1569 29.034 29.159 29.034C29.1612 29.034 29.1634 29.034 29.1656 29.034C29.1677 29.034 29.1699 29.034 29.1721 29.034C29.1742 29.034 29.1764 29.034 29.1786 29.034C29.1807 29.034 29.1829 29.034 29.1851 29.034C29.1872 29.034 29.1894 29.034 29.1916 29.034C29.1937 29.034 29.1959 29.034 29.198 29.034C29.2002 29.034 29.2023 29.034 29.2045 29.034C29.2067 29.034 29.2088 29.034 29.211 29.034C29.2131 29.034 29.2153 29.034 29.2174 29.034C29.2196 29.034 29.2217 29.034 29.2239 29.034C29.226 29.034 29.2282 29.034 29.2303 29.034C29.2324 29.034 29.2346 29.034 29.2367 29.034C29.2389 29.034 29.241 29.034 29.2431 29.034C29.2453 29.034 29.2474 29.034 29.2495 29.034C29.2517 29.034 29.2538 29.034 29.2559 29.034C29.2581 29.034 29.2602 29.034 29.2623 29.034C29.2645 29.034 29.2666 29.034 29.2687 29.034C29.2708 29.034 29.273 29.034 29.2751 29.034C29.2772 29.034 29.2793 29.034 29.2815 29.034C29.2836 29.034 29.2857 29.034 29.2878 29.034C29.2899 29.034 29.2921 29.034 29.2942 29.034C29.2963 29.034 29.2984 29.034 29.3005 29.034C29.3026 29.034 29.3047 29.034 29.3068 29.034C29.309 29.034 29.3111 29.034 29.3132 29.034C29.3153 29.034 29.3174 29.034 29.3195 29.034C29.3216 29.034 29.3237 29.034 29.3258 29.034C29.3279 29.034 29.33 29.034 29.3321 29.034C29.3342 29.034 29.3363 29.034 29.3384 29.034C29.3405 29.034 29.3426 29.034 29.3446 29.034C29.3467 29.034 29.3488 29.034 29.3509 29.034C29.353 29.034 29.3551 29.034 29.3572 29.034C29.3593 29.034 29.3613 29.034 29.3634 29.034C29.3655 29.034 29.3676 29.034 29.3697 29.034C29.3718 29.034 29.3738 29.034 29.3759 29.034C29.378 29.034 29.3801 29.034 29.3821 29.034C29.3842 29.034 29.3863 29.034 29.3884 29.034C29.3904 29.034 29.3925 29.034 29.3946 29.034C29.3966 29.034 29.3987 29.034 29.4008 29.034C29.4028 29.034 29.4049 29.034 29.407 29.034C29.409 29.034 29.4111 29.034 29.4132 29.034C29.4152 29.034 29.4173 29.034 29.4193 29.034C29.4214 29.034 29.4234 29.034 29.4255 29.034C29.4276 29.034 29.4296 29.034 29.4317 29.034C29.4337 29.034 29.4358 29.034 29.4378 29.034C29.4399 29.034 29.4419 29.034 29.4439 29.034C29.446 29.034 29.448 29.034 29.4501 29.034C29.4521 29.034 29.4542 29.034 29.4562 29.034C29.4582 29.034 29.4603 29.034 29.4623 29.034C29.4644 29.034 29.4664 29.034 29.4684 29.034C29.4705 29.034 29.4725 29.034 29.4745 29.034C29.4766 29.034 29.4786 29.034 29.4806 29.034C29.4827 29.034 29.4847 29.034 29.4867 29.034C29.4887 29.034 29.4908 29.034 29.4928 29.034C29.4948 29.034 29.4968 29.034 29.4988 29.034C29.5009 29.034 29.5029 29.034 29.5049 29.034C29.5069 29.034 29.5089 29.034 29.5109 29.034C29.513 29.034 29.515 29.034 29.517 29.034C29.519 29.034 29.521 29.034 29.523 29.034C29.525 29.034 29.527 29.034 29.529 29.034C29.531 29.034 29.5331 29.034 29.5351 29.034C29.5371 29.034 29.5391 29.034 29.5411 29.034C29.5431 29.034 29.5451 29.034 29.5471 29.034C29.5491 29.034 29.5511 29.034 29.553 29.034C29.555 29.034 29.557 29.034 29.559 29.034C29.561 29.034 29.563 29.034 29.565 29.034C29.567 29.034 29.569 29.034 29.571 29.034C29.573 29.034 29.5749 29.034 29.5769 29.034C29.5789 29.034 29.5809 29.034 29.5829 29.034C29.5848 29.034 29.5868 29.034 29.5888 29.034C29.5908 29.034 29.5928 29.034 29.5947 29.034C29.5967 29.034 29.5987 29.034 29.6007 29.034C29.6026 29.034 29.6046 29.034 29.6066 29.034C29.6085 29.034 29.6105 29.034 29.6125 29.034C29.6144 29.034 29.6164 29.034 29.6184 29.034C29.6203 29.034 29.6223 29.034 29.6243 29.034C29.6262 29.034 29.6282 29.034 29.6301 29.034C29.6321 29.034 29.6341 29.034 29.636 29.034C29.638 29.034 29.6399 29.034 29.6419 29.034C29.6438 29.034 29.6458 29.034 29.6477 29.034C29.6497 29.034 29.6516 29.034 29.6536 29.034C29.6555 29.034 29.6575 29.034 29.6594 29.034C29.6613 29.034 29.6633 29.034 29.6652 29.034C29.6672 29.034 29.6691 29.034 29.6711 29.034C29.673 29.034 29.6749 29.034 29.6769 29.034C29.6788 29.034 29.6807 29.034 29.6827 29.034C29.6846 29.034 29.6865 29.034 29.6885 29.034C29.6904 29.034 29.6923 29.034 29.6943 29.034C29.6962 29.034 29.6981 29.034 29.7 29.034C29.702 29.034 29.7039 29.034 29.7058 29.034C29.7077 29.034 29.7096 29.034 29.7116 29.034C29.7135 29.034 29.7154 29.034 29.7173 29.034C29.7192 29.034 29.7211 29.034 29.7231 29.034C29.725 29.034 29.7269 29.034 29.7288 29.034C29.7307 29.034 29.7326 29.034 29.7345 29.034C29.7364 29.034 29.7383 29.034 29.7402 29.034C29.7422 29.034 29.7441 29.034 29.746 29.034C29.7479 29.034 29.7498 29.034 29.7517 29.034C29.7536 29.034 29.7555 29.034 29.7574 29.034C29.7593 29.034 29.7611 29.034 29.763 29.034C29.7649 29.034 29.7668 29.034 29.7687 29.034C29.7706 29.034 29.7725 29.034 29.7744 29.034C29.7763 29.034 29.7782 29.034 29.7801 29.034C29.7819 29.034 29.7838 29.034 29.7857 29.034C29.7876 29.034 29.7895 29.034 29.7914 29.034C29.7932 29.034 29.7951 29.034 29.797 29.034C29.7989 29.034 29.8007 29.034 29.8026 29.034C29.8045 29.034 29.8064 29.034 29.8082 29.034C29.8101 29.034 29.812 29.034 29.8139 29.034C29.8157 29.034 29.8176 29.034 29.8195 29.034C29.8213 29.034 29.8232 29.034 29.8251 29.034C29.8269 29.034 29.8288 29.034 29.8306 29.034C29.8325 29.034 29.8344 29.034 29.8362 29.034C29.8381 29.034 29.8399 29.034 29.8418 29.034C29.8436 29.034 29.8455 29.034 29.8474 29.034C29.8492 29.034 29.8511 29.034 29.8529 29.034C29.8548 29.034 29.8566 29.034 29.8585 29.034C29.8603 29.034 29.8621 29.034 29.864 29.034C29.8658 29.034 29.8677 29.034 29.8695 29.034C29.8714 29.034 29.8732 29.034 29.875 29.034C29.8769 29.034 29.8787 29.034 29.8806 29.034C29.8824 29.034 29.8842 29.034 29.8861 29.034C29.8879 29.034 29.8897 29.034 29.8916 29.034C29.8934 29.034 29.8952 29.034 29.897 29.034C29.8989 29.034 29.9007 29.034 29.9025 29.034C29.9043 29.034 29.9062 29.034 29.908 29.034C29.9098 29.034 29.9116 29.034 29.9135 29.034C29.9153 29.034 29.9171 29.034 29.9189 29.034C29.9207 29.034 29.9225 29.034 29.9244 29.034C29.9262 29.034 29.928 29.034 29.9298 29.034C29.9316 29.034 29.9334 29.034 29.9352 29.034C29.937 29.034 29.9389 29.034 29.9407 29.034C29.9425 29.034 29.9443 29.034 29.9461 29.034C29.9479 29.034 29.9497 29.034 29.9515 29.034C29.9533 29.034 29.9551 29.034 29.9569 29.034C29.9587 29.034 29.9605 29.034 29.9623 29.034C29.9641 29.034 29.9659 29.034 29.9676 29.034C29.9694 29.034 29.9712 29.034 29.973 29.034C29.9748 29.034 29.9766 29.034 29.9784 29.034C29.9802 29.034 29.982 29.034 29.9837 29.034C29.9855 29.034 29.9873 29.034 29.9891 29.034C29.9909 29.034 29.9927 29.034 29.9944 29.034C29.9962 29.034 29.998 29.034 29.9998 29.034C30.0015 29.034 30.0033 29.034 30.0051 29.034C30.0069 29.034 30.0086 29.034 30.0104 29.034C30.0122 29.034 30.014 29.034 30.0157 29.034C30.0175 29.034 30.0193 29.034 30.021 29.034C30.0228 29.034 30.0246 29.034 30.0263 29.034C30.0281 29.034 30.0298 29.034 30.0316 29.034C30.0334 29.034 30.0351 29.034 30.0369 29.034C30.0386 29.034 30.0404 29.034 30.0421 29.034C30.0439 29.034 30.0457 29.034 30.0474 29.034C30.0492 29.034 30.0509 29.034 30.0527 29.034C30.0544 29.034 30.0562 29.034 30.0579 29.034C30.0596 29.034 30.0614 29.034 30.0631 29.034C30.0649 29.034 30.0666 29.034 30.0684 29.034C30.0701 29.034 30.0718 29.034 30.0736 29.034C30.0753 29.034 30.0771 29.034 30.0788 29.034C30.0805 29.034 30.0823 29.034 30.084 29.034C30.0857 29.034 30.0875 29.034 30.0892 29.034C30.0909 29.034 30.0927 29.034 30.0944 29.034C30.0961 29.034 30.0978 29.034 30.0996 29.034C30.1013 29.034 30.103 29.034 30.1047 29.034C30.1065 29.034 30.1082 29.034 30.1099 29.034C30.1116 29.034 30.1133 29.034 30.1151 29.034C30.1168 29.034 30.1185 29.034 30.1202 29.034C30.1219 29.034 30.1236 29.034 30.1253 29.034C30.1271 29.034 30.1288 29.034 30.1305 29.034C30.1322 29.034 30.1339 29.034 30.1356 29.034C30.1373 29.034 30.139 29.034 30.1407 29.034C30.1424 29.034 30.1441 29.034 30.1458 29.034C30.1475 29.034 30.1492 29.034 30.1509 29.034C30.1526 29.034 30.1543 29.034 30.156 29.034C30.1577 29.034 30.1594 29.034 30.1611 29.034C30.1628 29.034 30.1645 29.034 30.1662 29.034C30.1679 29.034 30.1696 29.034 30.1712 29.034C30.1729 29.034 30.1746 29.034 30.1763 29.034C30.178 29.034 30.1797 29.034 30.1814 29.034C30.183 29.034 30.1847 29.034 30.1864 29.034C30.1881 29.034 30.1898 29.034 30.1914 29.034C30.1931 29.034 30.1948 29.034 30.1965 29.034C30.1981 29.034 30.1998 29.034 30.2015 29.034C30.2031 29.034 30.2048 29.034 30.2065 29.034C30.2082 29.034 30.2098 29.034 30.2115 29.034C30.2132 29.034 30.2148 29.034 30.2165 29.034C30.2182 29.034 30.2198 29.034 30.2215 29.034C30.2231 29.034 30.2248 29.034 30.2265 29.034C30.2281 29.034 30.2298 29.034 30.2314 29.034C30.2331 29.034 30.2347 29.034 30.2364 29.034C30.238 29.034 30.2397 29.034 30.2413 29.034C30.243 29.034 30.2446 29.034 30.2463 29.034C30.2479 29.034 30.2496 29.034 30.2512 29.034C30.2529 29.034 30.2545 29.034 30.2562 29.034C30.2578 29.034 30.2595 29.034 30.2611 29.034C30.2627 29.034 30.2644 29.034 30.266 29.034C30.2676 29.034 30.2693 29.034 30.2709 29.034C30.2726 29.034 30.2742 29.034 30.2758 29.034C30.2775 29.034 30.2791 29.034 30.2807 29.034C30.2823 29.034 30.284 29.034 30.2856 29.034C30.2872 29.034 30.2889 29.034 30.2905 29.034C30.2921 29.034 30.2937 29.034 30.2953 29.034C30.297 29.034 30.2986 29.034 30.3002 29.034C30.3018 29.034 30.3034 29.034 30.3051 29.034C30.3067 29.034 30.3083 29.034 30.3099 29.034C30.3115 29.034 30.3131 29.034 30.3147 29.034C30.3164 29.034 30.318 29.034 30.3196 29.034C30.3212 29.034 30.3228 29.034 30.3244 29.034C30.326 29.034 30.3276 29.034 30.3292 29.034C30.3308 29.034 30.3324 29.034 30.334 29.034C30.3356 29.034 30.3372 29.034 30.3388 29.034C30.3404 29.034 30.342 29.034 30.3436 29.034C30.3452 29.034 30.3468 29.034 30.3484 29.034C30.35 29.034 30.3516 29.034 30.3532 29.034C30.3548 29.034 30.3563 29.034 30.3579 29.034C30.3595 29.034 30.3611 29.034 30.3627 29.034C30.3643 29.034 30.3659 29.034 30.3674 29.034C30.369 29.034 30.3706 29.034 30.3722 29.034C30.3738 29.034 30.3753 29.034 30.3769 29.034C30.3785 29.034 30.3801 29.034 30.3816 29.034C30.3832 29.034 30.3848 29.034 30.3864 29.034C30.3879 29.034 30.3895 29.034 30.3911 29.034C30.3927 29.034 30.3942 29.034 30.3958 29.034C30.3974 29.034 30.3989 29.034 30.4005 29.034C30.402 29.034 30.4036 29.034 30.4052 29.034C30.4067 29.034 30.4083 29.034 30.4099 29.034C30.4114 29.034 30.413 29.034 30.4145 29.034C30.4161 29.034 30.4176 29.034 30.4192 29.034C30.4207 29.034 30.4223 29.034 30.4239 29.034C30.4254 29.034 30.427 29.034 30.4285 29.034C30.4301 29.034 30.4316 29.034 30.4331 29.034C30.4347 29.034 30.4362 29.034 30.4378 29.034C30.4393 29.034 30.4409 29.034 30.4424 29.034C30.444 29.034 30.4455 29.034 30.447 29.034C30.4486 29.034 30.4501 29.034 30.4516 29.034C30.4532 29.034 30.4547 29.034 30.4562 29.034C30.4578 29.034 30.4593 29.034 30.4608 29.034C30.4624 29.034 30.4639 29.034 30.4654 29.034C30.467 29.034 30.4685 29.034 30.47 29.034C30.4715 29.034 30.4731 29.034 30.4746 29.034C30.4761 29.034 30.4776 29.034 30.4791 29.034C30.4807 29.034 30.4822 29.034 30.4837 29.034C30.4852 29.034 30.4867 29.034 30.4883 29.034C30.4898 29.034 30.4913 29.034 30.4928 29.034C30.4943 29.034 30.4958 29.034 30.4973 29.034C30.4988 29.034 30.5004 29.034 30.5019 29.034C30.5034 29.034 30.5049 29.034 30.5064 29.034C30.5079 29.034 30.5094 29.034 30.5109 29.034C30.5124 29.034 30.5139 29.034 30.5154 29.034C30.5169 29.034 30.5184 29.034 30.5199 29.034C30.5214 29.034 30.5229 29.034 30.5244 29.034C30.5259 29.034 30.5274 29.034 30.5289 29.034C30.5304 29.034 30.5318 29.034 30.5333 29.034C30.5348 29.034 30.5363 29.034 30.5378 29.034C30.5393 29.034 30.5408 29.034 30.5423 29.034C30.5437 29.034 30.5452 29.034 30.5467 29.034C30.5482 29.034 30.5497 29.034 30.5512 29.034C30.5526 29.034 30.5541 29.034 30.5556 29.034C30.5571 29.034 30.5585 29.034 30.56 29.034C30.5615 29.034 30.563 29.034 30.5644 29.034C30.5659 29.034 30.5674 29.034 30.5688 29.034C30.5703 29.034 30.5718 29.034 30.5732 29.034C30.5747 29.034 30.5762 29.034 30.5776 29.034C30.5791 29.034 30.5806 29.034 30.582 29.034C30.5835 29.034 30.585 29.034 30.5864 29.034C30.5879 29.034 30.5893 29.034 30.5908 29.034C30.5922 29.034 30.5937 29.034 30.5952 29.034C30.5966 29.034 30.5981 29.034 30.5995 29.034C30.601 29.034 30.6024 29.034 30.6039 29.034C30.6053 29.034 30.6068 29.034 30.6082 29.034C30.6097 29.034 30.6111 29.034 30.6125 29.034C30.614 29.034 30.6154 29.034 30.6169 29.034C30.6183 29.034 30.6198 29.034 30.6212 29.034C30.6226 29.034 30.6241 29.034 30.6255 29.034C30.6269 29.034 30.6284 29.034 30.6298 29.034C30.6313 29.034 30.6327 29.034 30.6341 29.034C30.6355 29.034 30.637 29.034 30.6384 29.034C30.6398 29.034 30.6413 29.034 30.6427 29.034C30.6441 29.034 30.6455 29.034 30.647 29.034C30.6484 29.034 30.6498 29.034 30.6512 29.034C30.6527 29.034 30.6541 29.034 30.6555 29.034C30.6569 29.034 30.6583 29.034 30.6597 29.034C30.6612 29.034 30.6626 29.034 30.664 29.034C30.6654 29.034 30.6668 29.034 30.6682 29.034C30.6696 29.034 30.6711 29.034 30.6725 29.034C30.6739 29.034 30.6753 29.034 30.6767 29.034C30.6781 29.034 30.6795 29.034 30.6809 29.034C30.6823 29.034 30.6837 29.034 30.6851 29.034C30.6865 29.034 30.6879 29.034 30.6893 29.034C30.6907 29.034 30.6921 29.034 30.6935 29.034C30.6949 29.034 30.6963 29.034 30.6977 29.034C30.6991 29.034 30.7005 29.034 30.7019 29.034C30.7033 29.034 30.7046 29.034 30.706 29.034C30.7074 29.034 30.7088 29.034 30.7102 29.034C30.7116 29.034 30.713 29.034 30.7144 29.034C30.7157 29.034 30.7171 29.034 30.7185 29.034C30.7199 29.034 30.7213 29.034 30.7226 29.034C30.724 29.034 30.7254 29.034 30.7268 29.034C30.7282 29.034 30.7295 29.034 30.7309 29.034C30.7323 29.034 30.7337 29.034 30.735 29.034C30.7364 29.034 30.7378 29.034 30.7391 29.034C30.7405 29.034 30.7419 29.034 30.7432 29.034C30.7446 29.034 30.746 29.034 30.7473 29.034C30.7487 29.034 30.7501 29.034 30.7514 29.034C30.7528 29.034 30.7541 29.034 30.7555 29.034C30.7569 29.034 30.7582 29.034 30.7596 29.034C30.7609 29.034 30.7623 29.034 30.7636 29.034C30.765 29.034 30.7663 29.034 30.7677 29.034C30.7691 29.034 30.7704 29.034 30.7718 29.034C30.7731 29.034 30.7745 29.034 30.7758 29.034C30.7771 29.034 30.7785 29.034 30.7798 29.034C30.7812 29.034 30.7825 29.034 30.7839 29.034C30.7852 29.034 30.7865 29.034 30.7879 29.034C30.7892 29.034 30.7906 29.034 30.7919 29.034C30.7932 29.034 30.7946 29.034 30.7959 29.034C30.7972 29.034 30.7986 29.034 30.7999 29.034C30.8012 29.034 30.8026 29.034 30.8039 29.034C30.8052 29.034 30.8066 29.034 30.8079 29.034C30.8092 29.034 30.8105 29.034 30.8119 29.034C30.8132 29.034 30.8145 29.034 30.8158 29.034C30.8172 29.034 30.8185 29.034 30.8198 29.034C30.8211 29.034 30.8224 29.034 30.8237 29.034C30.8251 29.034 30.8264 29.034 30.8277 29.034C30.829 29.034 30.8303 29.034 30.8316 29.034C30.833 29.034 30.8343 29.034 30.8356 29.034C30.8369 29.034 30.8382 29.034 30.8395 29.034C30.8408 29.034 30.8421 29.034 30.8434 29.034C30.8447 29.034 30.846 29.034 30.8473 29.034C30.8486 29.034 30.8499 29.034 30.8512 29.034C30.8525 29.034 30.8538 29.034 30.8551 29.034C30.8564 29.034 30.8577 29.034 30.859 29.034C30.8603 29.034 30.8616 29.034 30.8629 29.034C30.8642 29.034 30.8655 29.034 30.8668 29.034C30.8681 29.034 30.8694 29.034 30.8706 29.034C30.8719 29.034 30.8732 29.034 30.8745 29.034C30.8758 29.034 30.8771 29.034 30.8784 29.034C30.8796 29.034 30.8809 29.034 30.8822 29.034C30.8835 29.034 30.8848 29.034 30.886 29.034C30.8873 29.034 30.8886 29.034 30.8899 29.034C30.8911 29.034 30.8924 29.034 30.8937 29.034C30.895 29.034 30.8962 29.034 30.8975 29.034C30.8988 29.034 30.9001 29.034 30.9013 29.034C30.9026 29.034 30.9039 29.034 30.9051 29.034C30.9064 29.034 30.9077 29.034 30.9089 29.034C30.9102 29.034 30.9114 29.034 30.9127 29.034C30.914 29.034 30.9152 29.034 30.9165 29.034C30.9177 29.034 30.919 29.034 30.9203 29.034C30.9215 29.034 30.9228 29.034 30.924 29.034C30.9253 29.034 30.9265 29.034 30.9278 29.034C30.929 29.034 30.9303 29.034 30.9315 29.034C30.9328 29.034 30.934 29.034 30.9353 29.034C30.9365 29.034 30.9378 29.034 30.939 29.034C30.9403 29.034 30.9415 29.034 30.9427 29.034C30.944 29.034 30.9452 29.034 30.9465 29.034C30.9477 29.034 30.9489 29.034 30.9502 29.034C30.9514 29.034 30.9527 29.034 30.9539 29.034C30.9551 29.034 30.9564 29.034 30.9576 29.034C30.9588 29.034 30.9601 29.034 30.9613 29.034C30.9625 29.034 30.9637 29.034 30.965 29.034C30.9662 29.034 30.9674 29.034 30.9687 29.034C30.9699 29.034 30.9711 29.034 30.9723 29.034C30.9735 29.034 30.9748 29.034 30.976 29.034C30.9772 29.034 30.9784 29.034 30.9796 29.034C30.9809 29.034 30.9821 29.034 30.9833 29.034C30.9845 29.034 30.9857 29.034 30.9869 29.034C30.9882 29.034 30.9894 29.034 30.9906 29.034C30.9918 29.034 30.993 29.034 30.9942 29.034C30.9954 29.034 30.9966 29.034 30.9978 29.034C30.999 29.034 31.0002 29.034 31.0014 29.034C31.0026 29.034 31.0038 29.034 31.005 29.034C31.0062 29.034 31.0075 29.034 31.0086 29.034C31.0098 29.034 31.011 29.034 31.0122 29.034C31.0134 29.034 31.0146 29.034 31.0158 29.034C31.017 29.034 31.0182 29.034 31.0194 29.034C31.0206 29.034 31.0218 29.034 31.023 29.034C31.0242 29.034 31.0254 29.034 31.0265 29.034C31.0277 29.034 31.0289 29.034 31.0301 29.034C31.0313 29.034 31.0325 29.034 31.0337 29.034C31.0348 29.034 31.036 29.034 31.0372 29.034C31.0384 29.034 31.0396 29.034 31.0407 29.034C31.0419 29.034 31.0431 29.034 31.0443 29.034C31.0454 29.034 31.0466 29.034 31.0478 29.034C31.049 29.034 31.0501 29.034 31.0513 29.034C31.0525 29.034 31.0536 29.034 31.0548 29.034C31.056 29.034 31.0571 29.034 31.0583 29.034C31.0595 29.034 31.0606 29.034 31.0618 29.034C31.063 29.034 31.0641 29.034 31.0653 29.034C31.0664 29.034 31.0676 29.034 31.0688 29.034C31.0699 29.034 31.0711 29.034 31.0722 29.034C31.0734 29.034 31.0745 29.034 31.0757 29.034C31.0769 29.034 31.078 29.034 31.0792 29.034C31.0803 29.034 31.0815 29.034 31.0826 29.034C31.0838 29.034 31.0849 29.034 31.0861 29.034C31.0872 29.034 31.0884 29.034 31.0895 29.034C31.0906 29.034 31.0918 29.034 31.0929 29.034C31.0941 29.034 31.0952 29.034 31.0963 29.034C31.0975 29.034 31.0986 29.034 31.0998 29.034C31.1009 29.034 31.102 29.034 31.1032 29.034C31.1043 29.034 31.1054 29.034 31.1066 29.034C31.1077 29.034 31.1088 29.034 31.11 29.034C31.1111 29.034 31.1122 29.034 31.1134 29.034C31.1145 29.034 31.1156 29.034 31.1167 29.034C31.1179 29.034 31.119 29.034 31.1201 29.034C31.1212 29.034 31.1224 29.034 31.1235 29.034C31.1246 29.034 31.1257 29.034 31.1268 29.034C31.128 29.034 31.1291 29.034 31.1302 29.034C31.1313 29.034 31.1324 29.034 31.1335 29.034C31.1347 29.034 31.1358 29.034 31.1369 29.034C31.138 29.034 31.1391 29.034 31.1402 29.034C31.1413 29.034 31.1424 29.034 31.1435 29.034C31.1446 29.034 31.1458 29.034 31.1469 29.034C31.148 29.034 31.1491 29.034 31.1502 29.034C31.1513 29.034 31.1524 29.034 31.1535 29.034C31.1546 29.034 31.1557 29.034 31.1568 29.034C31.1579 29.034 31.159 29.034 31.1601 29.034C31.1612 29.034 31.1622 29.034 31.1633 29.034C31.1644 29.034 31.1655 29.034 31.1666 29.034C31.1677 29.034 31.1688 29.034 31.1699 29.034C31.171 29.034 31.1721 29.034 31.1731 29.034C31.1742 29.034 31.1753 29.034 31.1764 29.034C31.1775 29.034 31.1786 29.034 31.1797 29.034C31.1807 29.034 31.1818 29.034 31.1829 29.034C31.184 29.034 31.1851 29.034 31.1861 29.034C31.1872 29.034 31.1883 29.034 31.1894 29.034C31.1904 29.034 31.1915 29.034 31.1926 29.034C31.1937 29.034 31.1947 29.034 31.1958 29.034C31.1969 29.034 31.1979 29.034 31.199 29.034C31.2001 29.034 31.2011 29.034 31.2022 29.034C31.2033 29.034 31.2043 29.034 31.2054 29.034C31.2065 29.034 31.2075 29.034 31.2086 29.034C31.2096 29.034 31.2107 29.034 31.2118 29.034C31.2128 29.034 31.2139 29.034 31.2149 29.034C31.216 29.034 31.217 29.034 31.2181 29.034C31.2192 29.034 31.2202 29.034 31.2213 29.034C31.2223 29.034 31.2234 29.034 31.2244 29.034C31.2255 29.034 31.2265 29.034 31.2276 29.034C31.2286 29.034 31.2296 29.034 31.2307 29.034C31.2317 29.034 31.2328 29.034 31.2338 29.034C31.2349 29.034 31.2359 29.034 31.2369 29.034C31.238 29.034 31.239 29.034 31.2401 29.034C31.2411 29.034 31.2421 29.034 31.2432 29.034C31.2442 29.034 31.2453 29.034 31.2463 29.034C31.2473 29.034 31.2484 29.034 31.2494 29.034C31.2504 29.034 31.2514 29.034 31.2525 29.034C31.2535 29.034 31.2545 29.034 31.2556 29.034C31.2566 29.034 31.2576 29.034 31.2586 29.034C31.2597 29.034 31.2607 29.034 31.2617 29.034C31.2627 29.034 31.2637 29.034 31.2648 29.034C31.2658 29.034 31.2668 29.034 31.2678 29.034C31.2688 29.034 31.2699 29.034 31.2709 29.034C31.2719 29.034 31.2729 29.034 31.2739 29.034C31.2749 29.034 31.2759 29.034 31.277 29.034C31.278 29.034 31.279 29.034 31.28 29.034C31.281 29.034 31.282 29.034 31.283 29.034C31.284 29.034 31.285 29.034 31.286 29.034C31.287 29.034 31.288 29.034 31.289 29.034C31.29 29.034 31.291 29.034 31.292 29.034C31.293 29.034 31.294 29.034 31.295 29.034C31.296 29.034 31.297 29.034 31.298 29.034C31.299 29.034 31.3 29.034 31.301 29.034C31.302 29.034 31.303 29.034 31.304 29.034C31.305 29.034 31.306 29.034 31.3069 29.034C31.3079 29.034 31.3089 29.034 31.3099 29.034C31.3109 29.034 31.3119 29.034 31.3129 29.034C31.3138 29.034 31.3148 29.034 31.3158 29.034C31.3168 29.034 31.3178 29.034 31.3187 29.034C31.3197 29.034 31.3207 29.034 31.3217 29.034C31.3227 29.034 31.3236 29.034 31.3246 29.034C31.3256 29.034 31.3266 29.034 31.3275 29.034C31.3285 29.034 31.3295 29.034 31.3304 29.034C31.3314 29.034 31.3324 29.034 31.3334 29.034C31.3343 29.034 31.3353 29.034 31.3363 29.034C31.3372 29.034 31.3382 29.034 31.3391 29.034C31.3401 29.034 31.3411 29.034 31.342 29.034C31.343 29.034 31.344 29.034 31.3449 29.034C31.3459 29.034 31.3468 29.034 31.3478 29.034C31.3487 29.034 31.3497 29.034 31.3507 29.034C31.3516 29.034 31.3526 29.034 31.3535 29.034C31.3545 29.034 31.3554 29.034 31.3564 29.034C31.3573 29.034 31.3583 29.034 31.3592 29.034V28.034C31.3583 28.034 31.3573 28.034 31.3564 28.034C31.3554 28.034 31.3545 28.034 31.3535 28.034C31.3526 28.034 31.3516 28.034 31.3507 28.034C31.3497 28.034 31.3487 28.034 31.3478 28.034C31.3468 28.034 31.3459 28.034 31.3449 28.034C31.344 28.034 31.343 28.034 31.342 28.034C31.3411 28.034 31.3401 28.034 31.3391 28.034C31.3382 28.034 31.3372 28.034 31.3363 28.034C31.3353 28.034 31.3343 28.034 31.3334 28.034C31.3324 28.034 31.3314 28.034 31.3304 28.034C31.3295 28.034 31.3285 28.034 31.3275 28.034C31.3266 28.034 31.3256 28.034 31.3246 28.034C31.3236 28.034 31.3227 28.034 31.3217 28.034C31.3207 28.034 31.3197 28.034 31.3187 28.034C31.3178 28.034 31.3168 28.034 31.3158 28.034C31.3148 28.034 31.3138 28.034 31.3129 28.034C31.3119 28.034 31.3109 28.034 31.3099 28.034C31.3089 28.034 31.3079 28.034 31.3069 28.034C31.306 28.034 31.305 28.034 31.304 28.034C31.303 28.034 31.302 28.034 31.301 28.034C31.3 28.034 31.299 28.034 31.298 28.034C31.297 28.034 31.296 28.034 31.295 28.034C31.294 28.034 31.293 28.034 31.292 28.034C31.291 28.034 31.29 28.034 31.289 28.034C31.288 28.034 31.287 28.034 31.286 28.034C31.285 28.034 31.284 28.034 31.283 28.034C31.282 28.034 31.281 28.034 31.28 28.034C31.279 28.034 31.278 28.034 31.277 28.034C31.2759 28.034 31.2749 28.034 31.2739 28.034C31.2729 28.034 31.2719 28.034 31.2709 28.034C31.2699 28.034 31.2688 28.034 31.2678 28.034C31.2668 28.034 31.2658 28.034 31.2648 28.034C31.2637 28.034 31.2627 28.034 31.2617 28.034C31.2607 28.034 31.2597 28.034 31.2586 28.034C31.2576 28.034 31.2566 28.034 31.2556 28.034C31.2545 28.034 31.2535 28.034 31.2525 28.034C31.2514 28.034 31.2504 28.034 31.2494 28.034C31.2484 28.034 31.2473 28.034 31.2463 28.034C31.2453 28.034 31.2442 28.034 31.2432 28.034C31.2421 28.034 31.2411 28.034 31.2401 28.034C31.239 28.034 31.238 28.034 31.2369 28.034C31.2359 28.034 31.2349 28.034 31.2338 28.034C31.2328 28.034 31.2317 28.034 31.2307 28.034C31.2296 28.034 31.2286 28.034 31.2276 28.034C31.2265 28.034 31.2255 28.034 31.2244 28.034C31.2234 28.034 31.2223 28.034 31.2213 28.034C31.2202 28.034 31.2192 28.034 31.2181 28.034C31.217 28.034 31.216 28.034 31.2149 28.034C31.2139 28.034 31.2128 28.034 31.2118 28.034C31.2107 28.034 31.2096 28.034 31.2086 28.034C31.2075 28.034 31.2065 28.034 31.2054 28.034C31.2043 28.034 31.2033 28.034 31.2022 28.034C31.2011 28.034 31.2001 28.034 31.199 28.034C31.1979 28.034 31.1969 28.034 31.1958 28.034C31.1947 28.034 31.1937 28.034 31.1926 28.034C31.1915 28.034 31.1904 28.034 31.1894 28.034C31.1883 28.034 31.1872 28.034 31.1861 28.034C31.1851 28.034 31.184 28.034 31.1829 28.034C31.1818 28.034 31.1807 28.034 31.1797 28.034C31.1786 28.034 31.1775 28.034 31.1764 28.034C31.1753 28.034 31.1742 28.034 31.1731 28.034C31.1721 28.034 31.171 28.034 31.1699 28.034C31.1688 28.034 31.1677 28.034 31.1666 28.034C31.1655 28.034 31.1644 28.034 31.1633 28.034C31.1622 28.034 31.1612 28.034 31.1601 28.034C31.159 28.034 31.1579 28.034 31.1568 28.034C31.1557 28.034 31.1546 28.034 31.1535 28.034C31.1524 28.034 31.1513 28.034 31.1502 28.034C31.1491 28.034 31.148 28.034 31.1469 28.034C31.1458 28.034 31.1446 28.034 31.1435 28.034C31.1424 28.034 31.1413 28.034 31.1402 28.034C31.1391 28.034 31.138 28.034 31.1369 28.034C31.1358 28.034 31.1347 28.034 31.1335 28.034C31.1324 28.034 31.1313 28.034 31.1302 28.034C31.1291 28.034 31.128 28.034 31.1268 28.034C31.1257 28.034 31.1246 28.034 31.1235 28.034C31.1224 28.034 31.1212 28.034 31.1201 28.034C31.119 28.034 31.1179 28.034 31.1167 28.034C31.1156 28.034 31.1145 28.034 31.1134 28.034C31.1122 28.034 31.1111 28.034 31.11 28.034C31.1088 28.034 31.1077 28.034 31.1066 28.034C31.1054 28.034 31.1043 28.034 31.1032 28.034C31.102 28.034 31.1009 28.034 31.0998 28.034C31.0986 28.034 31.0975 28.034 31.0963 28.034C31.0952 28.034 31.0941 28.034 31.0929 28.034C31.0918 28.034 31.0906 28.034 31.0895 28.034C31.0884 28.034 31.0872 28.034 31.0861 28.034C31.0849 28.034 31.0838 28.034 31.0826 28.034C31.0815 28.034 31.0803 28.034 31.0792 28.034C31.078 28.034 31.0769 28.034 31.0757 28.034C31.0745 28.034 31.0734 28.034 31.0722 28.034C31.0711 28.034 31.0699 28.034 31.0688 28.034C31.0676 28.034 31.0664 28.034 31.0653 28.034C31.0641 28.034 31.063 28.034 31.0618 28.034C31.0606 28.034 31.0595 28.034 31.0583 28.034C31.0571 28.034 31.056 28.034 31.0548 28.034C31.0536 28.034 31.0525 28.034 31.0513 28.034C31.0501 28.034 31.049 28.034 31.0478 28.034C31.0466 28.034 31.0454 28.034 31.0443 28.034C31.0431 28.034 31.0419 28.034 31.0407 28.034C31.0396 28.034 31.0384 28.034 31.0372 28.034C31.036 28.034 31.0348 28.034 31.0337 28.034C31.0325 28.034 31.0313 28.034 31.0301 28.034C31.0289 28.034 31.0277 28.034 31.0265 28.034C31.0254 28.034 31.0242 28.034 31.023 28.034C31.0218 28.034 31.0206 28.034 31.0194 28.034C31.0182 28.034 31.017 28.034 31.0158 28.034C31.0146 28.034 31.0134 28.034 31.0122 28.034C31.011 28.034 31.0098 28.034 31.0086 28.034C31.0075 28.034 31.0062 28.034 31.005 28.034C31.0038 28.034 31.0026 28.034 31.0014 28.034C31.0002 28.034 30.999 28.034 30.9978 28.034C30.9966 28.034 30.9954 28.034 30.9942 28.034C30.993 28.034 30.9918 28.034 30.9906 28.034C30.9894 28.034 30.9882 28.034 30.9869 28.034C30.9857 28.034 30.9845 28.034 30.9833 28.034C30.9821 28.034 30.9809 28.034 30.9796 28.034C30.9784 28.034 30.9772 28.034 30.976 28.034C30.9748 28.034 30.9735 28.034 30.9723 28.034C30.9711 28.034 30.9699 28.034 30.9687 28.034C30.9674 28.034 30.9662 28.034 30.965 28.034C30.9637 28.034 30.9625 28.034 30.9613 28.034C30.9601 28.034 30.9588 28.034 30.9576 28.034C30.9564 28.034 30.9551 28.034 30.9539 28.034C30.9527 28.034 30.9514 28.034 30.9502 28.034C30.9489 28.034 30.9477 28.034 30.9465 28.034C30.9452 28.034 30.944 28.034 30.9427 28.034C30.9415 28.034 30.9403 28.034 30.939 28.034C30.9378 28.034 30.9365 28.034 30.9353 28.034C30.934 28.034 30.9328 28.034 30.9315 28.034C30.9303 28.034 30.929 28.034 30.9278 28.034C30.9265 28.034 30.9253 28.034 30.924 28.034C30.9228 28.034 30.9215 28.034 30.9203 28.034C30.919 28.034 30.9177 28.034 30.9165 28.034C30.9152 28.034 30.914 28.034 30.9127 28.034C30.9114 28.034 30.9102 28.034 30.9089 28.034C30.9077 28.034 30.9064 28.034 30.9051 28.034C30.9039 28.034 30.9026 28.034 30.9013 28.034C30.9001 28.034 30.8988 28.034 30.8975 28.034C30.8962 28.034 30.895 28.034 30.8937 28.034C30.8924 28.034 30.8911 28.034 30.8899 28.034C30.8886 28.034 30.8873 28.034 30.886 28.034C30.8848 28.034 30.8835 28.034 30.8822 28.034C30.8809 28.034 30.8796 28.034 30.8784 28.034C30.8771 28.034 30.8758 28.034 30.8745 28.034C30.8732 28.034 30.8719 28.034 30.8706 28.034C30.8694 28.034 30.8681 28.034 30.8668 28.034C30.8655 28.034 30.8642 28.034 30.8629 28.034C30.8616 28.034 30.8603 28.034 30.859 28.034C30.8577 28.034 30.8564 28.034 30.8551 28.034C30.8538 28.034 30.8525 28.034 30.8512 28.034C30.8499 28.034 30.8486 28.034 30.8473 28.034C30.846 28.034 30.8447 28.034 30.8434 28.034C30.8421 28.034 30.8408 28.034 30.8395 28.034C30.8382 28.034 30.8369 28.034 30.8356 28.034C30.8343 28.034 30.833 28.034 30.8316 28.034C30.8303 28.034 30.829 28.034 30.8277 28.034C30.8264 28.034 30.8251 28.034 30.8237 28.034C30.8224 28.034 30.8211 28.034 30.8198 28.034C30.8185 28.034 30.8172 28.034 30.8158 28.034C30.8145 28.034 30.8132 28.034 30.8119 28.034C30.8105 28.034 30.8092 28.034 30.8079 28.034C30.8066 28.034 30.8052 28.034 30.8039 28.034C30.8026 28.034 30.8012 28.034 30.7999 28.034C30.7986 28.034 30.7972 28.034 30.7959 28.034C30.7946 28.034 30.7932 28.034 30.7919 28.034C30.7906 28.034 30.7892 28.034 30.7879 28.034C30.7865 28.034 30.7852 28.034 30.7839 28.034C30.7825 28.034 30.7812 28.034 30.7798 28.034C30.7785 28.034 30.7771 28.034 30.7758 28.034C30.7745 28.034 30.7731 28.034 30.7718 28.034C30.7704 28.034 30.7691 28.034 30.7677 28.034C30.7663 28.034 30.765 28.034 30.7636 28.034C30.7623 28.034 30.7609 28.034 30.7596 28.034C30.7582 28.034 30.7569 28.034 30.7555 28.034C30.7541 28.034 30.7528 28.034 30.7514 28.034C30.7501 28.034 30.7487 28.034 30.7473 28.034C30.746 28.034 30.7446 28.034 30.7432 28.034C30.7419 28.034 30.7405 28.034 30.7391 28.034C30.7378 28.034 30.7364 28.034 30.735 28.034C30.7337 28.034 30.7323 28.034 30.7309 28.034C30.7295 28.034 30.7282 28.034 30.7268 28.034C30.7254 28.034 30.724 28.034 30.7226 28.034C30.7213 28.034 30.7199 28.034 30.7185 28.034C30.7171 28.034 30.7157 28.034 30.7144 28.034C30.713 28.034 30.7116 28.034 30.7102 28.034C30.7088 28.034 30.7074 28.034 30.706 28.034C30.7046 28.034 30.7033 28.034 30.7019 28.034C30.7005 28.034 30.6991 28.034 30.6977 28.034C30.6963 28.034 30.6949 28.034 30.6935 28.034C30.6921 28.034 30.6907 28.034 30.6893 28.034C30.6879 28.034 30.6865 28.034 30.6851 28.034C30.6837 28.034 30.6823 28.034 30.6809 28.034C30.6795 28.034 30.6781 28.034 30.6767 28.034C30.6753 28.034 30.6739 28.034 30.6725 28.034C30.6711 28.034 30.6696 28.034 30.6682 28.034C30.6668 28.034 30.6654 28.034 30.664 28.034C30.6626 28.034 30.6612 28.034 30.6597 28.034C30.6583 28.034 30.6569 28.034 30.6555 28.034C30.6541 28.034 30.6527 28.034 30.6512 28.034C30.6498 28.034 30.6484 28.034 30.647 28.034C30.6455 28.034 30.6441 28.034 30.6427 28.034C30.6413 28.034 30.6398 28.034 30.6384 28.034C30.637 28.034 30.6355 28.034 30.6341 28.034C30.6327 28.034 30.6313 28.034 30.6298 28.034C30.6284 28.034 30.6269 28.034 30.6255 28.034C30.6241 28.034 30.6226 28.034 30.6212 28.034C30.6198 28.034 30.6183 28.034 30.6169 28.034C30.6154 28.034 30.614 28.034 30.6125 28.034C30.6111 28.034 30.6097 28.034 30.6082 28.034C30.6068 28.034 30.6053 28.034 30.6039 28.034C30.6024 28.034 30.601 28.034 30.5995 28.034C30.5981 28.034 30.5966 28.034 30.5952 28.034C30.5937 28.034 30.5922 28.034 30.5908 28.034C30.5893 28.034 30.5879 28.034 30.5864 28.034C30.585 28.034 30.5835 28.034 30.582 28.034C30.5806 28.034 30.5791 28.034 30.5776 28.034C30.5762 28.034 30.5747 28.034 30.5732 28.034C30.5718 28.034 30.5703 28.034 30.5688 28.034C30.5674 28.034 30.5659 28.034 30.5644 28.034C30.563 28.034 30.5615 28.034 30.56 28.034C30.5585 28.034 30.5571 28.034 30.5556 28.034C30.5541 28.034 30.5526 28.034 30.5512 28.034C30.5497 28.034 30.5482 28.034 30.5467 28.034C30.5452 28.034 30.5437 28.034 30.5423 28.034C30.5408 28.034 30.5393 28.034 30.5378 28.034C30.5363 28.034 30.5348 28.034 30.5333 28.034C30.5318 28.034 30.5304 28.034 30.5289 28.034C30.5274 28.034 30.5259 28.034 30.5244 28.034C30.5229 28.034 30.5214 28.034 30.5199 28.034C30.5184 28.034 30.5169 28.034 30.5154 28.034C30.5139 28.034 30.5124 28.034 30.5109 28.034C30.5094 28.034 30.5079 28.034 30.5064 28.034C30.5049 28.034 30.5034 28.034 30.5019 28.034C30.5004 28.034 30.4988 28.034 30.4973 28.034C30.4958 28.034 30.4943 28.034 30.4928 28.034C30.4913 28.034 30.4898 28.034 30.4883 28.034C30.4867 28.034 30.4852 28.034 30.4837 28.034C30.4822 28.034 30.4807 28.034 30.4791 28.034C30.4776 28.034 30.4761 28.034 30.4746 28.034C30.4731 28.034 30.4715 28.034 30.47 28.034C30.4685 28.034 30.467 28.034 30.4654 28.034C30.4639 28.034 30.4624 28.034 30.4608 28.034C30.4593 28.034 30.4578 28.034 30.4562 28.034C30.4547 28.034 30.4532 28.034 30.4516 28.034C30.4501 28.034 30.4486 28.034 30.447 28.034C30.4455 28.034 30.444 28.034 30.4424 28.034C30.4409 28.034 30.4393 28.034 30.4378 28.034C30.4362 28.034 30.4347 28.034 30.4331 28.034C30.4316 28.034 30.4301 28.034 30.4285 28.034C30.427 28.034 30.4254 28.034 30.4239 28.034C30.4223 28.034 30.4207 28.034 30.4192 28.034C30.4176 28.034 30.4161 28.034 30.4145 28.034C30.413 28.034 30.4114 28.034 30.4099 28.034C30.4083 28.034 30.4067 28.034 30.4052 28.034C30.4036 28.034 30.402 28.034 30.4005 28.034C30.3989 28.034 30.3974 28.034 30.3958 28.034C30.3942 28.034 30.3927 28.034 30.3911 28.034C30.3895 28.034 30.3879 28.034 30.3864 28.034C30.3848 28.034 30.3832 28.034 30.3816 28.034C30.3801 28.034 30.3785 28.034 30.3769 28.034C30.3753 28.034 30.3738 28.034 30.3722 28.034C30.3706 28.034 30.369 28.034 30.3674 28.034C30.3659 28.034 30.3643 28.034 30.3627 28.034C30.3611 28.034 30.3595 28.034 30.3579 28.034C30.3563 28.034 30.3548 28.034 30.3532 28.034C30.3516 28.034 30.35 28.034 30.3484 28.034C30.3468 28.034 30.3452 28.034 30.3436 28.034C30.342 28.034 30.3404 28.034 30.3388 28.034C30.3372 28.034 30.3356 28.034 30.334 28.034C30.3324 28.034 30.3308 28.034 30.3292 28.034C30.3276 28.034 30.326 28.034 30.3244 28.034C30.3228 28.034 30.3212 28.034 30.3196 28.034C30.318 28.034 30.3164 28.034 30.3147 28.034C30.3131 28.034 30.3115 28.034 30.3099 28.034C30.3083 28.034 30.3067 28.034 30.3051 28.034C30.3034 28.034 30.3018 28.034 30.3002 28.034C30.2986 28.034 30.297 28.034 30.2953 28.034C30.2937 28.034 30.2921 28.034 30.2905 28.034C30.2889 28.034 30.2872 28.034 30.2856 28.034C30.284 28.034 30.2823 28.034 30.2807 28.034C30.2791 28.034 30.2775 28.034 30.2758 28.034C30.2742 28.034 30.2726 28.034 30.2709 28.034C30.2693 28.034 30.2676 28.034 30.266 28.034C30.2644 28.034 30.2627 28.034 30.2611 28.034C30.2595 28.034 30.2578 28.034 30.2562 28.034C30.2545 28.034 30.2529 28.034 30.2512 28.034C30.2496 28.034 30.2479 28.034 30.2463 28.034C30.2446 28.034 30.243 28.034 30.2413 28.034C30.2397 28.034 30.238 28.034 30.2364 28.034C30.2347 28.034 30.2331 28.034 30.2314 28.034C30.2298 28.034 30.2281 28.034 30.2265 28.034C30.2248 28.034 30.2231 28.034 30.2215 28.034C30.2198 28.034 30.2182 28.034 30.2165 28.034C30.2148 28.034 30.2132 28.034 30.2115 28.034C30.2098 28.034 30.2082 28.034 30.2065 28.034C30.2048 28.034 30.2031 28.034 30.2015 28.034C30.1998 28.034 30.1981 28.034 30.1965 28.034C30.1948 28.034 30.1931 28.034 30.1914 28.034C30.1898 28.034 30.1881 28.034 30.1864 28.034C30.1847 28.034 30.183 28.034 30.1814 28.034C30.1797 28.034 30.178 28.034 30.1763 28.034C30.1746 28.034 30.1729 28.034 30.1712 28.034C30.1696 28.034 30.1679 28.034 30.1662 28.034C30.1645 28.034 30.1628 28.034 30.1611 28.034C30.1594 28.034 30.1577 28.034 30.156 28.034C30.1543 28.034 30.1526 28.034 30.1509 28.034C30.1492 28.034 30.1475 28.034 30.1458 28.034C30.1441 28.034 30.1424 28.034 30.1407 28.034C30.139 28.034 30.1373 28.034 30.1356 28.034C30.1339 28.034 30.1322 28.034 30.1305 28.034C30.1288 28.034 30.1271 28.034 30.1253 28.034C30.1236 28.034 30.1219 28.034 30.1202 28.034C30.1185 28.034 30.1168 28.034 30.1151 28.034C30.1133 28.034 30.1116 28.034 30.1099 28.034C30.1082 28.034 30.1065 28.034 30.1047 28.034C30.103 28.034 30.1013 28.034 30.0996 28.034C30.0978 28.034 30.0961 28.034 30.0944 28.034C30.0927 28.034 30.0909 28.034 30.0892 28.034C30.0875 28.034 30.0857 28.034 30.084 28.034C30.0823 28.034 30.0805 28.034 30.0788 28.034C30.0771 28.034 30.0753 28.034 30.0736 28.034C30.0718 28.034 30.0701 28.034 30.0684 28.034C30.0666 28.034 30.0649 28.034 30.0631 28.034C30.0614 28.034 30.0596 28.034 30.0579 28.034C30.0562 28.034 30.0544 28.034 30.0527 28.034C30.0509 28.034 30.0492 28.034 30.0474 28.034C30.0457 28.034 30.0439 28.034 30.0421 28.034C30.0404 28.034 30.0386 28.034 30.0369 28.034C30.0351 28.034 30.0334 28.034 30.0316 28.034C30.0298 28.034 30.0281 28.034 30.0263 28.034C30.0246 28.034 30.0228 28.034 30.021 28.034C30.0193 28.034 30.0175 28.034 30.0157 28.034C30.014 28.034 30.0122 28.034 30.0104 28.034C30.0086 28.034 30.0069 28.034 30.0051 28.034C30.0033 28.034 30.0015 28.034 29.9998 28.034C29.998 28.034 29.9962 28.034 29.9944 28.034C29.9927 28.034 29.9909 28.034 29.9891 28.034C29.9873 28.034 29.9855 28.034 29.9837 28.034C29.982 28.034 29.9802 28.034 29.9784 28.034C29.9766 28.034 29.9748 28.034 29.973 28.034C29.9712 28.034 29.9694 28.034 29.9676 28.034C29.9659 28.034 29.9641 28.034 29.9623 28.034C29.9605 28.034 29.9587 28.034 29.9569 28.034C29.9551 28.034 29.9533 28.034 29.9515 28.034C29.9497 28.034 29.9479 28.034 29.9461 28.034C29.9443 28.034 29.9425 28.034 29.9407 28.034C29.9389 28.034 29.937 28.034 29.9352 28.034C29.9334 28.034 29.9316 28.034 29.9298 28.034C29.928 28.034 29.9262 28.034 29.9244 28.034C29.9225 28.034 29.9207 28.034 29.9189 28.034C29.9171 28.034 29.9153 28.034 29.9135 28.034C29.9116 28.034 29.9098 28.034 29.908 28.034C29.9062 28.034 29.9043 28.034 29.9025 28.034C29.9007 28.034 29.8989 28.034 29.897 28.034C29.8952 28.034 29.8934 28.034 29.8916 28.034C29.8897 28.034 29.8879 28.034 29.8861 28.034C29.8842 28.034 29.8824 28.034 29.8806 28.034C29.8787 28.034 29.8769 28.034 29.875 28.034C29.8732 28.034 29.8714 28.034 29.8695 28.034C29.8677 28.034 29.8658 28.034 29.864 28.034C29.8621 28.034 29.8603 28.034 29.8585 28.034C29.8566 28.034 29.8548 28.034 29.8529 28.034C29.8511 28.034 29.8492 28.034 29.8474 28.034C29.8455 28.034 29.8436 28.034 29.8418 28.034C29.8399 28.034 29.8381 28.034 29.8362 28.034C29.8344 28.034 29.8325 28.034 29.8306 28.034C29.8288 28.034 29.8269 28.034 29.8251 28.034C29.8232 28.034 29.8213 28.034 29.8195 28.034C29.8176 28.034 29.8157 28.034 29.8139 28.034C29.812 28.034 29.8101 28.034 29.8082 28.034C29.8064 28.034 29.8045 28.034 29.8026 28.034C29.8007 28.034 29.7989 28.034 29.797 28.034C29.7951 28.034 29.7932 28.034 29.7914 28.034C29.7895 28.034 29.7876 28.034 29.7857 28.034C29.7838 28.034 29.7819 28.034 29.7801 28.034C29.7782 28.034 29.7763 28.034 29.7744 28.034C29.7725 28.034 29.7706 28.034 29.7687 28.034C29.7668 28.034 29.7649 28.034 29.763 28.034C29.7611 28.034 29.7593 28.034 29.7574 28.034C29.7555 28.034 29.7536 28.034 29.7517 28.034C29.7498 28.034 29.7479 28.034 29.746 28.034C29.7441 28.034 29.7422 28.034 29.7402 28.034C29.7383 28.034 29.7364 28.034 29.7345 28.034C29.7326 28.034 29.7307 28.034 29.7288 28.034C29.7269 28.034 29.725 28.034 29.7231 28.034C29.7211 28.034 29.7192 28.034 29.7173 28.034C29.7154 28.034 29.7135 28.034 29.7116 28.034C29.7096 28.034 29.7077 28.034 29.7058 28.034C29.7039 28.034 29.702 28.034 29.7 28.034C29.6981 28.034 29.6962 28.034 29.6943 28.034C29.6923 28.034 29.6904 28.034 29.6885 28.034C29.6865 28.034 29.6846 28.034 29.6827 28.034C29.6807 28.034 29.6788 28.034 29.6769 28.034C29.6749 28.034 29.673 28.034 29.6711 28.034C29.6691 28.034 29.6672 28.034 29.6652 28.034C29.6633 28.034 29.6613 28.034 29.6594 28.034C29.6575 28.034 29.6555 28.034 29.6536 28.034C29.6516 28.034 29.6497 28.034 29.6477 28.034C29.6458 28.034 29.6438 28.034 29.6419 28.034C29.6399 28.034 29.638 28.034 29.636 28.034C29.6341 28.034 29.6321 28.034 29.6301 28.034C29.6282 28.034 29.6262 28.034 29.6243 28.034C29.6223 28.034 29.6203 28.034 29.6184 28.034C29.6164 28.034 29.6144 28.034 29.6125 28.034C29.6105 28.034 29.6085 28.034 29.6066 28.034C29.6046 28.034 29.6026 28.034 29.6007 28.034C29.5987 28.034 29.5967 28.034 29.5947 28.034C29.5928 28.034 29.5908 28.034 29.5888 28.034C29.5868 28.034 29.5848 28.034 29.5829 28.034C29.5809 28.034 29.5789 28.034 29.5769 28.034C29.5749 28.034 29.573 28.034 29.571 28.034C29.569 28.034 29.567 28.034 29.565 28.034C29.563 28.034 29.561 28.034 29.559 28.034C29.557 28.034 29.555 28.034 29.553 28.034C29.5511 28.034 29.5491 28.034 29.5471 28.034C29.5451 28.034 29.5431 28.034 29.5411 28.034C29.5391 28.034 29.5371 28.034 29.5351 28.034C29.5331 28.034 29.531 28.034 29.529 28.034C29.527 28.034 29.525 28.034 29.523 28.034C29.521 28.034 29.519 28.034 29.517 28.034C29.515 28.034 29.513 28.034 29.5109 28.034C29.5089 28.034 29.5069 28.034 29.5049 28.034C29.5029 28.034 29.5009 28.034 29.4988 28.034C29.4968 28.034 29.4948 28.034 29.4928 28.034C29.4908 28.034 29.4887 28.034 29.4867 28.034C29.4847 28.034 29.4827 28.034 29.4806 28.034C29.4786 28.034 29.4766 28.034 29.4745 28.034C29.4725 28.034 29.4705 28.034 29.4684 28.034C29.4664 28.034 29.4644 28.034 29.4623 28.034C29.4603 28.034 29.4582 28.034 29.4562 28.034C29.4542 28.034 29.4521 28.034 29.4501 28.034C29.448 28.034 29.446 28.034 29.4439 28.034C29.4419 28.034 29.4399 28.034 29.4378 28.034C29.4358 28.034 29.4337 28.034 29.4317 28.034C29.4296 28.034 29.4276 28.034 29.4255 28.034C29.4234 28.034 29.4214 28.034 29.4193 28.034C29.4173 28.034 29.4152 28.034 29.4132 28.034C29.4111 28.034 29.409 28.034 29.407 28.034C29.4049 28.034 29.4028 28.034 29.4008 28.034C29.3987 28.034 29.3966 28.034 29.3946 28.034C29.3925 28.034 29.3904 28.034 29.3884 28.034C29.3863 28.034 29.3842 28.034 29.3821 28.034C29.3801 28.034 29.378 28.034 29.3759 28.034C29.3738 28.034 29.3718 28.034 29.3697 28.034C29.3676 28.034 29.3655 28.034 29.3634 28.034C29.3613 28.034 29.3593 28.034 29.3572 28.034C29.3551 28.034 29.353 28.034 29.3509 28.034C29.3488 28.034 29.3467 28.034 29.3446 28.034C29.3426 28.034 29.3405 28.034 29.3384 28.034C29.3363 28.034 29.3342 28.034 29.3321 28.034C29.33 28.034 29.3279 28.034 29.3258 28.034C29.3237 28.034 29.3216 28.034 29.3195 28.034C29.3174 28.034 29.3153 28.034 29.3132 28.034C29.3111 28.034 29.309 28.034 29.3068 28.034C29.3047 28.034 29.3026 28.034 29.3005 28.034C29.2984 28.034 29.2963 28.034 29.2942 28.034C29.2921 28.034 29.2899 28.034 29.2878 28.034C29.2857 28.034 29.2836 28.034 29.2815 28.034C29.2793 28.034 29.2772 28.034 29.2751 28.034C29.273 28.034 29.2708 28.034 29.2687 28.034C29.2666 28.034 29.2645 28.034 29.2623 28.034C29.2602 28.034 29.2581 28.034 29.2559 28.034C29.2538 28.034 29.2517 28.034 29.2495 28.034C29.2474 28.034 29.2453 28.034 29.2431 28.034C29.241 28.034 29.2389 28.034 29.2367 28.034C29.2346 28.034 29.2324 28.034 29.2303 28.034C29.2282 28.034 29.226 28.034 29.2239 28.034C29.2217 28.034 29.2196 28.034 29.2174 28.034C29.2153 28.034 29.2131 28.034 29.211 28.034C29.2088 28.034 29.2067 28.034 29.2045 28.034C29.2023 28.034 29.2002 28.034 29.198 28.034C29.1959 28.034 29.1937 28.034 29.1916 28.034C29.1894 28.034 29.1872 28.034 29.1851 28.034C29.1829 28.034 29.1807 28.034 29.1786 28.034C29.1764 28.034 29.1742 28.034 29.1721 28.034C29.1699 28.034 29.1677 28.034 29.1656 28.034C29.1634 28.034 29.1612 28.034 29.159 28.034C29.1569 28.034 29.1547 28.034 29.1525 28.034C29.1503 28.034 29.1481 28.034 29.146 28.034C29.1438 28.034 29.1416 28.034 29.1394 28.034C29.1372 28.034 29.135 28.034 29.1329 28.034C29.1307 28.034 29.1285 28.034 29.1263 28.034C29.1241 28.034 29.1219 28.034 29.1197 28.034C29.1175 28.034 29.1153 28.034 29.1131 28.034C29.1109 28.034 29.1087 28.034 29.1065 28.034C29.1043 28.034 29.1021 28.034 29.0999 28.034C29.0977 28.034 29.0955 28.034 29.0933 28.034C29.0911 28.034 29.0889 28.034 29.0867 28.034C29.0845 28.034 29.0823 28.034 29.0801 28.034C29.0779 28.034 29.0757 28.034 29.0734 28.034C29.0712 28.034 29.069 28.034 29.0668 28.034C29.0646 28.034 29.0624 28.034 29.0601 28.034C29.0579 28.034 29.0557 28.034 29.0535 28.034C29.0513 28.034 29.049 28.034 29.0468 28.034C29.0446 28.034 29.0424 28.034 29.0401 28.034C29.0379 28.034 29.0357 28.034 29.0334 28.034C29.0312 28.034 29.029 28.034 29.0267 28.034C29.0245 28.034 29.0223 28.034 29.02 28.034C29.0178 28.034 29.0156 28.034 29.0133 28.034C29.0111 28.034 29.0088 28.034 29.0066 28.034C29.0043 28.034 29.0021 28.034 28.9999 28.034C28.9976 28.034 28.9954 28.034 28.9931 28.034C28.9909 28.034 28.9886 28.034 28.9864 28.034C28.9841 28.034 28.9819 28.034 28.9796 28.034C28.9774 28.034 28.9751 28.034 28.9728 28.034C28.9706 28.034 28.9683 28.034 28.9661 28.034C28.9638 28.034 28.9615 28.034 28.9593 28.034C28.957 28.034 28.9547 28.034 28.9525 28.034C28.9502 28.034 28.9479 28.034 28.9457 28.034C28.9434 28.034 28.9411 28.034 28.9389 28.034C28.9366 28.034 28.9343 28.034 28.932 28.034V29.034ZM12.1359 13.5H33.3981V12.5H12.1359V13.5ZM33.3981 13.5C34.2107 13.5 35.034 14.3492 35.034 15.6214H36.034C36.034 13.9981 34.9447 12.5 33.3981 12.5V13.5ZM35.034 15.6214V30.3786H36.034V15.6214H35.034ZM35.034 30.3786C35.034 31.6508 34.2107 32.5 33.3981 32.5V33.5C34.9447 33.5 36.034 32.0019 36.034 30.3786H35.034ZM33.3981 32.5H12.1359V33.5H33.3981V32.5ZM12.1359 32.5C11.3233 32.5 10.5 31.6508 10.5 30.3786H9.5C9.5 32.0019 10.5893 33.5 12.1359 33.5V32.5ZM10.5 30.3786V15.6214H9.5V30.3786H10.5ZM10.5 15.6214C10.5 14.3492 11.3233 13.5 12.1359 13.5V12.5C10.5893 12.5 9.5 13.9981 9.5 15.6214H10.5ZM10 19.5194H35.534V18.5194H10V19.5194ZM10 22.1408H35.534V21.1408H10V22.1408Z" fill="white"/>
<defs>
<linearGradient id="paint0_linear" x1="3.375" y1="5.0625" x2="38.8125" y2="39.375" gradientUnits="userSpaceOnUse">
<stop stop-color="#0045A0"/>
<stop offset="1" stop-color="#397DFB"/>
</linearGradient>
</defs>
</svg>
