<svg width="14" height="14" viewBox="0 0 14 14" fill="none" xmlns="http://www.w3.org/2000/svg">
<circle cx="7" cy="7" r="6.5" stroke="#E01275"/>
<path d="M6.66136 8.45699C6.66136 7.93369 6.71975 7.52151 6.83652 7.22043C6.95329 6.91577 7.1426 6.65233 7.40446 6.43011C7.66631 6.20789 7.86447 6.00538 7.99894 5.82258C8.13694 5.6362 8.20594 5.4319 8.20594 5.20968C8.20594 4.66846 7.97594 4.39785 7.51592 4.39785C7.30361 4.39785 7.13199 4.4767 7.00106 4.63441C6.87013 4.79211 6.80113 5.00538 6.79406 5.27419H5C5.00708 4.55735 5.23001 4 5.66879 3.60215C6.10757 3.20072 6.72328 3 7.51592 3C8.30502 3 8.91543 3.18459 9.34713 3.55376C9.78238 3.92294 10 4.44803 10 5.12903C10 5.42652 9.94161 5.69713 9.82484 5.94086C9.70807 6.18459 9.52052 6.43369 9.26221 6.68817L8.6518 7.26344C8.47841 7.4319 8.3581 7.60573 8.29087 7.78495C8.22364 7.96057 8.18648 8.18459 8.17941 8.45699H6.66136ZM6.44374 10.0914C6.44374 9.82616 6.53751 9.60932 6.72505 9.44086C6.91614 9.26882 7.15322 9.1828 7.43631 9.1828C7.71939 9.1828 7.95471 9.26882 8.14225 9.44086C8.33333 9.60932 8.42887 9.82616 8.42887 10.0914C8.42887 10.3566 8.33333 10.5753 8.14225 10.7473C7.95471 10.9158 7.71939 11 7.43631 11C7.15322 11 6.91614 10.9158 6.72505 10.7473C6.53751 10.5753 6.44374 10.3566 6.44374 10.0914Z" fill="#E01275"/>
</svg>
