<svg width="41" height="32" viewBox="0 0 41 32" fill="none" xmlns="http://www.w3.org/2000/svg">
<path fill-rule="evenodd" clip-rule="evenodd" d="M32.4349 11.3328C33.9787 11.9037 35.2039 12.4497 36.1106 12.9709C40.8399 16.3215 42.1387 20.4911 39.9823 25.4798C36.2821 31.2875 29.5679 32.6774 19.8641 29.6495C-0.00912094 21.0868 8.10188 -1.00236 19.619 3.46512C20.8197 3.91186 21.9469 4.855 23.0496 6.24488C25.157 8.30488 28.2691 9.99259 32.4349 11.3328Z" fill="url(#paint0_linear)"/>
<path d="M29.2051 1H2.24542C1.55759 1 1 1.56476 1 2.26142V20.5149C1 21.2115 1.55759 21.7763 2.24542 21.7763H29.2051C29.893 21.7763 30.4505 21.2115 30.4505 20.5149V2.26142C30.4505 1.56476 29.893 1 29.2051 1Z" stroke="#373A3C" stroke-width="1.5" stroke-miterlimit="22.9256"/>
<path d="M7.59326 25.9297L23.9303 25.8555" stroke="#373A3C" stroke-width="1.5" stroke-miterlimit="22.9256"/>
<path fill-rule="evenodd" clip-rule="evenodd" d="M19.2419 11.5362L13.6008 7.60352V15.6172L19.2419 11.5362Z" stroke="#373A3C" stroke-width="1.5" stroke-miterlimit="22.9256"/>
<defs>
<linearGradient id="paint0_linear" x1="7.78332" y1="17.0413" x2="40.987" y2="17.0413" gradientUnits="userSpaceOnUse">
<stop stop-color="#E9F3FF"/>
<stop offset="1" stop-color="#AECCFE"/>
</linearGradient>
</defs>
</svg>
