<svg width="45" height="45" viewBox="0 0 45 45" fill="none" xmlns="http://www.w3.org/2000/svg">
<path d="M45 22.5C45 34.9264 34.9264 45 22.5 45C10.0736 45 0 34.9264 0 22.5C0 10.0736 10.0736 0 22.5 0C34.9264 0 45 10.0736 45 22.5Z" fill="url(#paint0_linear)"/>
<path fill-rule="evenodd" clip-rule="evenodd" d="M22.3405 10.4453C16.9214 10.4453 12.7774 14.6239 12.7774 20.0882C12.7774 25.231 18.834 31.6596 21.3842 34.231C22.0218 34.5525 22.9781 34.8739 23.6156 34.231C26.1658 31.6596 32.2225 25.5525 32.2225 20.0882C32.2225 14.6239 27.7597 10.4453 22.3405 10.4453ZM22.3405 23.3025C20.1091 23.3025 18.5153 21.6953 18.5153 19.4453C18.5153 17.1953 20.1091 15.2667 22.3405 15.2667C24.5719 15.2667 26.4846 17.1953 26.4846 19.4453C26.4846 21.6953 24.5719 23.3025 22.3405 23.3025Z" stroke="white" stroke-miterlimit="22.9256"/>
<defs>
<linearGradient id="paint0_linear" x1="3.375" y1="5.0625" x2="38.8125" y2="39.375" gradientUnits="userSpaceOnUse">
<stop stop-color="#0045A0"/>
<stop offset="1" stop-color="#397DFB"/>
</linearGradient>
</defs>
</svg>
