<svg width="19" height="17" viewBox="0 0 19 17" fill="none" xmlns="http://www.w3.org/2000/svg">
<path d="M3.73872 8.18101C3.46258 8.18101 3.23872 8.40486 3.23872 8.68101C3.23872 8.95715 3.46258 9.18101 3.73872 9.18101V8.18101ZM5.58027 9.18101C5.85642 9.18101 6.08027 8.95715 6.08027 8.68101C6.08027 8.40486 5.85642 8.18101 5.58027 8.18101V9.18101ZM8.49213 8.18101C8.21599 8.18101 7.99213 8.40486 7.99213 8.68101C7.99213 8.95715 8.21599 9.18101 8.49213 9.18101V8.18101ZM10.3337 9.18101C10.6098 9.18101 10.8337 8.95715 10.8337 8.68101C10.8337 8.40486 10.6098 8.18101 10.3337 8.18101V9.18101ZM13.0567 8.18101C12.7805 8.18101 12.5567 8.40486 12.5567 8.68101C12.5567 8.95715 12.7805 9.18101 13.0567 9.18101V8.18101ZM14.8982 9.18101C15.1744 9.18101 15.3982 8.95715 15.3982 8.68101C15.3982 8.40486 15.1744 8.18101 14.8982 8.18101V9.18101ZM3.73872 11.6123C3.46258 11.6123 3.23872 11.8361 3.23872 12.1123C3.23872 12.3884 3.46258 12.6123 3.73872 12.6123V11.6123ZM5.58027 12.6123C5.85642 12.6123 6.08027 12.3884 6.08027 12.1123C6.08027 11.8361 5.85642 11.6123 5.58027 11.6123V12.6123ZM8.49213 11.6123C8.21599 11.6123 7.99213 11.8361 7.99213 12.1123C7.99213 12.3884 8.21599 12.6123 8.49213 12.6123V11.6123ZM10.3337 12.6123C10.6098 12.6123 10.8337 12.3884 10.8337 12.1123C10.8337 11.8361 10.6098 11.6123 10.3337 11.6123V12.6123ZM13.0567 11.6123C12.7805 11.6123 12.5567 11.8361 12.5567 12.1123C12.5567 12.3884 12.7805 12.6123 13.0567 12.6123V11.6123ZM14.8982 12.6123C15.1744 12.6123 15.3982 12.3884 15.3982 12.1123C15.3982 11.8361 15.1744 11.6123 14.8982 11.6123V12.6123ZM2.149 1.5H16.7083V0.5H2.149V1.5ZM16.7083 1.5C17.0667 1.5 17.3573 1.79057 17.3573 2.149H18.3573C18.3573 1.23828 17.619 0.5 16.7083 0.5V1.5ZM17.3573 2.149V14.851H18.3573V2.149H17.3573ZM17.3573 14.851C17.3573 15.2094 17.0667 15.5 16.7083 15.5V16.5C17.619 16.5 18.3573 15.7617 18.3573 14.851H17.3573ZM16.7083 15.5H2.149V16.5H16.7083V15.5ZM2.149 15.5C1.79057 15.5 1.5 15.2094 1.5 14.851H0.5C0.5 15.7617 1.23828 16.5 2.149 16.5V15.5ZM1.5 14.851V2.149H0.5V14.851H1.5ZM1.5 2.149C1.5 1.79057 1.79057 1.5 2.149 1.5V0.5C1.23828 0.5 0.5 1.23828 0.5 2.149H1.5ZM1 5.71826H17.873V4.71826H1V5.71826ZM3.73872 9.18101H5.58027V8.18101H3.73872V9.18101ZM8.49213 9.18101H10.3337V8.18101H8.49213V9.18101ZM13.0567 9.18101H14.8982V8.18101H13.0567V9.18101ZM3.73872 12.6123H5.58027V11.6123H3.73872V12.6123ZM8.49213 12.6123H10.3337V11.6123H8.49213V12.6123ZM13.0567 12.6123H14.8982V11.6123H13.0567V12.6123Z" fill="#999999"/>
</svg>
