<svg width="50" height="50" viewBox="0 0 50 50" fill="none" xmlns="http://www.w3.org/2000/svg">
<path fill-rule="evenodd" clip-rule="evenodd" d="M5.49173 33.6769C0.155505 20.0423 3.39404 9.96456 15.1705 3.51776C21.4268 1.81343 24.9229 3.77711 25.7326 9.4088C26.027 19.0049 29.6336 26.6003 36.5522 32.269C42.6613 37.9377 42.2197 43.0507 35.2642 47.5709C23.1565 53.3878 13.2569 48.7565 5.49173 33.6769Z" fill="url(#paint0_linear)"/>
<path d="M34.7288 35.1223H12.8305C10.1627 35.1223 8 32.9308 8 30.2274V6.89492C8 4.19153 10.1627 2 12.8305 2H35.6949C38.3628 2 40.5254 4.19153 40.5254 6.89492V14.8814" stroke="#373A3C" stroke-width="1.5" stroke-miterlimit="22.9256"/>
<path d="M44.0679 15.0527H36.8221C35.755 15.0527 34.8899 15.9293 34.8899 17.0107V40.3431C34.8899 41.4245 35.755 42.3011 36.8221 42.3011H44.0679C45.135 42.3011 46.0001 41.4245 46.0001 40.3431V17.0107C46.0001 15.9293 45.135 15.0527 44.0679 15.0527Z" stroke="#373A3C" stroke-width="1.5" stroke-miterlimit="22.9256"/>
<path d="M40.3644 36.1024C41.9651 36.1024 43.2627 34.7875 43.2627 33.1655C43.2627 31.5434 41.9651 30.2285 40.3644 30.2285C38.7637 30.2285 37.4661 31.5434 37.4661 33.1655C37.4661 34.7875 38.7637 36.1024 40.3644 36.1024Z" stroke="#373A3C" stroke-width="1.5" stroke-miterlimit="22.9256"/>
<path d="M15.5525 19.075V18.0488H21.3703V19.075H18.963V27.4896H17.9599V19.075H15.5525ZM22.1728 18.0488H23.1759L26.787 25.4372L30.398 18.0488H31.6017L26.787 27.4896H26.5864L22.1728 18.0488Z" fill="#373A3C"/>
<path d="M17.6609 11.1387H20.3982" stroke="#373A3C" stroke-width="1.5" stroke-miterlimit="22.9256" stroke-linecap="round"/>
<path d="M28.127 11.1387H30.5422" stroke="#373A3C" stroke-width="1.5" stroke-miterlimit="22.9256" stroke-linecap="round"/>
<path d="M37.3049 23.5195H43.7456" stroke="#373A3C" stroke-width="1.5" stroke-miterlimit="22.9256" stroke-linecap="round"/>
<path d="M22.9746 11.1387H25.5509" stroke="#373A3C" stroke-width="1.5" stroke-miterlimit="22.9256" stroke-linecap="round"/>
<path d="M44.3897 18.316C44.3897 18.8055 44.0677 19.295 43.4236 19.295C42.7796 19.295 42.4575 18.8055 42.4575 18.316C42.4575 17.6633 42.7796 17.1738 43.4236 17.1738C44.0677 17.1738 44.3897 17.6633 44.3897 18.316Z" fill="#373A3C"/>
<defs>
<linearGradient id="paint0_linear" x1="2.99123" y1="26.4631" x2="40.8227" y2="26.4631" gradientUnits="userSpaceOnUse">
<stop stop-color="#E9F3FF"/>
<stop offset="1" stop-color="#AECCFE"/>
</linearGradient>
</defs>
</svg>
