<svg width="65" height="65" viewBox="0 0 65 65" fill="none" xmlns="http://www.w3.org/2000/svg">
<path fill-rule="evenodd" clip-rule="evenodd" d="M20.5151 21.3613C17.4443 21.5231 14.969 21.8604 13.1094 22.2938C2.9618 25.7899 -1.28607 32.6044 0.336153 42.6859C4.43373 55.119 16.0264 61.2255 35.0746 60.9936C75.1439 56.2885 70.4573 12.2256 47.4189 14.0554C45.0633 14.2573 42.5754 15.3165 39.9155 17.2212C35.1666 19.7906 28.713 21.1745 20.5151 21.3613Z" fill="url(#paint0_linear)"/>
<path d="M39.6858 41.0085H14.1231C12.9342 41.0085 12 40.0743 12 38.8853V7.12314C12 5.93418 12.9342 5 14.1231 5H50.9809C52.1698 5 53.104 5.93418 53.104 7.12314V27.3354" stroke="#373A3C" stroke-width="1.5" stroke-miterlimit="22.9256" stroke-linecap="round" stroke-linejoin="round"/>
<path d="M12 14.8516H53.104" stroke="#373A3C" stroke-width="1.5" stroke-miterlimit="22.9256"/>
<path d="M24.0593 10.0957H28.2207" stroke="#373A3C" stroke-width="1.5" stroke-miterlimit="22.9256" stroke-linecap="round" stroke-linejoin="round"/>
<path d="M17.3503 10.0957H21.5966" stroke="#373A3C" stroke-width="1.5" stroke-miterlimit="22.9256" stroke-linecap="round" stroke-linejoin="round"/>
<path d="M39.7707 10.0957H48.0085" stroke="#373A3C" stroke-width="1.5" stroke-miterlimit="22.9256" stroke-linecap="round" stroke-linejoin="round"/>
<path d="M39.7706 32.9402H20.6623C20.0679 32.9402 19.5583 32.4307 19.5583 31.8362V24.108C19.5583 23.5135 20.0679 23.0889 20.6623 23.0889H44.6114C45.2059 23.0889 45.6305 23.5135 45.6305 24.108V27.3351" stroke="#373A3C" stroke-width="1.5" stroke-miterlimit="22.9256" stroke-linecap="round" stroke-linejoin="round"/>
<path fill-rule="evenodd" clip-rule="evenodd" d="M43.0825 30.3926L48.9424 44.9998L51.4902 38.4605L57.35 35.8278L43.0825 30.3926Z" stroke="#373A3C" stroke-width="1.5" stroke-miterlimit="22.9256" stroke-linecap="round" stroke-linejoin="round"/>
<defs>
<linearGradient id="paint0_linear" x1="58.6108" y1="51.5594" x2="4.33255" y2="23.0338" gradientUnits="userSpaceOnUse">
<stop stop-color="#CDF8FC"/>
<stop offset="1" stop-color="#BFDFF9"/>
</linearGradient>
</defs>
</svg>
