<svg width="50" height="50" viewBox="0 0 50 50" fill="none" xmlns="http://www.w3.org/2000/svg">
<g clip-path="url(#clip0)">
<path fill-rule="evenodd" clip-rule="evenodd" d="M15.31 17.8462C13.4517 18.5102 11.9769 19.1453 10.8855 19.7516C5.19275 23.6491 3.62945 28.4994 6.22512 34.3023C10.679 41.058 18.761 42.6748 30.4415 39.1526C54.3629 29.1923 44.5997 3.49757 30.7365 8.69425C29.2912 9.21392 27.9343 10.311 26.607 11.9277C24.0703 14.324 20.3243 16.2872 15.31 17.8462Z" fill="url(#paint0_linear)"/>
</g>
<path d="M14.8909 23.1202C18.1711 22.188 22.4798 25.5024 21.0463 30.0518M14 17.0805C20.7709 16.0288 28.9429 22.2115 27.1935 31.4138M14 11.0012C23.5489 10.1566 35.3413 18.0204 32.5957 31.9395" stroke="#373A3C" stroke-width="1.5" stroke-miterlimit="22.9256" stroke-linecap="round"/>
<defs>
<linearGradient id="paint0_linear" x1="44.9831" y1="24.4864" x2="5.01578" y2="24.4864" gradientUnits="userSpaceOnUse">
<stop stop-color="#E9F3FF"/>
<stop offset="1" stop-color="#AECCFE"/>
</linearGradient>
<clipPath id="clip0">
<rect width="40" height="32.9412" fill="white" transform="matrix(-1 0 0 1 45 8)"/>
</clipPath>
</defs>
</svg>
