<svg width="36" height="38" viewBox="0 0 36 38" fill="none" xmlns="http://www.w3.org/2000/svg">
<path fill-rule="evenodd" clip-rule="evenodd" d="M18 1C27.389 1 35 8.52136 35 17.7997C35 27.078 27.389 34.5993 18 34.5993C15.7811 34.5993 13.6612 34.1782 11.7176 33.4143L11.7209 33.4164L4.70118 37L6.1702 29.865L6.17571 29.8682C2.98439 26.8141 1 22.5362 1 17.7997C1 8.52136 8.61104 1 18 1Z" fill="#FEFEFE" stroke="#999999" stroke-miterlimit="22.9256" stroke-linejoin="round"/>
<path d="M26 26C24.727 22.4979 21.4017 20 17.5 20C13.5978 20 10.2724 22.4979 9 26" stroke="#999999" stroke-miterlimit="10" stroke-linecap="round" stroke-linejoin="round"/>
<path d="M20.2155 13.0958C20.2155 13.8187 20.8021 14.4054 21.5251 14.4054C22.2486 14.4054 22.8347 13.8187 22.8347 13.0958C22.8347 12.3722 22.2486 11.7861 21.5251 11.7861C20.8021 11.7861 20.2155 12.3722 20.2155 13.0958Z" fill="#999999"/>
<path d="M12.4131 13.0958C12.4131 13.8187 12.9997 14.4054 13.7227 14.4054C14.4462 14.4054 15.0323 13.8187 15.0323 13.0958C15.0323 12.3722 14.4462 11.7861 13.7227 11.7861C12.9997 11.7861 12.4131 12.3722 12.4131 13.0958Z" fill="#999999"/>
</svg>
