<svg width="45" height="45" viewBox="0 0 45 45" fill="none" xmlns="http://www.w3.org/2000/svg">
<circle cx="22.5" cy="22.5" r="22.5" fill="url(#paint0_linear)"/>
<path d="M23.903 29.0802V24.1603H30.0295M33.557 28.8017V31.0295C33.557 32.7004 32.2574 34 30.5865 34H26.9662M33.557 27.038V24.1603M23.903 34V31.1224M13.8776 12H20.654V21.7468H11V14.8776C11 13.2996 12.2996 12 13.8776 12ZM13.8776 34H20.654V24.1603H11V31.0295C11 32.7004 12.2996 34 13.8776 34ZM30.5865 12H23.903V21.7468H33.557V14.8776C33.557 13.2996 32.2574 12 30.5865 12ZM14.4346 15.5274H17.4979V18.5907H14.4346V15.5274ZM14.4346 27.4093H17.4979V30.4726H14.4346V27.4093ZM27.0591 15.5274H30.1224V18.5907H27.0591V15.5274ZM27.0591 27.4093H30.1224V30.4726H27.0591V27.4093Z" stroke="white" stroke-miterlimit="22.9256"/>
<defs>
<linearGradient id="paint0_linear" x1="3.375" y1="5.0625" x2="38.8125" y2="39.375" gradientUnits="userSpaceOnUse">
<stop stop-color="#0045A0"/>
<stop offset="1" stop-color="#397DFB"/>
</linearGradient>
</defs>
</svg>
