<svg width="24" height="24" viewBox="0 0 24 24" fill="none" xmlns="http://www.w3.org/2000/svg">
<path fill-rule="evenodd" clip-rule="evenodd" d="M5.30357 2.70307C5.21782 2.59307 5.10968 2.50255 4.98631 2.43749C4.86295 2.37243 4.72716 2.33432 4.58796 2.32568C4.44876 2.31705 4.30931 2.33808 4.17884 2.38739C4.04838 2.43671 3.92988 2.51317 3.83119 2.61172L2.32939 4.11352C1.62804 4.81487 1.36948 5.80885 1.67758 6.68051C2.94827 10.2917 5.01572 13.5704 7.72657 16.2734C10.4296 18.9843 13.7083 21.0517 17.3195 22.3224C18.1912 22.629 19.1851 22.372 19.8865 21.6706L21.3883 20.1688C21.4867 20.07 21.5631 19.9514 21.6123 19.8209C21.6615 19.6904 21.6824 19.5509 21.6736 19.4117C21.6648 19.2725 21.6265 19.1367 21.5613 19.0134C21.4961 18.8901 21.4055 18.7821 21.2954 18.6964L17.9481 16.0923C17.8303 16.0008 17.6933 15.9372 17.5474 15.9063C17.4015 15.8755 17.2505 15.8782 17.1058 15.9142L13.9288 16.7085C13.5045 16.8147 13.0598 16.8093 12.6381 16.6926C12.2165 16.5759 11.8323 16.352 11.5229 16.0427L7.95881 12.4771C7.64951 12.1677 7.42562 11.7835 7.30895 11.3619C7.19228 10.9402 7.18681 10.4955 7.29306 10.0712L8.08731 6.89417C8.12335 6.74946 8.12605 6.59846 8.09521 6.45256C8.06436 6.30665 8.00078 6.16966 7.90927 6.05192L5.30357 2.70307ZM2.73658 1.51866C2.9906 1.26481 3.29569 1.06787 3.63162 0.940916C3.96755 0.813961 4.32664 0.75989 4.68506 0.782291C5.04348 0.804693 5.39304 0.903054 5.71055 1.07085C6.02805 1.23864 6.30625 1.47204 6.52668 1.75554L9.12928 5.10285C9.60769 5.71595 9.77645 6.51639 9.58756 7.27039L8.79331 10.4489C8.75201 10.6139 8.75411 10.7867 8.79942 10.9506C8.84473 11.1144 8.93171 11.2638 9.05187 11.3841L12.619 14.9481C12.7393 15.0683 12.8887 15.1553 13.0525 15.2006C13.2164 15.2459 13.3892 15.248 13.5542 15.2067L16.7312 14.4124C17.1038 14.3194 17.4927 14.3123 17.8685 14.3917C18.2443 14.4711 18.5971 14.6349 18.9002 14.8707L22.2476 17.4733C23.4505 18.4085 23.562 20.1874 22.4844 21.2634L20.9826 22.7652C19.9097 23.8381 18.3042 24.3104 16.807 23.784C12.9773 22.4359 9.5002 20.2431 6.63351 17.368C3.75787 14.5015 1.56448 11.0244 0.216041 7.19452C-0.310362 5.69737 0.161852 4.09184 1.23479 3.01736L2.73658 1.51711V1.51866ZM23.7726 0.227427C23.8447 0.299337 23.9019 0.384762 23.9409 0.47881C23.9799 0.572858 24 0.673682 24 0.775506C24 0.87733 23.9799 0.978153 23.9409 1.0722C23.9019 1.16625 23.8447 1.25167 23.7726 1.32358L17.352 7.7426H21.6763C21.8816 7.7426 22.0785 7.82416 22.2236 7.96934C22.3688 8.11451 22.4504 8.31142 22.4504 8.51673C22.4504 8.72204 22.3688 8.91894 22.2236 9.06411C22.0785 9.20929 21.8816 9.29085 21.6763 9.29085H15.4833C15.278 9.29085 15.0811 9.20929 14.9359 9.06411C14.7907 8.91894 14.7092 8.72204 14.7092 8.51673V2.32375C14.7092 2.11844 14.7907 1.92154 14.9359 1.77636C15.0811 1.63119 15.278 1.54963 15.4833 1.54963C15.6886 1.54963 15.8855 1.63119 16.0307 1.77636C16.1758 1.92154 16.2574 2.11844 16.2574 2.32375V6.64799L22.6764 0.227427C22.7483 0.155336 22.8338 0.0981396 22.9278 0.0591139C23.0218 0.0200882 23.1227 0 23.2245 0C23.3263 0 23.4271 0.0200882 23.5212 0.0591139C23.6152 0.0981396 23.7007 0.155336 23.7726 0.227427Z" fill="#397DFB"/>
</svg>
