<svg width="50" height="50" viewBox="0 0 50 50" fill="none" xmlns="http://www.w3.org/2000/svg">
<path fill-rule="evenodd" clip-rule="evenodd" d="M16.1496 19.7759C13.882 19.8954 12.054 20.1444 10.6808 20.4645C3.18717 23.0462 0.0502859 28.0784 1.24824 35.5233C4.27414 44.7047 12.8349 49.2141 26.9012 49.0428C56.4909 45.5683 53.03 13.0295 36.017 14.3808C34.2775 14.5298 32.4403 15.312 30.4761 16.7186C26.9692 18.616 22.2035 19.638 16.1496 19.7759Z" fill="url(#paint0_linear)"/>
<path d="M37.6087 20.9945V34.1231C37.6087 36.3609 35.9899 38.002 33.9297 38.002H10.5318C8.61873 38.002 7 36.3609 7 34.4215V15.0269V10.9988C7.14716 8.01503 9.20736 7.26908 11.4147 6.9707L15.0936 7.11989C16.1237 7.11989 16.4181 7.56746 17.0067 8.3134L20.097 12.7891C20.8328 14.5793 22.01 15.0269 23.1873 15.0269H28.6321" stroke="#373A3C" stroke-width="1.5" stroke-miterlimit="22.9256"/>
<path d="M18.4783 10.4004C22.1572 10.4004 25.5418 10.4004 28.7793 10.4004" stroke="#373A3C" stroke-width="1.5" stroke-miterlimit="22.9256"/>
<path d="M11.8561 32.7773C16.1236 32.7773 19.9497 32.7773 23.6286 32.7773" stroke="#373A3C" stroke-width="1.5" stroke-miterlimit="22.9256" stroke-linecap="round"/>
<path d="M27.0134 32.7773C28.1907 32.7773 28.9265 32.7773 29.3679 32.7773" stroke="#373A3C" stroke-width="1.5" stroke-miterlimit="22.9256" stroke-linecap="round"/>
<path d="M32.6053 7.86269V5.32648C32.6053 2.93946 34.6655 1 37.0201 1C39.3746 1 41.2876 2.93946 41.2876 5.32648V7.86269" stroke="#373A3C" stroke-width="1.5" stroke-miterlimit="22.9256"/>
<path d="M43.2007 8.31055H30.6923C29.6358 8.31055 28.7793 9.17887 28.7793 10.25V19.0522C28.7793 20.1233 29.6358 20.9916 30.6923 20.9916H43.2007C44.2572 20.9916 45.1137 20.1233 45.1137 19.0522V10.25C45.1137 9.17887 44.2572 8.31055 43.2007 8.31055Z" stroke="#373A3C" stroke-width="1.5" stroke-miterlimit="22.9256"/>
<path fill-rule="evenodd" clip-rule="evenodd" d="M38.0501 14.5768C38.0501 14.8752 38.0501 15.1735 38.0501 15.6211C38.0501 17.113 37.6086 18.3065 37.02 18.3065C36.4313 18.3065 35.8427 17.113 35.8427 15.6211C35.8427 15.1735 35.9899 14.8752 35.9899 14.5768C35.6956 14.2784 35.4012 13.8308 35.4012 13.3833C35.4012 12.4881 36.137 11.7422 37.02 11.7422C37.9029 11.7422 38.6387 12.4881 38.6387 13.3833C38.6387 13.8308 38.3444 14.2784 38.0501 14.5768Z" stroke="#373A3C" stroke-width="1.5" stroke-miterlimit="22.9256"/>
<defs>
<linearGradient id="paint0_linear" x1="44.2818" y1="42.076" x2="4.19942" y2="21.011" gradientUnits="userSpaceOnUse">
<stop stop-color="#CDF8FC"/>
<stop offset="1" stop-color="#BFDFF9"/>
</linearGradient>
</defs>
</svg>
