<svg width="45" height="45" viewBox="0 0 45 45" fill="none" xmlns="http://www.w3.org/2000/svg">
<circle cx="22.5" cy="22.5" r="22.5" fill="url(#paint0_linear)"/>
<g clip-path="url(#clip0)">
<path fill-rule="evenodd" clip-rule="evenodd" d="M26.4638 20.8179H19.354C18.9894 20.8179 18.8071 20.4587 18.8071 20.0994C18.8071 19.7402 18.9894 19.5605 19.354 19.5605H26.4638C26.6462 19.5605 27.0108 19.7402 27.0108 20.0994C27.0108 20.4587 26.6462 20.8179 26.4638 20.8179Z" fill="white"/>
<path fill-rule="evenodd" clip-rule="evenodd" d="M23.3647 17.2242H19.1717C18.9894 17.2242 18.8071 17.0446 18.8071 16.6853C18.8071 16.3261 18.9894 16.1465 19.1717 16.1465H23.3647C23.547 16.1465 23.7293 16.3261 23.7293 16.6853C23.7293 17.0446 23.547 17.2242 23.3647 17.2242Z" fill="white"/>
<path fill-rule="evenodd" clip-rule="evenodd" d="M26.4638 24.0503H19.354C18.9894 24.0503 18.8071 23.6911 18.8071 23.3318C18.8071 23.1522 18.9894 22.793 19.354 22.793H26.4638C26.6462 22.793 27.0108 23.1522 27.0108 23.3318C27.0108 23.6911 26.6462 24.0503 26.4638 24.0503Z" fill="white"/>
<path fill-rule="evenodd" clip-rule="evenodd" d="M31.0214 12.375H14.7965C14.7965 12.375 14.6142 12.375 14.6142 12.5546C14.4319 12.5546 14.4319 12.7342 14.4319 12.7342L14.2496 26.7447C14.2496 26.9244 14.2496 27.104 14.0673 27.104H10.6035H10.4212C10.2389 27.2836 10.2389 27.2836 10.2389 27.4632V29.6187C10.2389 30.6964 10.6035 31.5945 11.3327 32.313C11.8796 33.0315 12.7911 33.3908 13.8849 33.5704C17.531 33.9296 23.547 33.3908 27.5577 33.5704C28.6515 33.5704 29.563 33.0315 30.2922 32.313C31.0214 31.7742 31.386 30.6964 31.386 29.6187V12.7342V12.5546C31.2037 12.375 31.2037 12.375 31.0214 12.375ZM23.7293 33.75H25.9169C25.1877 33.75 24.4585 33.75 23.7293 33.75ZM11.1504 29.6187V28.0021C11.1504 28.0021 11.1504 27.8225 11.3327 27.8225H23.547C23.7293 27.8225 23.7293 28.0021 23.7293 28.0021V29.6187C23.7293 30.1576 23.9116 30.6964 24.0939 31.0557C24.2762 31.5945 24.4585 31.9538 24.8231 32.313C25.0054 32.4926 25.0054 32.4926 24.8231 32.6723H14.0673C13.338 32.6723 12.4265 32.313 11.8796 31.7742C11.3327 31.2353 11.1504 30.5168 11.1504 29.6187ZM30.6568 29.6187C30.6568 30.5168 30.2922 31.2353 29.7453 31.7742C29.1984 32.313 28.4692 32.6723 27.5577 32.6723C26.8284 32.6723 26.0992 32.313 25.5523 31.7742C25.0054 31.2353 24.6408 30.5168 24.6408 29.6187V27.4632C24.6408 27.2836 24.6408 27.2836 24.4585 27.104H24.2762H15.3434C15.1611 27.104 15.1611 26.9244 15.1611 26.7447L15.3434 13.4527C15.3434 13.2731 15.3434 13.2731 15.5257 13.2731H30.4745C30.4745 13.2731 30.6568 13.2731 30.6568 13.4527V29.6187Z" fill="white" stroke="white" stroke-width="0.2"/>
</g>
<defs>
<linearGradient id="paint0_linear" x1="3.375" y1="5.0625" x2="38.8125" y2="39.375" gradientUnits="userSpaceOnUse">
<stop stop-color="#0045A0"/>
<stop offset="1" stop-color="#397DFB"/>
</linearGradient>
<clipPath id="clip0">
<rect width="21.375" height="21.375" fill="white" transform="translate(10.125 12.375)"/>
</clipPath>
</defs>
</svg>
