<svg width="28" height="28" viewBox="0 0 28 28" fill="none" xmlns="http://www.w3.org/2000/svg">
<circle cx="14" cy="14" r="14" fill="#A00000"/>
<path d="M12.3947 16.3628C13.7515 15.7014 15.0966 15.0461 16.454 14.3844C15.0925 13.7166 13.7478 13.0574 12.3947 12.3936C12.3947 13.7213 12.3947 15.0354 12.3947 16.3628Z" fill="white"/>
<path d="M14.0424 6C9.04857 6 5 9.80557 5 14.5C5 19.1944 9.04857 23 14.0424 23C19.0361 23 23.0847 19.1944 23.0847 14.5C23.0847 9.80557 19.0361 6 14.0424 6ZM20.2034 17.3372C20.0469 17.9755 19.4915 18.4463 18.823 18.5163C17.2399 18.6828 15.6377 18.6837 14.042 18.6828C12.4463 18.6837 10.8437 18.6828 9.26022 18.5163C8.59178 18.4463 8.03675 17.9755 7.8806 17.3372C7.65804 16.428 7.65804 15.4358 7.65804 14.5C7.65804 13.5642 7.66063 12.5717 7.88319 11.6628C8.03934 11.0245 8.59437 10.5536 9.26281 10.4833C10.8463 10.317 12.4489 10.3162 14.0446 10.317C15.6399 10.3162 17.2425 10.317 18.8254 10.4833C19.4942 10.5536 20.0496 11.0243 20.2058 11.6628C20.4283 12.5718 20.4265 13.5642 20.4265 14.5C20.4265 15.4358 20.4259 16.4282 20.2034 17.3372Z" fill="white"/>
</svg>
