<svg width="45" height="45" viewBox="0 0 45 45" fill="none" xmlns="http://www.w3.org/2000/svg">
<circle cx="22.5" cy="22.5" r="22.5" fill="url(#paint0_linear)"/>
<path d="M23.7065 33.2197L23.7068 33.2194C24.8846 32.0804 26.8463 30.0498 28.51 27.6904C30.1863 25.3131 31.5 22.6851 31.5 20.3362L23.7065 33.2197ZM23.7065 33.2197C23.3147 33.5992 22.7131 33.5931 22.3258 33.2031L23.7065 33.2197ZM23 11.5C18.3228 11.5 14.5 15.4389 14.5 20.3367C14.5 22.5092 15.8181 25.1063 17.5086 27.5182C19.1826 29.9067 21.153 32.0189 22.3254 33.2027L23 11.5ZM23 11.5C27.6772 11.5 31.4995 15.4389 31.5 20.3362L23 11.5ZM18.7799 19.5116C18.7799 21.9018 20.6517 23.8703 23 23.8703C25.3479 23.8703 27.2191 21.9022 27.2191 19.5116C27.2191 17.1211 25.348 15.1524 23 15.1524C20.6516 15.1524 18.7799 17.1215 18.7799 19.5116Z" stroke="white"/>
<defs>
<linearGradient id="paint0_linear" x1="3.375" y1="5.0625" x2="38.8125" y2="39.375" gradientUnits="userSpaceOnUse">
<stop stop-color="#0045A0"/>
<stop offset="1" stop-color="#397DFB"/>
</linearGradient>
</defs>
</svg>
