<svg width="50" height="50" viewBox="0 0 50 50" fill="none" xmlns="http://www.w3.org/2000/svg">
<path fill-rule="evenodd" clip-rule="evenodd" d="M33.7522 19.2556C35.5525 19.7146 36.9822 20.2053 38.0377 20.6791C43.6799 23.9245 45.4873 28.4068 43.4826 34.0994C39.7695 40.8709 32.277 43.0595 21.0299 40.663C-2.19238 33.1597 5.14714 7.99398 18.5898 11.797C19.9627 12.1945 21.3251 13.1081 22.7016 14.5358C25.2454 16.5994 28.9207 18.1734 33.7522 19.2556Z" fill="url(#paint0_linear)"/>
<path d="M40.4913 23.9785H17.5087C16.6755 23.9785 16 24.6621 16 25.5053V31.0016C16 31.8448 16.6755 32.5284 17.5087 32.5284H40.4913C41.3245 32.5284 42 31.8448 42 31.0016V25.5053C42 24.6621 41.3245 23.9785 40.4913 23.9785Z" stroke="#373A3C" stroke-width="1.5" stroke-miterlimit="22.9256"/>
<path d="M26.4604 19.6039C28.0697 18.1789 29.7293 18.1789 31.3889 19.6039" stroke="#373A3C" stroke-width="1.5" stroke-miterlimit="22.9256" stroke-linecap="round"/>
<path d="M22.2361 16.2959C26.4102 12.4281 31.59 12.479 35.563 16.2959" stroke="#373A3C" stroke-width="1.5" stroke-miterlimit="22.9256" stroke-linecap="round"/>
<path d="M17.5088 12.9874C24.5997 6.32056 33.5011 6.37146 40.3405 12.9365" stroke="#373A3C" stroke-width="1.5" stroke-miterlimit="22.9256" stroke-linecap="round"/>
<path d="M31.238 28.3066H33.1491" stroke="#373A3C" stroke-width="1.5" stroke-miterlimit="22.9256" stroke-linecap="round"/>
<path d="M26.2593 28.3066H28.1703" stroke="#373A3C" stroke-width="1.5" stroke-miterlimit="22.9256" stroke-linecap="round"/>
<path d="M36.2166 28.3066H38.1276" stroke="#373A3C" stroke-width="1.5" stroke-miterlimit="22.9256" stroke-linecap="round"/>
<defs>
<linearGradient id="paint0_linear" x1="5.99113" y1="26.5062" x2="44.2666" y2="26.5062" gradientUnits="userSpaceOnUse">
<stop stop-color="#E9F3FF"/>
<stop offset="1" stop-color="#AECCFE"/>
</linearGradient>
</defs>
</svg>
