<svg width="50" height="50" viewBox="0 0 50 50" fill="none" xmlns="http://www.w3.org/2000/svg">
<path fill-rule="evenodd" clip-rule="evenodd" d="M45.0885 33.0818C50.6194 18.9499 47.2627 8.50456 35.0567 1.82263C28.5723 0.0561368 24.9486 2.09144 24.1094 7.92853C23.8043 17.8746 20.0662 25.747 12.8951 31.6225C6.56326 37.498 7.02099 42.7975 14.2302 47.4825C26.7795 53.5116 37.0402 48.7114 45.0885 33.0818Z" fill="url(#paint0_linear)"/>
<path d="M18.0487 10.9741C14.4557 10.9741 10.8627 10.8543 7.03012 10.7345C2.71852 9.7764 4.39525 3.309 8.94639 3.309C11.3417 3.18923 14.4557 4.86596 17.9289 9.89617M18.0487 10.9741C21.5219 10.9741 24.9951 10.8543 28.8277 10.7345C33.0195 9.7764 30.7439 3.06946 26.1928 3.309C23.7975 3.42876 20.8033 4.86596 17.9289 9.89617L18.0487 10.9741Z" stroke="#2B2A29" stroke-width="1.5" stroke-miterlimit="22.9256" stroke-linecap="round" stroke-linejoin="round"/>
<path d="M32.0614 13.8477H3.55697C2.69708 13.8477 2 14.0085 2 14.207V19.3569C2 19.5554 2.69708 19.7162 3.55697 19.7162H32.0614C32.9213 19.7162 33.6184 19.5554 33.6184 19.3569V14.207C33.6184 14.0085 32.9213 13.8477 32.0614 13.8477Z" stroke="#2B2A29" stroke-width="1.5" stroke-miterlimit="22.9256"/>
<path fill-rule="evenodd" clip-rule="evenodd" d="M5.35389 37.4442H30.2654C30.8642 37.4442 31.2235 36.9652 31.2235 36.3663V19.7188H4.39575V36.3663C4.39575 36.9652 4.75505 37.4442 5.35389 37.4442Z" stroke="#2B2A29" stroke-width="1.5" stroke-miterlimit="22.9256"/>
<path d="M17.8091 19.5977V37.4429" stroke="#2B2A29" stroke-width="1.5" stroke-miterlimit="22.9256"/>
<defs>
<linearGradient id="paint0_linear" x1="12.3166" y1="40.1993" x2="50.5368" y2="28.5282" gradientUnits="userSpaceOnUse">
<stop stop-color="#CDF8FC"/>
<stop offset="1" stop-color="#BFDFF9"/>
</linearGradient>
</defs>
</svg>
