<svg width="12" height="12" viewBox="0 0 12 12" fill="none" xmlns="http://www.w3.org/2000/svg">
<path d="M5.03832 6.00839L0.191496 1.09803C-0.0408745 0.863707 -0.0408745 0.484382 0.191496 0.250659C0.42328 0.0163386 0.799758 0.0163386 1.03154 0.250659L5.87421 5.15684L10.7617 0.177534C10.9935 -0.0591778 11.3699 -0.0591778 11.6017 0.177534C11.8335 0.414843 11.8335 0.798951 11.6017 1.03566L6.71783 6.01138L11.6194 10.9769C11.8512 11.2112 11.8512 11.5905 11.6194 11.8243C11.3876 12.0586 11.0111 12.0586 10.7793 11.8243L5.88194 6.86294L1.01394 11.8225C0.782154 12.0592 0.405676 12.0592 0.173892 11.8225C-0.0578918 11.5852 -0.0578918 11.201 0.173892 10.9643L5.03832 6.00839Z" fill="#397DFB"/>
</svg>
