<svg width="41" height="40" viewBox="0 0 41 40" fill="none" xmlns="http://www.w3.org/2000/svg">
<path fill-rule="evenodd" clip-rule="evenodd" d="M12.6833 23.7619C12.0886 25.5563 11.7076 27.0414 11.5405 28.2171C11.288 34.7643 14.4024 38.6923 20.9021 39.9785C29.3583 40.3814 35.7392 35.1156 40.0264 24.2037C46.4929 0.308286 18.7875 -6.70923 14.5551 6.81452C14.0952 8.21198 14.1767 9.86719 14.7141 11.7927C15.1571 15.0817 14.4842 19.051 12.6833 23.7619Z" fill="url(#paint0_linear)"/>
<path d="M10.6952 25.0447V14.9487M16.5677 25.0447V14.9487M18.1401 31.8115C16.7375 32.3355 15.2269 32.6284 13.6393 32.6284C6.65685 32.6284 1 26.9715 1 20.0045C1 13.0221 6.65685 7.36523 13.6393 7.36523C20.6063 7.36523 26.2632 13.0221 26.2632 20.0045C26.2632 21.1914 26.0936 22.3628 25.7853 23.4572" stroke="#2B2A29" stroke-width="1.5" stroke-miterlimit="22.9256" stroke-linecap="round"/>
<defs>
<linearGradient id="paint0_linear" x1="36.7039" y1="4.82668" x2="14.9118" y2="37.3992" gradientUnits="userSpaceOnUse">
<stop stop-color="#E9F3FF"/>
<stop offset="1" stop-color="#AECCFE"/>
</linearGradient>
</defs>
</svg>
