[
    {
        "name": "soup",
        "image":"soup.jpg"
    },
    {
        "name": "pasta",
        "image":"pasta.jpg"
    },
    {
        "name": "pizza",
        "image":"pizza.jpg"
    },
    {
        "name": "drinks",
        "image":"drinks.png"
    },
    {
        "name": "grill",
        "image":"grill.jpg"
    },
    {
        "name": "desert",
        "image":"dessert.jpg"
    }
]