%YAML 1.1
%TAG !u! tag:unity3d.com,2011:
--- !u!114 &11400000
MonoBehaviour:
  m_ObjectHideFlags: 0
  m_CorrespondingSourceObject: {fileID: 0}
  m_PrefabInstance: {fileID: 0}
  m_PrefabAsset: {fileID: 0}
  m_GameObject: {fileID: 0}
  m_Enabled: 1
  m_EditorHideFlags: 0
  m_Script: {fileID: 11500000, guid: bbb281ee3bf0b054c82ac2347e9e782c, type: 3}
  m_Name: FirebaseStorageSceneGroup
  m_EditorClassIdentifier: 
  m_GroupName: FirebaseStorageSceneGroup
  m_Data:
    m_SerializedData: []
  m_GUID: 3950984c291b04896875239eaba6d2a8
  m_SerializeEntries:
  - m_GUID: 5812f047716fa434ebc91f95f7c220e3
    m_Address: Assets/Scenes/RemoteSavedScene1.unity
    m_ReadOnly: 0
    m_SerializedLabels: []
  - m_GUID: ddeebe47aa8994702abc59b5d57eab1c
    m_Address: Assets/Scenes/RemoteSavedScene2.unity
    m_ReadOnly: 0
    m_SerializedLabels: []
  m_ReadOnly: 0
  m_Settings: {fileID: 11400000, guid: e51a99209da4145f9abd51489af1307d, type: 2}
  m_SchemaSet:
    m_Schemas:
    - {fileID: 11400000, guid: 8ffcb341439b0442d89de6d8b4ac7759, type: 2}
    - {fileID: 11400000, guid: ad41274c7d1c24ebba173175cc530286, type: 2}
