%YAML 1.1
%TAG !u! tag:unity3d.com,2011:
--- !u!114 &11400000
MonoBehaviour:
  m_ObjectHideFlags: 0
  m_CorrespondingSourceObject: {fileID: 0}
  m_PrefabInstance: {fileID: 0}
  m_PrefabAsset: {fileID: 0}
  m_GameObject: {fileID: 0}
  m_Enabled: 1
  m_EditorHideFlags: 0
  m_Script: {fileID: 11500000, guid: bbb281ee3bf0b054c82ac2347e9e782c, type: 3}
  m_Name: Default Local Group
  m_EditorClassIdentifier: 
  m_GroupName: Default Local Group
  m_Data:
    m_SerializedData: []
  m_GUID: fc4d830503b5f419996e5f1b5d45fbf7
  m_SerializeEntries:
  - m_GUID: f1e326e09fc6e4ad68da74a45404d3a2
    m_Address: Assets/Textures/LocalImage.jpg
    m_ReadOnly: 0
    m_SerializedLabels: []
  m_ReadOnly: 0
  m_Settings: {fileID: 11400000, guid: e51a99209da4145f9abd51489af1307d, type: 2}
  m_SchemaSet:
    m_Schemas:
    - {fileID: 11400000, guid: 535f4df0f6322492ebcf033c6ce8ab53, type: 2}
    - {fileID: 11400000, guid: 7807df3511ff34321ae48165402e5b2c, type: 2}
