{
    "brandOption": "REGISTERED",
    "brandValue": "ENERGO",
    "tipMaterialDeAmbalare": "carton mucava",
    "tipAmbalaj": "cutie",
    "cantitateNeta": "1",
    "cantitateTip": "bucata",
    "pieteTinta": "182"
}