{
  "root": "apps/yelp-lister-e2e",
  "sourceRoot": "apps/yelp-lister-e2e/src",
  "projectType": "application",
  "targets": {
    "e2e": {
      "executor": "@nrwl/cypress:cypress",
      "options": {
        "cypressConfig": "apps/yelp-lister-e2e/cypress.json",
        "devServerTarget": "yelp-lister:serve"
      },
      "configurations": {
        "production": {
          "devServerTarget": "yelp-lister:serve:production"
        }
      }
    },
    "lint": {
      "executor": "@nrwl/linter:eslint",
      "outputs": ["{options.outputFile}"],
      "options": {
        "lintFilePatterns": ["apps/yelp-lister-e2e/**/*.{js,ts}"]
      }
    }
  },
  "tags": [],
  "implicitDependencies": ["yelp-lister"]
}
