Division,WeightClassKg,Place,Name,Team,BodyweightKg,Best3SquatKg,Best3BenchKg,Best3DeadliftKg,TotalKg,Equipment,Event,Sex
Girls,44.23,1,Lexus Gutierrez,Mathis,43.86,117.93,61.23,133.81,312.98,Single-ply,SBD,F
Girls,44.23,2,Brittany Trevino,San Diego,43.27,122.47,58.97,129.27,310.71,Single-ply,SBD,F
Girls,44.23,3,Betsy Ramirez,Winnsboro,44.04,124.74,58.97,117.93,301.64,Single-ply,SBD,F
Girls,44.23,4,Hailey Nunez,Wichita Falls City View,43.23,120.2,54.43,122.47,297.1,Single-ply,SBD,F
Girls,44.23,5,Heav'nly Noriega,Tulia,43.09,106.59,56.7,120.2,283.5,Single-ply,SBD,F
Girls,44.23,6,Hannah West,Lago Vista,43.32,113.4,54.43,115.67,283.5,Single-ply,SBD,F
Girls,44.23,7,Adrianna Villafuerte,Edinburg Idea College Prep,43.86,120.2,47.63,113.4,281.23,Single-ply,SBD,F
Girls,44.23,8,Clarissa Garcia,Yoakum,43.09,106.59,52.16,115.67,274.42,Single-ply,SBD,F
Girls,44.23,9,Jailene Williams,Blooming Grove,40.82,97.52,58.97,113.4,269.89,Single-ply,SBD,F
Girls,44.23,10,Samantha Sanchez,Natalia,41.37,104.33,54.43,108.86,267.62,Single-ply,SBD,F
Girls,44.23,11,Lily Buckley,Lago Vista,43.91,113.4,52.16,99.79,265.35,Single-ply,SBD,F
Girls,44.23,12,Gabby Zarate,San Diego,43,108.86,38.56,115.67,263.08,Single-ply,SBD,F
Girls,44.23,13,Anastasia Rodriguez,Natalia,43.82,102.06,61.23,95.25,258.55,Single-ply,SBD,F
Girls,44.23,14,Kaitlyn Lucio,El Maton Tidehaven,42.96,83.91,49.9,111.13,244.94,Single-ply,SBD,F
Girls,44.23,15,Rosario Labrada,Whitesboro,43.59,81.65,54.43,104.33,240.4,Single-ply,SBD,F
Girls,44.23,16,Mariah De La Rosa,Crane,44,90.72,52.16,97.52,240.4,Single-ply,SBD,F
Girls,44.23,17,Lesli Miranda,Woodville,42.86,95.25,43.09,95.25,233.6,Single-ply,SBD,F
Girls,47.85,1,Regina Garza,Natalia,45.86,136.08,63.5,142.88,342.46,Single-ply,SBD,F
Girls,47.85,2,Kelsey Lopez,Van Vleck,47.72,133.81,68.04,124.74,326.59,Single-ply,SBD,F
Girls,47.85,3,Annika Nittmo,Winnsboro,47.72,124.74,63.5,133.81,322.05,Single-ply,SBD,F
Girls,47.85,4,Sarah Jo Campos,San Diego,47.63,127.01,58.97,129.27,315.25,Single-ply,SBD,F
Girls,47.85,5,Maribel Reyna,Rogers,46.95,124.74,61.23,124.74,310.71,Single-ply,SBD,F
Girls,47.85,6,Hannah Robinson,Buna,46.67,117.93,58.97,129.27,306.17,Single-ply,SBD,F
Girls,47.85,7,Sterling Ford,Brady,47.49,124.74,58.97,120.2,303.91,Single-ply,SBD,F
Girls,47.85,8,Madison Sullivan,Clyde,46.95,122.47,52.16,124.74,299.37,Single-ply,SBD,F
Girls,47.85,9,Madison Chalenburg,Wichita Falls City View,46.45,117.93,47.63,129.27,294.84,Single-ply,SBD,F
Girls,47.85,10,Hanna Richison,Winnsboro,46.72,113.4,54.43,117.93,285.76,Single-ply,SBD,F
Girls,47.85,11,Alyssa Davila,Kermit,46.27,108.86,58.97,106.59,274.42,Single-ply,SBD,F
Girls,47.85,12,Rhiannon Spaulding,Farmersville,46.27,106.59,56.7,102.06,265.35,Single-ply,SBD,F
Girls,51.94,1,Liszette Rasado-Ortiz,San Antonio Brooks Academy,49.21,124.74,92.99,136.08,353.8,Single-ply,SBD,F
Girls,51.94,2,Kayla Wampler,Wichita Falls City View,49.71,136.08,68.04,136.08,340.19,Single-ply,SBD,F
Girls,51.94,3,Karisa Ramirez,Hebbronville,51.44,140.61,65.77,124.74,331.12,Single-ply,SBD,F
Girls,51.94,4,Caitlyn Berry,Bishop,50.98,127.01,68.04,129.27,324.32,Single-ply,SBD,F
Girls,51.94,5,Alixsus Neely,Winnsboro,51.85,136.08,56.7,131.54,324.32,Single-ply,SBD,F
Girls,51.94,6,Vanessa Vega,Skidmore-Tynan,50.8,129.27,65.77,127.01,322.05,Single-ply,SBD,F
Girls,51.94,7,Carolina Flores,Hebbronville,51.89,129.27,54.43,138.35,322.05,Single-ply,SBD,F
Girls,51.94,8,Shay Kotulek,Leonard,51.66,127.01,77.11,113.4,317.51,Single-ply,SBD,F
Girls,51.94,9,Peyton Garner,Buna,51.17,117.93,58.97,138.35,315.25,Single-ply,SBD,F
Girls,51.94,10,Iris Cantu,Natalia,50.98,124.74,63.5,124.74,312.98,Single-ply,SBD,F
Girls,51.94,11,Taylor Lopez,Clyde,51.21,131.54,52.16,129.27,312.98,Single-ply,SBD,F
Girls,51.94,12,Destiny Strain,Leonard,51.89,122.47,63.5,124.74,310.71,Single-ply,SBD,F
Girls,51.94,13,Allie Boehlar,Paris Chisum,48.58,117.93,63.5,124.74,306.17,Single-ply,SBD,F
Girls,51.94,14,Jasmine Gomez,Natalia,51.44,124.74,61.23,115.67,301.64,Single-ply,SBD,F
Girls,51.94,15,Hailey Northcutt,Lago Vista,49.76,117.93,65.77,115.67,299.37,Single-ply,SBD,F
Girls,51.94,16,Tesla Mowery,Winnsboro,51.8,108.86,63.5,127.01,299.37,Single-ply,SBD,F
Girls,51.94,17,Luisa Soto,White Oak,50.58,122.47,56.7,115.67,294.84,Single-ply,SBD,F
Girls,51.94,18,Taylor Netherton,Early,50.98,111.13,58.97,124.74,294.84,Single-ply,SBD,F
Girls,51.94,19,Jordan Paredes,Sonora,50.58,122.47,49.9,120.2,292.57,Single-ply,SBD,F
Girls,51.94,20,Kayden Bayer,Buna,48.35,97.52,58.97,122.47,278.96,Single-ply,SBD,F
Girls,51.94,DQ,Katherine Espinoza,Hebbronville,51.8,,,,,Single-ply,SBD,F
Girls,56.02,1,Karla Fuentes,Winnsboro,54.52,140.61,77.11,156.49,374.21,Single-ply,SBD,F
Girls,56.02,2,Taylor Jones #1,Little River Academy,55.29,131.54,79.38,151.95,362.87,Single-ply,SBD,F
Girls,56.02,3,Baily Pastrano,San Diego,55.11,142.88,65.77,140.61,349.27,Single-ply,SBD,F
Girls,56.02,4,Christy Gonzalez,Edinburg Idea College Prep,53.71,129.27,79.38,138.35,347,Single-ply,SBD,F
Girls,56.02,5,Julie Gonzalez,San Diego,53.25,154.22,54.43,136.08,344.73,Single-ply,SBD,F
Girls,56.02,6,Kylie Robinson,Bowie,54.57,122.47,68.04,149.69,340.19,Single-ply,SBD,F
Girls,56.02,7,Alicia Dennis,Kemp,54.75,138.35,70.31,131.54,340.19,Single-ply,SBD,F
Girls,56.02,8,Rian Kinney,Paradise,54.16,149.69,68.04,120.2,337.93,Single-ply,SBD,F
Girls,56.02,9,Jordan Moore #3,Hallettsville,55.16,131.54,68.04,136.08,335.66,Single-ply,SBD,F
Girls,56.02,10,Kambrie Spain,Brady,52.89,127.01,58.97,129.27,315.25,Single-ply,SBD,F
Girls,56.02,11,Feather Wilson,Coldspring-Oakhurst,53.8,120.2,52.16,136.08,308.44,Single-ply,SBD,F
Girls,56.02,12,Oralia Cardenas,Slaton,55.93,108.86,49.9,122.47,281.23,Single-ply,SBD,F
Girls,56.02,DQ,Peggy King,El Maton Tidehaven,55.38,,,,,Single-ply,SBD,F
Girls,56.02,DQ,Lorena Guajardo,San Angelo Grape Creek,55.43,124.74,,,,Single-ply,SBD,F
Girls,60.1,1,Alyssa Hill,Van Alstyne,59.47,170.1,81.65,154.22,405.97,Single-ply,SBD,F
Girls,60.1,2,Alee Ruiz,Dilley,58.74,158.76,72.57,154.22,385.55,Single-ply,SBD,F
Girls,60.1,3,Julianna Morales,Natalia,59.1,142.88,88.45,142.88,374.21,Single-ply,SBD,F
Girls,60.1,4,Chloe Houston,Van Alstyne,59.74,140.61,77.11,149.69,367.41,Single-ply,SBD,F
Girls,60.1,5,Amber Pavelka,West,58.69,147.42,72.57,142.88,362.87,Single-ply,SBD,F
Girls,60.1,6,Lily Perez,Palmer,59.33,140.61,72.57,149.69,362.87,Single-ply,SBD,F
Girls,60.1,7,Hallie Brinson,Early,57.65,142.88,79.38,136.08,358.34,Single-ply,SBD,F
Girls,60.1,8,Raquel Balderas,Blooming Grove,59.47,133.81,74.84,147.42,356.07,Single-ply,SBD,F
Girls,60.1,9,Jayci Robicheaux,Buna,58.42,133.81,77.11,142.88,353.8,Single-ply,SBD,F
Girls,60.1,10,Bianca Jimenez,Dimmitt,60.06,127.01,70.31,131.54,328.85,Single-ply,SBD,F
Girls,60.1,11,Ariana Garay,El Maton Tidehaven,59.19,111.13,65.77,124.74,301.64,Single-ply,SBD,F
Girls,60.1,12,Kati Creech,Big Lake Reagan County,57.97,129.27,45.36,92.99,267.62,Single-ply,SBD,F
Girls,67.36,1,Nallely Gutierrez,San Antonio Brooks Academy,66.27,172.37,111.13,176.9,460.4,Single-ply,SBD,F
Girls,67.36,2,Cassandra Carlton,Lago Vista,64.41,188.24,108.86,158.76,455.86,Single-ply,SBD,F
Girls,67.36,3,Dreanna McAdams,Howe,65.77,156.49,97.52,172.37,426.38,Single-ply,SBD,F
Girls,67.36,4,Karina Ramon,Palacios,66.59,151.95,102.06,151.95,405.97,Single-ply,SBD,F
Girls,67.36,5,Crystal Williams,Little River Academy,65.41,156.49,88.45,145.15,390.09,Single-ply,SBD,F
Girls,67.36,6,Keisha Walker,Buna,66.95,138.35,63.5,156.49,358.34,Single-ply,SBD,F
Girls,67.36,7,Abby Esquivel #1,Mathis,64.55,142.88,58.97,147.42,349.27,Single-ply,SBD,F
Girls,67.36,8,Olivia Garcia,Hebbronville,67.22,138.35,77.11,133.81,349.27,Single-ply,SBD,F
Girls,67.36,9,Rebecca Eugster,Callisburg,65.95,138.35,70.31,127.01,335.66,Single-ply,SBD,F
Girls,67.36,DQ,Clarissa Hernandez,Dimmitt,64.05,,,,,Single-ply,SBD,F
Girls,67.36,DQ,Kaylie Aranda,Kermit,65.68,,,,,Single-ply,SBD,F
Girls,67.36,DQ,Kaitlyn McCarter,Paris Chisum,65.27,,,,,Single-ply,SBD,F
Girls,67.36,DQ,Brtney Berlanga,Winona,63.96,,,,,Single-ply,SBD,F
Girls,75.07,1,Karina Avila,Hebbronville,70.99,208.65,79.38,181.44,469.47,Single-ply,SBD,F
Girls,75.07,2,Catrina Soto,Skidmore-Tynan,72.44,181.44,97.52,179.17,458.13,Single-ply,SBD,F
Girls,75.07,3,Marie Coon,Buna,73.71,190.51,90.72,163.29,444.52,Single-ply,SBD,F
Girls,75.07,4,Marissa Lutz,Lone Oak,74.03,170.1,97.52,151.95,419.57,Single-ply,SBD,F
Girls,75.07,5,Larissa Vordick,San Angelo Grape Creek,74.62,174.63,83.91,158.76,417.3,Single-ply,SBD,F
Girls,75.07,6,Brianna Guillen,San Diego,74.21,174.63,72.57,151.95,399.16,Single-ply,SBD,F
Girls,75.07,7,Tia Hart,Vanderbilt Industrial,73.48,147.42,90.72,151.95,390.09,Single-ply,SBD,F
Girls,75.07,8,Ashley Rosales,Florence,74.53,181.44,74.84,133.81,390.09,Single-ply,SBD,F
Girls,75.07,9,Carrington Davis,Bowie,73.35,158.76,90.72,138.35,387.82,Single-ply,SBD,F
Girls,75.07,10,Alexis Salazar,George West,74.34,163.29,74.84,147.42,385.55,Single-ply,SBD,F
Girls,75.07,11,Rakel Aguero,Jourdanton,71.89,165.56,83.91,133.81,383.29,Single-ply,SBD,F
Girls,75.07,12,Kerstin Humphries,Elkhart,73.84,151.95,77.11,149.69,378.75,Single-ply,SBD,F
Girls,75.07,13,Lexi Towery,Nocona,73.71,145.15,72.57,147.42,365.14,Single-ply,SBD,F
Girls,75.07,14,Millenia Rodriguez,Brady,73.21,149.69,68.04,145.15,362.87,Single-ply,SBD,F
Girls,75.07,15,Kelsey Whitten,Blooming Grove,74.16,124.74,88.45,147.42,360.61,Single-ply,SBD,F
Girls,75.07,16,Kaela Michaelis,Alpine,73.16,138.35,79.38,129.27,347,Single-ply,SBD,F
Girls,75.07,DQ,Rosario Trejo,Pilot Point,69.76,,,,,Single-ply,SBD,F
Girls,82.33,1,Jas'Lyn Glover,Hempstead,80.1,172.37,99.79,197.31,469.47,Single-ply,SBD,F
Girls,82.33,2,Alexis Gallegos,San Diego,79.2,190.51,108.86,167.83,467.2,Single-ply,SBD,F
Girls,82.33,3,Shamaurie Williams,El Maton Tidehaven,75.61,174.63,88.45,176.9,439.98,Single-ply,SBD,F
Girls,82.33,4,Kyndall Hoelscher,West,79.79,181.44,95.25,163.29,439.98,Single-ply,SBD,F
Girls,82.33,5,Teryn Pritchett,Palmer,80.78,161.03,86.18,172.37,419.57,Single-ply,SBD,F
Girls,82.33,6,Bridgett Zubia,Kermit,79.29,158.76,90.72,165.56,415.04,Single-ply,SBD,F
Girls,82.33,7,Toni Huelsberg,Alpine,75.89,167.83,92.99,151.95,412.77,Single-ply,SBD,F
Girls,82.33,8,Marina Sanchez,Brady,78.02,167.83,72.57,170.1,410.5,Single-ply,SBD,F
Girls,82.33,9,Bekah Parks,Teague,79.47,170.1,86.18,149.69,405.97,Single-ply,SBD,F
Girls,82.33,10,Tatum Posey,Bowie,75.84,163.29,95.25,142.88,401.43,Single-ply,SBD,F
Girls,82.33,11,Chesney Kuper,Little River Academy,79.15,140.61,97.52,156.49,394.63,Single-ply,SBD,F
Girls,82.33,12,Jordan Bush,Little River Academy,81.28,154.22,81.65,151.95,387.82,Single-ply,SBD,F
Girls,82.33,13,Joyclyne Landry,Anahuac,80.2,142.88,90.72,149.69,383.29,Single-ply,SBD,F
Girls,82.33,14,Demarkia Palmer,Daingerfield,81.65,149.69,63.5,170.1,383.29,Single-ply,SBD,F
Girls,82.33,15,Rosie Narvaez,Rogers,81.92,147.42,90.72,145.15,383.29,Single-ply,SBD,F
Girls,82.33,16,Hailey Jacobs,Winona,80.33,154.22,68.04,158.76,381.02,Single-ply,SBD,F
Girls,82.33,17,Cassie Castro,Poth,79.42,163.29,61.23,145.15,369.68,Single-ply,SBD,F
Girls,82.33,18,McKayla Weaver,Henrietta,82.24,145.15,65.77,133.81,344.73,Single-ply,SBD,F
Girls,82.33,NS,Natalia Ortiz,San Antonio Brooks Academy,,,,,,Single-ply,SBD,F
Girls,90.04,1,Taylor Strmiska,Little River Academy,88.04,213.19,127.01,195.04,535.24,Single-ply,SBD,F
Girls,90.04,2,Deanna Fisher,Trinity,87.77,185.97,113.4,183.7,483.08,Single-ply,SBD,F
Girls,90.04,3,Gen Tyson,Van Alstyne,87.91,204.12,92.99,158.76,455.86,Single-ply,SBD,F
Girls,90.04,4,Raini Goodell,Eustace,87.91,170.1,97.52,183.7,451.32,Single-ply,SBD,F
Girls,90.04,5,Harleigh McEnturff,Elkhart,86.86,179.17,86.18,165.56,430.91,Single-ply,SBD,F
Girls,90.04,6,Veronica Villarreal,Early,86.09,165.56,95.25,156.49,417.3,Single-ply,SBD,F
Girls,90.04,7,Martha Riojas,Dublin,84.55,174.63,83.91,149.69,408.23,Single-ply,SBD,F
Girls,90.04,8,Abby Hernandez,San Diego,88,176.9,70.31,149.69,396.89,Single-ply,SBD,F
Girls,90.04,9,Vanessa McNiel,Blooming Grove,85.91,149.69,97.52,147.42,394.63,Single-ply,SBD,F
Girls,90.04,10,Belle Gomez,Clyde,85.28,158.76,77.11,147.42,383.29,Single-ply,SBD,F
Girls,90.04,11,Sydney Goodman,Buna,88.68,142.88,58.97,138.35,340.19,Single-ply,SBD,F
Girls,90.04,12,Taylor Hall #1,Kirbyville,89.49,142.88,52.16,127.01,322.05,Single-ply,SBD,F
Girls,90.04,DQ,Lucy Arreola,Kermit,89.4,,,,,Single-ply,SBD,F
Girls,90.04,DQ,Gwen Tyson,Van Alstyne,88.27,,,,,Single-ply,SBD,F
Girls,90.04,DQ,Breann Garza,Yoakum,89.36,,,,,Single-ply,SBD,F
Girls,100.02,1,Jasmyne Martinez,Cotulla,92.35,219.99,115.67,170.1,505.76,Single-ply,SBD,F
Girls,100.02,2,Jennefer Lozano,Hebbronville,93.58,213.19,92.99,188.24,494.42,Single-ply,SBD,F
Girls,100.02,3,Cheyenne Meyer,Bruceville-Eddy,90.58,190.51,99.79,201.85,492.15,Single-ply,SBD,F
Girls,100.02,4,Madison Wilbanks,Malakoff,96.93,208.65,108.86,170.1,487.61,Single-ply,SBD,F
Girls,100.02,5,Alexia Soliz,San Diego,93.71,215.46,92.99,154.22,462.66,Single-ply,SBD,F
Girls,100.02,6,Mattie Harmon,Winnie East Chambers,99.34,190.51,88.45,174.63,453.59,Single-ply,SBD,F
Girls,100.02,7,Stephanie Figueroa,Bishop,92.71,204.12,95.25,142.88,442.25,Single-ply,SBD,F
Girls,100.02,8,Carmela Guevara,Tolar,90.58,181.44,90.72,161.03,433.18,Single-ply,SBD,F
Girls,100.02,9,Kenlee Gauntt,Teague,97.43,172.37,104.33,156.49,433.18,Single-ply,SBD,F
Girls,100.02,10,Brittany Bernhardt,Wichita Falls City View,94.44,181.44,92.99,156.49,430.91,Single-ply,SBD,F
Girls,100.02,11,Alexis Anaya,Winnie East Chambers,98.07,170.1,72.57,174.63,417.3,Single-ply,SBD,F
Girls,100.02,12,Jacque Marquez,Alpine,90.9,161.03,90.72,136.08,387.82,Single-ply,SBD,F
Girls,100.02,13,Taylor Brown #3,Whitesboro,92.22,151.95,74.84,145.15,371.95,Single-ply,SBD,F
Girls,117.71,1,Kinsey Lane,Tolar,115.44,233.6,106.59,199.58,539.77,Single-ply,SBD,F
Girls,117.71,2,Emilia Betancourt,Bruceville-Eddy,101.74,210.92,99.79,197.31,508.02,Single-ply,SBD,F
Girls,117.71,3,Samantha Heimer,San Antonio Brooks Academy,103.01,188.24,142.88,147.42,478.54,Single-ply,SBD,F
Girls,117.71,4,Ebony Vega,Mathis,113.53,215.46,88.45,174.63,478.54,Single-ply,SBD,F
Girls,117.71,5,Erica Graybill,Bruceville-Eddy,111.45,197.31,99.79,174.63,471.74,Single-ply,SBD,F
Girls,117.71,6,McKaylen Drake,Rogers,112.99,199.58,95.25,151.95,446.79,Single-ply,SBD,F
Girls,117.71,7,Tikyana Harrison,Coldspring-Oakhurst,108.23,167.83,70.31,181.44,419.57,Single-ply,SBD,F
Girls,117.71,8,Carley Scott,Millsap,102.78,151.95,72.57,181.44,405.97,Single-ply,SBD,F
Girls,117.71,9,Zuri Garcia,Pollok Central,103.24,181.44,77.11,147.42,405.97,Single-ply,SBD,F
Girls,117.71,10,Tiffany Goranson,Edna,101.02,174.63,72.57,156.49,403.7,Single-ply,SBD,F
Girls,117.71,11,Alexis Bolin,Leonard,107.55,145.15,90.72,154.22,390.09,Single-ply,SBD,F
Girls,117.71,12,Katlin Parks,Coleman,108.59,170.1,70.31,129.27,369.68,Single-ply,SBD,F
Girls,117.71,13,Daisey Narvaez,Big Lake Reagan County,114.71,145.15,74.84,142.88,362.87,Single-ply,SBD,F
Girls,117.71,DQ,Halee McCaslin,Corsicana Mildred,103.69,181.44,95.25,,,Single-ply,SBD,F
Girls,117.71+,1,Bobby Denard,Buna,138.12,213.19,145.15,154.22,512.56,Single-ply,SBD,F
Girls,117.71+,2,Hailie Morehead,Franklin,134.26,219.99,86.18,204.12,510.29,Single-ply,SBD,F
Girls,117.71+,3,Mikala Arizmendi,Dimmitt,136.53,210.92,102.06,197.31,510.29,Single-ply,SBD,F
Girls,117.71+,4,Julie Martinez,Cotulla,159.12,224.53,99.79,158.76,483.08,Single-ply,SBD,F
Girls,117.71+,5,Deziray Graham,Nocona,120.25,199.58,99.79,165.56,464.93,Single-ply,SBD,F
Girls,117.71+,6,Victoria Gonzales,Cotulla,124.56,181.44,86.18,170.1,437.72,Single-ply,SBD,F
Girls,117.71+,7,Haylee McAdoo,Whitesboro,136.26,185.97,102.06,147.42,435.45,Single-ply,SBD,F
Girls,117.71+,8,Cydney Crawford,New Boston,135.08,176.9,106.59,136.08,419.57,Single-ply,SBD,F
Girls,117.71+,9,Koral Sylestine,Woodville,117.75,149.69,97.52,161.03,408.23,Single-ply,SBD,F
Girls,117.71+,10,Aubry Carr,Rogers,124.28,142.88,63.5,124.74,331.12,Single-ply,SBD,F
Girls,117.71+,11,Shaianne Gonzales,Ballinger,144.24,111.13,68.04,111.13,290.3,Single-ply,SBD,F
Girls,117.71+,DQ,Andrea Beasley,Kemp,121.15,,,,,Single-ply,SBD,F
