Name,Sex,Division,Tested,Equipment,BodyweightKg,WeightClassKg,Squat1Kg,Squat2Kg,Squat3Kg,Best3SquatKg,Bench1Kg,Bench2Kg,Bench3Kg,Best3BenchKg,Deadlift1Kg,Deadlift2Kg,Deadlift3Kg,Best3DeadliftKg,TotalKg,Event,Place,BirthDate
Adam Jones #3,M,M_OR_ABPU,Yes,Raw,88.9,90,180,190,200,200,130,140,150,150,250,260,275,275,625,SBD,2,
Adam Towse,M,M_OR_BPU,,Raw,106.2,110,,,,,140,-160,-160,140,,,,,140,B,1,
Adam Towse,M,M_OR_BPU,,Raw,106.2,110,,,,,,,,,242.5,,,242.5,242.5,D,1,
Alex McClymont,M,M_OR_ABPU,Yes,Raw,108.3,110,,,,,155,-162.5,-162.5,155,,,,,155,B,1,
Alexandra Foster #1,F,F_OR_ABPU,Yes,Raw,74.3,75,115,125,130,130,65,70,-72.5,70,145,155,165,165,365,SBD,1,
Alison Dufour,F,F_OR_ABPU,Yes,Raw,82,82.5,110,117.5,125,125,70,75,80,80,140,150,-160,150,355,SBD,1,
Andrew Barber #2,M,M_OR_ABPU,Yes,Raw,88.6,90,,,,,155,160,-167.5,160,,,,,160,B,1,
Andy Parton,M,M_OR_BPU,,Raw,94.9,100,195,220,232.5,232.5,130,142.5,-155,142.5,225,240,-252.5,240,615,SBD,1,
Ann Votsikas,F,F_MR_3_ABPU,Yes,Raw,80.3,82.5,75,80,87.5,87.5,50,60,65,65,130,140,145,145,297.5,SBD,1,
Ben Karaosman,M,M_JES_ABPU,Yes,Single-ply,113.9,125,250,265,275,275,150,160,167.5,167.5,200,225,240,240,682.5,SBD,1,
Ben Staniforth,M,M_OR_BPU,,Raw,138.3,140,260,272.5,285,285,170,175,180,180,275,282.5,-290,282.5,747.5,SBD,1,
Bradley Nortcliffe,M,M_JCR_ABPU,Yes,Wraps,60.5,67.5,160,-170,170,170,-110,110,120,120,200,210,-220,210,500,SBD,1,
Cameron Couldwell,M,M_OCR_BPU,,Wraps,119.4,125,227.5,240,255,255,155,165,-180,165,-290,290,,290,710,SBD,3,
Chris Allison,M,M_OCR_ABPU,Yes,Wraps,89,90,195,205,215,215,100,110,-115,110,200,215,-230,215,540,SBD,1,
Chris Nyland,M,M_MCR_1_ABPU,Yes,Wraps,80.7,82.5,142.5,147.5,152.5,152.5,97.5,102.5,105,105,180,-190,190,190,447.5,SBD,1,
Daniel Clarkson,M,M_OR_ABPU,Yes,Raw,66.1,67.5,140,145,150,150,107.5,-115,115,115,140,150,,150,415,SBD,4,
Daniel Gildersleeve,M,M_OR_ABPU,Yes,Raw,66.3,67.5,-162.5,162.5,-170,162.5,107.5,115,-120,115,185,-200,200,200,477.5,SBD,3,
Daniel Stain,M,M_OR_BPU,,Raw,132.7,140,170,180,190,190,105,115,-120,115,220,230,-250,230,535,SBD,2,
Daniel Thrasivoulou,M,M_OR_ABPU,Yes,Raw,65.9,67.5,145,147.5,152.5,152.5,110,117.5,-122.5,117.5,205,210,215,215,485,SBD,1,
Darren Collett,M,M_OCR_ABPU,Yes,Wraps,95,100,160,170,180,180,120,-125,-125,120,200,205,-210,205,505,SBD,2,
Deborah Johansen,F,F_MCR_2_ABPU,Yes,Wraps,54.7,56,85,-87.5,87.5,87.5,50,55,57.5,57.5,100,110,115,115,260,SBD,1,
Daniel Cheetham,M,M_TCR_3_BPU,,Wraps,107.2,110,200,210,220,220,140,142.5,-145,142.5,260,272.5,-280,272.5,635,SBD,1,
Fadi Hussain,M,M_OCR_BPU,,Wraps,99.3,100,180,200,210,210,130,140,150,150,240,,,240,600,SBD,2,
Gemma Lucas,F,F_OR_ABPU,Yes,Raw,64.4,67.5,60,65,-70,65,40,42.5,-45,42.5,75,-85,90,90,197.5,SBD,1,
Gemma Wright,F,F_OR_ABPU,Yes,Raw,74,75,120,130,135,135,60,65,-67.5,65,140,152.5,162.5,162.5,362.5,SBD,2,
Gerry-Lee Pierre,M,M_JCR_ABPU,Yes,Wraps,107.2,110,240,257.5,265,265,162.5,170,175,175,260,275,-285,275,715,SBD,1,
Graham Dowers,M,M_MR_3_BPU,,Raw,67.3,67.5,,,,,110,120,130,130,,,,,130,B,1,
Jacob Brock,M,M_OCR_ABPU,Yes,Wraps,99.6,100,162.5,177.5,-190,177.5,130,137.5,142.5,142.5,220,235,-245,235,555,SBD,1,
Jacob Holdcroft,M,M_TR_3_ABPU,Yes,Raw,122,125,250,260,265,265,160,-165,165,165,280,300,-310,300,730,SBD,1,
Jane Stevenson,F,F_MCR_1_BPU,,Wraps,64.6,67.5,120,125,130,130,77.5,82.5,87.5,87.5,170,180,185,185,402.5,SBD,1,
Jason Holmes #1,M,M_OCR_BPU,,Wraps,128.5,140,260,280,-290,280,130,140,150,150,280,-300,300,300,730,SBD,1,
Jean Miguel Martinez,M,M_OR_ABPU,Yes,Raw,74.4,75,160,175,185,185,107.5,117.5,-125,117.5,185,200,210,210,512.5,SBD,2,
Jeremy Cope,M,M_MCR_2_BPU,,Wraps,86.9,90,210,220,-230,220,150,155,-160,155,220,230,242.5,242.5,617.5,SBD,1,
Jesse Page,M,M_OR_ABPU,Yes,Raw,86.2,90,190,,,190,130,140,145,145,215,225,-227.5,225,560,SBD,3,
Joel Booth,M,M_OR_ABPU,Yes,Raw,79.3,82.5,160,-170,180,180,120,132.5,145,145,210,220,230,230,555,SBD,2,
John Lock,M,M_OCR_BPU,,Wraps,96.8,100,-250,250,260,260,150,-160,-160,150,270,280,-290,280,690,SBD,1,
John Vincent #1,M,M_MCR_3_BPU,,Wraps,71.6,75,180,190,-200,190,120,130,-137.5,130,220,230,-240,230,550,SBD,1,
John Walsh #1,M,M_JCR_BPU,,Wraps,95.2,100,245,265,272.5,272.5,165,182.5,-190,182.5,235,-252.5,260,260,715,SBD,1,
Johnny Wade,M,M_OR_ABPU,Yes,Raw,81.7,82.5,160,170,-175,170,120,-127.5,-127.5,120,200,210,220,220,510,SBD,3,
Josh Ingram #1,M,M_OR_ABPU,Yes,Raw,81.6,82.5,200,210,-220,210,130,140,145,145,230,250,260,260,615,SBD,1,
Keenan Freer,M,M_TR_3_BPU,,Raw,79,82.5,150,165,-182.5,165,95,102.5,107.5,107.5,220,-237.5,-240,220,492.5,SBD,1,
Ken Hardaker,M,M_MR_2_ABPU,Yes,Raw,86.9,90,130,142.5,155,155,90,100,110,110,210,237.5,250,250,515,SBD,1,1970-05-26
Kerry Rutland,F,F_MCR_1_ABPU,Yes,Wraps,61.3,67.5,70,80,87.5,87.5,50,55,-57.5,55,105,-110,110,110,252.5,SBD,1,
Leon Newman,M,M_MCR_2_BPU,,Wraps,129.7,140,200,220,230,230,150,160,172.5,172.5,260,280,290,290,692.5,SBD,1,
Les Attewell,M,M_MCR_3_ABPU,Yes,Wraps,87.1,90,180,190,-200,190,120,130,140,140,250,265,-275,265,595,SBD,1,
Leslie Willis,M,M_MCR_2_BPU,,Wraps,148.2,140+,200,210,220,220,110,120,125,125,190,230,,230,575,SBD,1,
Lindsay Stevens,F,F_MCR_3_BPU,,Wraps,54.2,56,75,-77.5,-77.5,75,32.5,35,-37.5,35,80,85,-90,85,195,SBD,1,
Lisa Bulcock,F,F_OR_ABPU,Yes,Raw,87.9,90,150,160,-172.5,160,65,72.5,80,80,150,162.5,170,170,410,SBD,1,
Louis Beaumont,M,M_OCR_BPU,,Wraps,120.3,125,285,305,315,315,175,185,190,190,285,305,-315,305,810,SBD,1,
Marcus Kay,M,M_JCR_ABPU,Yes,Wraps,98.2,100,210,230,250,250,140,150,-160,150,250,265,285,285,685,SBD,1,
Martin Lewis,M,M_OR_BPU,,Raw,137.4,140,,,,,,,,,-280,300,-305,300,300,D,1,
Matthew Ardron,M,M_OR_ABPU,Yes,Raw,64.7,67.5,165,-170,172.5,172.5,90,100,105,105,180,190,200,200,477.5,SBD,2,
Matthew Coleman #2,M,M_OCR_BPU,,Wraps,123.4,125,240,260,280,280,150,160,-170,160,250,260,280,280,720,SBD,2,
Matthew Knight #1,M,M_OCR_BPU,,Wraps,103.7,110,280,300,312.5,312.5,170,185,-190,185,260,280,-300,280,777.5,SBD,2,
Matt Wilson #7,M,M_JES_BPU,,Single-ply,123.5,125,,,,,170,180,-190,180,,,,,180,B,1,
Michael Keys,M,M_OCR_ABPU,Yes,Wraps,108.4,110,210,-220,220,220,145,150,-155,150,245,252.5,-260,252.5,622.5,SBD,1,
Michael Smith #6,M,M_OR_ABPU,Yes,Raw,73.8,75,120,130,142.5,142.5,77.5,82.5,90,90,130,142.5,-155,142.5,375,SBD,4,
Mike Hoare,M,M_OCR_BPU,,Wraps,82.3,82.5,230,240,-250,240,140,147.5,-150,147.5,-250,250,260,260,647.5,SBD,1,
Mo Proctor,F,F_MCR_3_ABPU,Yes,Wraps,87,90,60,70,,70,60,65,70,70,120,130,132.5,132.5,272.5,SBD,1,
Nathan Jenkins,M,M_OR_BPU,,Raw,88.7,90,140,-160,-160,140,105,115,-120,115,190,215,220,220,475,SBD,1,
Neha Prasad Ainsworth,F,F_OR_BPU,,Raw,66.9,67.5,,,,,55,70,80,80,,,,,80,B,1,
Odette Smaldon,F,F_JR_ABPU,Yes,Raw,47.5,48,,,,,,,,,110,117.5,-125,117.5,117.5,D,1,
Odette Smaldon,F,F_JR_ABPU,Yes,Raw,47.5,48,70,75,-80,75,37.5,-40,-40,37.5,110,117.5,-125,117.5,230,SBD,1,
Olivia Munro,F,F_TR_2_ABPU,Yes,Raw,82,82.5,75,85,90,90,50,55,57.5,57.5,100,110,115,115,262.5,SBD,1,
Paul Barnes #2,M,M_MCR_2_BPU,,Wraps,78.2,82.5,120,130,135,135,90,100,-105,100,170,180,185,185,420,SBD,1,
Paul Beattie,M,M_OR_ABPU,Yes,Raw,72.4,75,190,200,205,205,135,140,145,145,225,235,240,240,590,SBD,1,
Paul Beckford,M,M_OCR_ABPU,Yes,Wraps,,140+,-250,250,270,270,170,180,-197.5,180,230,240,-260,240,690,SBD,1,
Paul Murphy #1,M,M_MES_2_BPU,,Single-ply,89.4,90,250,272.5,-285,272.5,140,150,-160,150,250,272.5,280,280,702.5,SBD,1,
Richard Lambert,M,M_MCR_3_BPU,,Wraps,81.9,82.5,210,-220,-220,210,125,132.5,137.5,137.5,200,-212.5,212.5,212.5,560,SBD,1,
Richard Lambert,M,M_OCR_BPU,,Wraps,81.9,82.5,210,-220,-220,210,125,132.5,137.5,137.5,200,-212.5,212.5,212.5,560,SBD,2,
Robyn Hedge,F,F_OR_ABPU,Yes,Raw,56.5,60,65,-67.5,-67.5,65,30,35,-40,35,95,102.5,110,110,210,SBD,2,
Russell Bain,M,M_MES_2_BPU,,Single-ply,87.6,90,,,,,160,-167.5,172.5,172.5,,,,,172.5,B,1,
Russell Bain,M,M_MES_2_BPU,,Single-ply,87.6,90,,,,,,,,,-270,-282.5,282.5,282.5,282.5,D,1,
Russell Taylor #1,M,M_OR_BPU,,Raw,81.9,82.5,195,207.5,212.5,212.5,135,142.5,150,150,230,250,-275,250,612.5,SBD,1,
Sainabou Joof,F,F_OCR_ABPU,Yes,Wraps,74.2,75,95,105,115,115,40,50,-55,50,125,135,145,145,310,SBD,1,
Sam Bollands,M,M_OCR_BPU,,Wraps,109.2,110,300,320,-332.5,320,190,202.5,-207.5,202.5,320,342.5,-355,342.5,865,SBD,1,
Samuel Mclean,M,M_OR_ABPU,Yes,Raw,74,75,155,162.5,-172.5,162.5,95,102.5,107.5,107.5,165,175,190,190,460,SBD,3,
Sean Blackburn,M,M_MEM_2_BPU,,Multi-ply,117.7,125,,,,,210,-230,-247.5,210,,,,,210,B,1,
Sophie Mckinna,F,F_JR_ABPU,Yes,Raw,107.7,90+,150,160,175,175,100,110,120,120,170,190,205,205,500,SBD,1,
Tawanda Bwerudza,M,M_OR_ABPU,Yes,Raw,86.9,90,210,222.5,-225,222.5,110,120,-130,120,260,280,295,295,637.5,SBD,1,
Thomas Blakey,M,M_JCR_BPU,,Wraps,97.2,100,215,230,245,245,130,137.5,145,145,220,235,-250,235,625,SBD,2,
Tom Griffin #1,M,M_MES_3_BPU,,Single-ply,106.6,110,,,,,262.5,272.5,280,280,,,,,280,B,1,
Tom Hudson,M,M_JR_BPU,,Raw,121.4,125,195,212.5,225,225,140,145,160,160,265,280,295,295,680,SBD,1,
Viv Dickinson,F,F_OCR_BPU,,Wraps,87.2,90,100,-107.5,107.5,107.5,57.5,-60,60,60,115,-120,-120,115,282.5,SBD,1,
Wes Fish,M,M_OES_BPU,,Single-ply,99.6,100,260,280,302.5,302.5,180,195,202.5,202.5,280,-300,310,310,815,SBD,1,
Yvette Wilmot,F,F_OR_ABPU,Yes,Raw,59,60,55,65,70,70,45,50,-52.5,50,95,105,110,110,230,SBD,1,
