Division,WeightClassKg,Place,Name,Team,BodyweightKg,Best3SquatKg,Best3BenchKg,Best3DeadliftKg,TotalKg,Equipment,Event,Sex
Girls,44.23,1,Rhema Orta,Port Lavaca Calhoun,41.1,117.93,49.9,113.4,281.23,Single-ply,SBD,F
Girls,44.23,2,Amber Flores,Uvalde,43.91,99.79,40.82,111.13,251.74,Single-ply,SBD,F
Girls,44.23,3,Aaliyah Garcia,Crystal City,44.18,102.06,47.63,102.06,251.74,Single-ply,SBD,F
Girls,44.23,4,Stephanie Vega Zapater,San Antonio Southside,43,92.99,40.82,88.45,222.26,Single-ply,SBD,F
Girls,44.23,5,Catalyna Mata,San Antonio Brooks Academy,43.91,92.99,34.02,92.99,219.99,Single-ply,SBD,F
Girls,44.23,6,Jaylin Haughie,Center Point,43,92.99,40.82,83.91,217.72,Single-ply,SBD,F
Girls,44.23,7,Caitlyn Thrasher,Bandera,44.09,79.38,34.02,83.91,197.31,Single-ply,SBD,F
Girls,44.23,8,Vivian Araiza,Seguin,44.09,61.23,29.48,83.91,174.63,Single-ply,SBD,F
Girls,44.23,DQ,Gabby Gonzales,Jourdanton,43.82,88.45,40.82,,,Single-ply,SBD,F
Girls,47.85,1,Present May,Port Lavaca Calhoun,47.81,122.47,52.16,127.01,301.64,Single-ply,SBD,F
Girls,47.85,2,Alexia Mia Dy,San Antonio Cole,46.81,108.86,45.36,124.74,278.96,Single-ply,SBD,F
Girls,47.85,3,Julissa Gonzalez,Kyle Lehman,45,92.99,47.63,108.86,249.48,Single-ply,SBD,F
Girls,47.85,4,Brianna Aguinaga,San Antonio Southside,47.63,97.52,54.43,97.52,249.48,Single-ply,SBD,F
Girls,47.85,5,Caitlin Watson,Bandera,45.81,90.72,43.09,92.99,226.8,Single-ply,SBD,F
Girls,47.85,6,Isanelli Martinez,Crystal City,47.63,90.72,43.09,90.72,224.53,Single-ply,SBD,F
Girls,47.85,7,Rebecca Jaramillo,Elgin,46.36,88.45,38.56,95.25,222.26,Single-ply,SBD,F
Girls,47.85,8,Leah Anderson,Elgin,47.36,72.57,38.56,92.99,204.12,Single-ply,SBD,F
Girls,47.85,9,Alexandra Avalos,San Antonio Southside,47.36,83.91,29.48,88.45,201.85,Single-ply,SBD,F
Girls,47.85,10,Zaylee Zimmerlee,Devine,46.08,74.84,38.56,81.65,195.04,Single-ply,SBD,F
Girls,47.85,11,Alexis Shook,Devine,47.26,56.7,31.75,74.84,163.29,Single-ply,SBD,F
Girls,51.94,1,McKayla Cortez,Port Lavaca Calhoun,49.62,145.15,81.65,142.88,369.68,Single-ply,SBD,F
Girls,51.94,2,Sydney Martinez,Crystal City,51.94,145.15,70.31,151.95,367.41,Single-ply,SBD,F
Girls,51.94,3,Liszette Rasado-Ortiz,San Antonio Brooks Academy,51.26,127.01,92.99,138.35,358.34,Single-ply,SBD,F
Girls,51.94,4,Madison Maldonado,Port Lavaca Calhoun,48.35,122.47,58.97,120.2,301.64,Single-ply,SBD,F
Girls,51.94,5,Jade Ross,Seguin,51.8,104.33,56.7,136.08,297.1,Single-ply,SBD,F
Girls,51.94,6,Brea Eguia,Crystal City,51.89,122.47,58.97,111.13,292.57,Single-ply,SBD,F
Girls,51.94,7,Alivia Fajardo,Kyle Lehman,51.89,92.99,47.63,117.93,258.55,Single-ply,SBD,F
Girls,51.94,8,Adrianna Carlos,Center Point,51.62,92.99,45.36,95.25,233.6,Single-ply,SBD,F
Girls,51.94,9,Journey Shoemake,Devine,51.17,90.72,47.63,86.18,224.53,Single-ply,SBD,F
Girls,51.94,10,Braeven Zepeda,Seguin,50.53,79.38,40.82,97.52,217.72,Single-ply,SBD,F
Girls,51.94,11,Alena Swan,Bandera,48.17,88.45,34.02,92.99,215.46,Single-ply,SBD,F
Girls,51.94,12,Kahlia Rodriguez,San Antonio Memorial,51.17,86.18,36.29,83.91,206.38,Single-ply,SBD,F
Girls,51.94,13,Alix Valenzuela,Uvalde,50.98,79.38,36.29,79.38,195.04,Single-ply,SBD,F
Girls,51.94,14,Ailyn Carrizalez,Uvalde,49.26,68.04,36.29,81.65,185.97,Single-ply,SBD,F
Girls,51.94,DQ,Jackie Flores,San Antonio Southside,51.8,97.52,49.9,,,Single-ply,SBD,F
Girls,56.02,1,Yvette Flores,Crystal City,53.34,165.56,92.99,129.27,387.82,Single-ply,SBD,F
Girls,56.02,2,Danielle Bacon,Port Lavaca Calhoun,52.71,165.56,70.31,145.15,381.02,Single-ply,SBD,F
Girls,56.02,3,Alexis Villalobos,Elgin,53.34,154.22,52.16,156.49,362.87,Single-ply,SBD,F
Girls,56.02,4,Aly Urrabazo,Crystal City,55.79,140.61,77.11,140.61,358.34,Single-ply,SBD,F
Girls,56.02,5,Marissa Olvera,Center Point,55.7,115.67,58.97,124.74,299.37,Single-ply,SBD,F
Girls,56.02,6,Jessandra Gamble,San Antonio Memorial,55.07,127.01,47.63,115.67,290.3,Single-ply,SBD,F
Girls,56.02,7,Amber Saenz,Kyle Lehman,54.52,117.93,56.7,92.99,267.62,Single-ply,SBD,F
Girls,56.02,8,Jahnvi Bhakta,San Antonio Brooks Academy,54.98,99.79,49.9,113.4,263.08,Single-ply,SBD,F
Girls,56.02,9,Celine Samarripa,Devine,54.7,99.79,52.16,108.86,260.82,Single-ply,SBD,F
Girls,56.02,10,Sophia Chavez,Uvalde,53.25,102.06,43.09,113.4,258.55,Single-ply,SBD,F
Girls,56.02,11,Destinie Small,San Antonio Cole,54.16,106.59,49.9,102.06,258.55,Single-ply,SBD,F
Girls,56.02,12,Jackie Garcia,Del Rio,55.97,99.79,49.9,99.79,249.48,Single-ply,SBD,F
Girls,56.02,13,Selena Williams,Del Rio,52.8,95.25,45.36,97.52,238.14,Single-ply,SBD,F
Girls,56.02,14,Ariana Perez,Uvalde,55.16,90.72,36.29,88.45,215.46,Single-ply,SBD,F
Girls,56.02,15,Lisa Fernandez,Center Point,52.16,83.91,38.56,83.91,206.38,Single-ply,SBD,F
Girls,60.1,1,Skyleigh Sears,Port Lavaca Calhoun,56.43,145.15,72.57,154.22,371.95,Single-ply,SBD,F
Girls,60.1,2,Rubylee Perez,Kyle Lehman,60.06,156.49,70.31,138.35,365.14,Single-ply,SBD,F
Girls,60.1,3,Pamela Avila,Crystal City,58.06,145.15,74.84,133.81,353.8,Single-ply,SBD,F
Girls,60.1,4,Kelly Huerta,Carrizo Springs,59.6,138.35,58.97,124.74,322.05,Single-ply,SBD,F
Girls,60.1,5,Joanna Arredondo,Crystal City,59.69,129.27,52.16,131.54,312.98,Single-ply,SBD,F
Girls,60.1,6,Jasmine Montes,Rocksprings,58.24,102.06,38.56,111.13,251.74,Single-ply,SBD,F
Girls,60.1,7,Kimberley Salinas,Bandera,57.88,102.06,45.36,99.79,247.21,Single-ply,SBD,F
Girls,60.1,8,Victoria Smith #2,Kyle Lehman,59.24,95.25,54.43,90.72,240.4,Single-ply,SBD,F
Girls,60.1,9,Demi Douglas,San Antonio Memorial,56.88,74.84,40.82,97.52,213.19,Single-ply,SBD,F
Girls,60.1,10,Jean-Marie Martin,Elgin,59.96,61.23,34.02,90.72,185.97,Single-ply,SBD,F
Girls,67.36,1,Nallely Gutierrez,San Antonio Brooks Academy,65.32,161.03,104.33,165.56,430.91,Single-ply,SBD,F
Girls,67.36,2,Christy Alvarez,Crystal City,65.23,165.56,74.84,163.29,403.7,Single-ply,SBD,F
Girls,67.36,3,Pracilla Ramirez,Crystal City,64.5,167.83,77.11,138.35,383.29,Single-ply,SBD,F
Girls,67.36,4,Alexis Ysla,Kyle Lehman,66.95,161.03,70.31,151.95,383.29,Single-ply,SBD,F
Girls,67.36,5,Hailey Nichols,Port Lavaca Calhoun,64.95,154.22,65.77,158.76,378.75,Single-ply,SBD,F
Girls,67.36,6,Alee Ruiz,Dilley,60.51,149.69,70.31,147.42,367.41,Single-ply,SBD,F
Girls,67.36,7,Lauren Lara,San Antonio Brooks Academy,65.32,131.54,63.5,129.27,324.32,Single-ply,SBD,F
Girls,67.36,8,T'Nia Sample,San Antonio Cole,63.14,129.27,56.7,131.54,317.51,Single-ply,SBD,F
Girls,67.36,9,Kiana Monreal,Devine,65.95,124.74,61.23,131.54,317.51,Single-ply,SBD,F
Girls,67.36,10,Kayla Jimenez,Crystal City,66.68,127.01,56.7,133.81,317.51,Single-ply,SBD,F
Girls,67.36,11,Elidia Gonzales,Center Point,63.59,120.2,61.23,120.2,301.64,Single-ply,SBD,F
Girls,67.36,12,Yassmin Munoz,Center Point,66.32,120.2,61.23,115.67,297.1,Single-ply,SBD,F
Girls,67.36,13,Melanie Delgado,San Antonio Brooks Academy,62.6,115.67,47.63,124.74,288.03,Single-ply,SBD,F
Girls,67.36,14,Lexie Martinez,Uvalde,62.87,104.33,47.63,120.2,272.16,Single-ply,SBD,F
Girls,67.36,15,Samantha Ramos,Poteet,64.86,111.13,45.36,113.4,269.89,Single-ply,SBD,F
Girls,67.36,16,Marina Ramirez,Elgin,66.5,97.52,52.16,115.67,265.35,Single-ply,SBD,F
Girls,67.36,17,Madison Delanghe,Bandera,66.86,106.59,45.36,104.33,256.28,Single-ply,SBD,F
Girls,67.36,18,Claudia Palomarez,Kyle Lehman,60.51,90.72,45.36,111.13,247.21,Single-ply,SBD,F
Girls,67.36,19,Aly Baker,Seguin,60.33,70.31,45.36,111.13,226.8,Single-ply,SBD,F
Girls,67.36,20,Lexi Ramierez,Dilley,65.41,88.45,43.09,90.72,222.26,Single-ply,SBD,F
Girls,67.36,DQ,Caitlin Casas,Devine,67.04,102.06,,,,Single-ply,SBD,F
Girls,67.36,DQ,Esme Morales,Elgin,60.42,113.4,,,,Single-ply,SBD,F
Girls,75.07,1,Kiana Lopez,Crystal City,75.02,195.04,83.91,161.03,439.98,Single-ply,SBD,F
Girls,75.07,2,Erica Garcia,Port Lavaca Calhoun,67.95,163.29,65.77,154.22,383.29,Single-ply,SBD,F
Girls,75.07,3,Loren Chavez,San Antonio Brooks Academy,74.39,154.22,90.72,133.81,378.75,Single-ply,SBD,F
Girls,75.07,4,Kianna Lara,Crystal City,69.22,165.56,83.91,127.01,376.48,Single-ply,SBD,F
Girls,75.07,5,Rheagan Schmidt,Seguin,67.86,136.08,70.31,161.03,367.41,Single-ply,SBD,F
Girls,75.07,6,Molly Fuller,Devine,74.57,145.15,74.84,140.61,360.61,Single-ply,SBD,F
Girls,75.07,7,Rakel Aguero,Jourdanton,70.13,149.69,68.04,138.35,356.07,Single-ply,SBD,F
Girls,75.07,8,Jaylin Kindles,Seguin,70.4,142.88,61.23,149.69,353.8,Single-ply,SBD,F
Girls,75.07,9,Mia Palomarez,Kyle Lehman,71.12,136.08,63.5,140.61,340.19,Single-ply,SBD,F
Girls,75.07,10,Adrianna Landry,San Antonio Brooks Academy,69.67,133.81,68.04,131.54,333.39,Single-ply,SBD,F
Girls,75.07,11,Chloe Rincon,Seguin,68.67,117.93,54.43,138.35,310.71,Single-ply,SBD,F
Girls,75.07,12,Arianna Reyes,Seguin,67.86,120.2,52.16,124.74,297.1,Single-ply,SBD,F
Girls,75.07,13,Nadia Gonzales,Uvalde,69.67,120.2,52.16,117.93,290.3,Single-ply,SBD,F
Girls,75.07,14,Alana Gallegos,Jourdanton,71.3,120.2,56.7,106.59,283.5,Single-ply,SBD,F
Girls,75.07,15,Maddy Bowen,Kyle Lehman,68.76,108.86,54.43,108.86,272.16,Single-ply,SBD,F
Girls,75.07,16,Brianna Coronado,Jourdanton,70.85,102.06,54.43,108.86,265.35,Single-ply,SBD,F
Girls,75.07,17,Alyssa Brandt,Elgin,67.59,104.33,40.82,111.13,256.28,Single-ply,SBD,F
Girls,75.07,18,Andrea Ruiz,Rocksprings,69.31,102.06,38.56,111.13,251.74,Single-ply,SBD,F
Girls,75.07,19,Maya Erwin,Kyle Lehman,69.76,99.79,54.43,92.99,247.21,Single-ply,SBD,F
Girls,75.07,20,Lisa Vigil,San Antonio Memorial,74.84,88.45,45.36,92.99,226.8,Single-ply,SBD,F
Girls,75.07,21,Janie Martinez,Uvalde,73.21,70.31,36.29,95.25,201.85,Single-ply,SBD,F
Girls,75.07,DQ,Tierra Green,Seguin,68.95,88.45,45.36,108.86,,Single-ply,SBD,F
Girls,75.07,DQ,Cassidy Arriaga,Seguin,72.57,102.06,47.63,102.06,,Single-ply,SBD,F
Girls,75.07,DQ,Lacey Glossson,Elgin,68.76,111.13,,,,Single-ply,SBD,F
Girls,82.33,1,Amanda Rivera,Poteet,78.29,163.29,63.5,145.15,371.95,Single-ply,SBD,F
Girls,82.33,2,Cierra Lopez,Jourdanton,78.02,151.95,72.57,142.88,367.41,Single-ply,SBD,F
Girls,82.33,3,Natalia Ortiz,San Antonio Brooks Academy,78.38,149.69,70.31,138.35,358.34,Single-ply,SBD,F
Girls,82.33,4,Ivy Rodriguez,Bandera,78.2,136.08,58.97,117.93,312.98,Single-ply,SBD,F
Girls,82.33,5,Rebecca Fowler,Devine,79.29,129.27,74.84,104.33,308.44,Single-ply,SBD,F
Girls,82.33,6,Mackenzie Tozer,Center Point,78.29,127.01,56.7,122.47,306.17,Single-ply,SBD,F
Girls,82.33,7,Angel Castillo,Elgin,76.29,113.4,54.43,122.47,290.3,Single-ply,SBD,F
Girls,82.33,8,Cheyenne Leal,Jourdanton,81.19,120.2,49.9,117.93,288.03,Single-ply,SBD,F
Girls,82.33,9,Rosa Lara,San Antonio Southside,80.2,113.4,47.63,113.4,274.42,Single-ply,SBD,F
Girls,82.33,DQ,Abigail Escalante,Jourdanton,76.02,120.2,,,,Single-ply,SBD,F
Girls,82.33,DQ,Piper Bush,Center Point,82.1,,,,,Single-ply,SBD,F
Girls,82.33,DQ,Shanice Ross,Elgin,80.01,158.76,,,,Single-ply,SBD,F
Girls,90.04,1,Sara Ramos,Uvalde,88.9,174.63,63.5,170.1,408.23,Single-ply,SBD,F
Girls,90.04,2,Paige Cote,Devine,88.27,167.83,95.25,142.88,405.97,Single-ply,SBD,F
Girls,90.04,3,Victoria Trevino,San Antonio Southside,82.55,170.1,79.38,154.22,403.7,Single-ply,SBD,F
Girls,90.04,4,Destiny Sepulveda,Crystal City,89.36,149.69,88.45,136.08,374.21,Single-ply,SBD,F
Girls,90.04,5,Maddy Cruz,Kyle Lehman,83.73,147.42,65.77,127.01,340.19,Single-ply,SBD,F
Girls,90.04,6,Serena Monreal,Devine,87.54,127.01,54.43,120.2,301.64,Single-ply,SBD,F
Girls,90.04,7,Yareli Tavera,Elgin,89.36,129.27,45.36,127.01,301.64,Single-ply,SBD,F
Girls,90.04,8,Jocelyn Bustamante,Uvalde,85,131.54,52.16,111.13,294.84,Single-ply,SBD,F
Girls,90.04,9,Kelsay Underwood,Seguin,85,104.33,49.9,115.67,269.89,Single-ply,SBD,F
Girls,90.04,10,Emilee Delarosa,Seguin,82.92,108.86,52.16,106.59,267.62,Single-ply,SBD,F
Girls,90.04,11,Aurora Medrano,San Antonio Memorial,82.46,90.72,38.56,95.25,224.53,Single-ply,SBD,F
Girls,90.04,DQ,DeAnna Wood,San Antonio Brooks Academy,88.81,102.06,,,,Single-ply,SBD,F
Girls,100.02,1,Fatima Herrera,San Antonio Southside,93.35,167.83,90.72,151.95,410.5,Single-ply,SBD,F
Girls,100.02,2,Evelyn Ramirez,Kyle Lehman,96.07,174.63,86.18,140.61,401.43,Single-ply,SBD,F
Girls,100.02,3,Ilse Guerrero,Jourdanton,97.7,170.1,77.11,142.88,390.09,Single-ply,SBD,F
Girls,100.02,4,Esmeralda Hernandez,Jourdanton,90.99,158.76,74.84,129.27,362.87,Single-ply,SBD,F
Girls,100.02,5,Halie Guajardo,Port Lavaca Calhoun,94.98,165.56,65.77,131.54,362.87,Single-ply,SBD,F
Girls,100.02,6,Liliana Martinez,Carrizo Springs,96.16,136.08,72.57,133.81,342.46,Single-ply,SBD,F
Girls,100.02,7,Ashley Sharp,Elgin,97.7,142.88,54.43,136.08,333.39,Single-ply,SBD,F
Girls,100.02,8,Grace Adams,Elgin,93.71,151.95,61.23,117.93,331.12,Single-ply,SBD,F
Girls,100.02,9,Jayce Holmes,Seguin,90.99,124.74,68.04,97.52,290.3,Single-ply,SBD,F
Girls,100.02,10,Melissa Medellin,San Antonio Cole,91.9,102.06,47.63,108.86,258.55,Single-ply,SBD,F
Girls,100.02,11,Felicitas Diaz,Devine,92.71,113.4,49.9,88.45,251.74,Single-ply,SBD,F
Girls,100.02,12,Kandie Medina,Uvalde,95.62,79.38,40.82,81.65,201.85,Single-ply,SBD,F
Girls,100.02,DQ,Jenna Brady,San Antonio Memorial,95.62,108.86,38.56,,,Single-ply,SBD,F
Girls,117.71,1,Samantha Heimer,San Antonio Brooks Academy,102.87,183.7,131.54,147.42,462.66,Single-ply,SBD,F
Girls,117.71,2,Bethanie Rodriguez,Crystal City,100.15,158.76,86.18,142.88,387.82,Single-ply,SBD,F
Girls,117.71,3,Nikki Rangel,Rocksprings,100.52,161.03,52.16,147.42,360.61,Single-ply,SBD,F
Girls,117.71,4,Trisha Rose,San Antonio Cole,102.51,117.93,49.9,97.52,265.35,Single-ply,SBD,F
Girls,117.71+,1,Daisy Tellez,Crystal City,177.81,208.65,117.93,170.1,496.68,Single-ply,SBD,F
Girls,117.71+,2,Kerrington Holiday,Elgin,127.19,151.95,56.7,154.22,362.87,Single-ply,SBD,F
Girls,117.71+,3,Sophia Arredondo,San Antonio Brooks Academy,126.1,90.72,56.7,117.93,265.35,Single-ply,SBD,F
Girls,117.71+,4,Krystal Tellez,Crystal City,140.89,95.25,47.63,108.86,251.74,Single-ply,SBD,F
Girls,117.71+,DQ,Mia Dolin,Kyle Lehman,120.47,181.44,,,,Single-ply,SBD,F
Girls,,NS,Bailey Luckman,Jourdanton,,,,,,Single-ply,SBD,F
Girls,,NS,Jessie Puckett,Jourdanton,,,,,,Single-ply,SBD,F
Girls,,NS,Marissa Martinez,Poteet,,,,,,Single-ply,SBD,F
Girls,,NS,Alondra Morales,San Antonio Memorial,,,,,,Single-ply,SBD,F
Girls,,NS,Kassandra Luna,San Antonio Memorial,,,,,,Single-ply,SBD,F
Girls,,NS,Jessenia Moreno,Del Rio,,,,,,Single-ply,SBD,F
Girls,,NS,Lexie Reyes,Carrizo Springs,,,,,,Single-ply,SBD,F
Girls,,NS,Xeauna Rodriguez,Bandera,,,,,,Single-ply,SBD,F
Girls,,NS,Elizabeth Alejandro,Carrizo Springs,,,,,,Single-ply,SBD,F
Girls,,NS,Karina Garay,Carrizo Springs,,,,,,Single-ply,SBD,F
Girls,,NS,Aleya Barnett,San Antonio Cole,,,,,,Single-ply,SBD,F
Girls,,NS,Josephine Silva,Port Lavaca Calhoun,,,,,,Single-ply,SBD,F
Girls,,NS,Hannah Spencer,Port Lavaca Calhoun,,,,,,Single-ply,SBD,F
Girls,,NS,Genesis Villarreal,Port Lavaca Calhoun,,,,,,Single-ply,SBD,F
Girls,,NS,Avery Contreras,Uvalde,,,,,,Single-ply,SBD,F
Girls,,NS,Morgan Schmidt,Seguin,,,,,,Single-ply,SBD,F
Girls,,NS,Whitney Wendel,Seguin,,,,,,Single-ply,SBD,F
Girls,,NS,Maykayla Barboza,Uvalde,,,,,,Single-ply,SBD,F
Junior Varsity,51.94,1,Celeste Correa,Carrizo Springs,48.63,88.45,36.29,104.33,229.06,Single-ply,SBD,F
Junior Varsity,51.94,2,Tiffany Benavides,Carrizo Springs,50.8,72.57,31.75,99.79,204.12,Single-ply,SBD,F
Junior Varsity,56.02,1,Gaby Moncada,Crystal City,52.89,102.06,52.16,108.86,263.08,Single-ply,SBD,F
Junior Varsity,56.02,2,Penelope Cruz,Devine,54.88,72.57,38.56,86.18,197.31,Single-ply,SBD,F
Junior Varsity,60.1,1,Jennifer Montellano,Crystal City,60.06,113.4,52.16,106.59,272.16,Single-ply,SBD,F
Junior Varsity,60.1,2,Rosalinda Martinez,Crystal City,58.69,99.79,54.43,97.52,251.74,Single-ply,SBD,F
Junior Varsity,60.1,3,Emily Perez,Somerset,57.61,83.91,43.09,92.99,219.99,Single-ply,SBD,F
Junior Varsity,60.1,4,Eloisa Garza,Somerset,59.87,61.23,29.48,72.57,163.29,Single-ply,SBD,F
Junior Varsity,60.1,DQ,Arica Duran,Somerset,59.87,,,,,Single-ply,SBD,F
Junior Varsity,67.36,1,Daniela Villegas,Elgin,67.31,106.59,43.09,104.33,254.01,Single-ply,SBD,F
Junior Varsity,67.36,2,Destiny Contreras,Devine,64.68,102.06,36.29,90.72,229.06,Single-ply,SBD,F
Junior Varsity,67.36,3,Allie Elkins,Bandera,66.68,88.45,45.36,95.25,229.06,Single-ply,SBD,F
Junior Varsity,67.36,4,Angelique Rodriguez,Kyle Lehman,62.96,92.99,43.09,79.38,215.46,Single-ply,SBD,F
Junior Varsity,67.36,5,Rayna Webb,Kyle Lehman,65.77,77.11,49.9,86.18,213.19,Single-ply,SBD,F
Junior Varsity,67.36,DQ,Ashley Vinton,Somerset,67.13,,,,,Single-ply,SBD,F
Junior Varsity,75.07,1,Victoria Villarreal,Somerset,74.84,142.88,68.04,142.88,353.8,Single-ply,SBD,F
Junior Varsity,75.07,2,Madysen Devoria,Somerset,73.94,140.61,68.04,117.93,326.59,Single-ply,SBD,F
Junior Varsity,75.07,3,Haylee Lasiter,Crystal City,72.39,120.2,52.16,129.27,301.64,Single-ply,SBD,F
Junior Varsity,75.07,4,Mia Ybarra,Kyle Lehman,67.68,104.33,56.7,104.33,265.35,Single-ply,SBD,F
Junior Varsity,75.07,5,Kristen Lira,Carrizo Springs,74.21,104.33,52.16,104.33,260.82,Single-ply,SBD,F
Junior Varsity,75.07,6,Cara Garcia,Kyle Lehman,74.48,97.52,38.56,92.99,229.06,Single-ply,SBD,F
Junior Varsity,75.07,7,Marla Torres,Devine,67.77,83.91,36.29,77.11,197.31,Single-ply,SBD,F
Junior Varsity,75.07,8,Natalie Aguilar,Kyle Lehman,68.86,77.11,24.95,68.04,170.1,Single-ply,SBD,F
Junior Varsity,75.07,DQ,Catlyn Gutierrez,Somerset,74.84,,,,,Single-ply,SBD,F
Junior Varsity,82.33,1,Illea Lugo,Somerset,77.11,149.69,77.11,127.01,353.8,Single-ply,SBD,F
Junior Varsity,82.33,2,Jazlynn Lewis,Bandera,81.56,104.33,61.23,111.13,276.69,Single-ply,SBD,F
Junior Varsity,82.33,DQ,Rebecca Stevens,Somerset,82.1,,,,,Single-ply,SBD,F
Junior Varsity,82.33,DQ,Alexis Azzoz,Somerset,82.1,,,,,Single-ply,SBD,F
Junior Varsity,90.04,1,Juanita Torres,Carrizo Springs,88,140.61,47.63,108.86,297.1,Single-ply,SBD,F
Junior Varsity,90.04,2,Vivian Covarrubias,Kyle Lehman,86.82,108.86,54.43,99.79,263.08,Single-ply,SBD,F
Junior Varsity,,NS,Jogeania Wilford,Elgin,,,,,,Single-ply,SBD,F
Junior Varsity,,NS,Ailyn Chong,Carrizo Springs,,,,,,Single-ply,SBD,F
Junior Varsity,,NS,Larissa Gonzalez,Carrizo Springs,,,,,,Single-ply,SBD,F
Freshmen,44.23,1,Divina Garcia,Somerset,42.64,65.77,29.48,58.97,154.22,Single-ply,SBD,F
Freshmen,51.94,1,Belle Hoover,Bandera,51.8,54.43,22.68,45.36,122.47,Single-ply,SBD,F
Freshmen,56.02,1,Kayla Perez,Devine,55.79,92.99,40.82,79.38,213.19,Single-ply,SBD,F
Freshmen,56.02,2,Crystal Ambriz,Somerset,54.88,70.31,36.29,74.84,181.44,Single-ply,SBD,F
Freshmen,60.1,1,Clarissa Ybanez,Devine,57.06,77.11,38.56,79.38,195.04,Single-ply,SBD,F
Freshmen,60.1,2,Miranda Franklin,Somerset,58.97,56.7,36.29,74.84,167.83,Single-ply,SBD,F
Freshmen,60.1,DQ,Michelle Salazar,Somerset,59.87,,,,,Single-ply,SBD,F
Freshmen,67.36,1,Destiny Blake,Somerset,65.77,58.97,43.09,79.38,181.44,Single-ply,SBD,F
Freshmen,67.36,DQ,Gabby Flores,Somerset,67.13,,,,,Single-ply,SBD,F
Freshmen,67.36,DQ,America Garcia,Somerset,67.13,,,,,Single-ply,SBD,F
Freshmen,75.07,1,Carolina Rico,Somerset,72.57,81.65,40.82,90.72,213.19,Single-ply,SBD,F
Freshmen,75.07,DQ,Ayla Dominguez,Somerset,74.84,,,,,Single-ply,SBD,F
Freshmen,,NS,Madelyn Jackson,Bandera,,,,,,Single-ply,SBD,F
Freshmen,,NS,Ofelia Macias,Bandera,,,,,,Single-ply,SBD,F
