Division,WeightClassKg,Place,Name,Team,BodyweightKg,Best3SquatKg,Best3BenchKg,Best3DeadliftKg,TotalKg,Equipment,Event,Sex,BirthDate
Boys,51.71,1,Hisaac Guerrero,Rio Hondo,50.89,138.35,106.59,158.76,403.7,Single-ply,SBD,M,
Boys,51.71,DQ,Christian Galvan,Rio Hondo,50.35,111.13,,,,Single-ply,SBD,M,
Boys,59.87,1,Joel Tagle,Rio Hondo,58.6,127.01,77.11,131.54,335.66,Single-ply,SBD,M,
Boys,67.13,1,Fransico Hernandez,Rio Hondo,66.68,165.56,124.74,181.44,471.74,Single-ply,SBD,M,
Boys,67.13,2,Tomas Arredondo,Rio Hondo,64.05,167.83,120.2,176.9,464.93,Single-ply,SBD,M,
Boys,82.1,1,Travis Menchaca,La Feria,80.92,195.04,111.13,204.12,510.29,Single-ply,SBD,M,
Boys,82.1,2,Evan Sanchez,La Feria,81.47,206.38,106.59,172.37,485.34,Single-ply,SBD,M,
Boys,89.81,1,Juan Torres,Raymondville,84.46,247.21,142.88,265.35,655.44,Single-ply,SBD,M,
Boys,89.81,2,Caleb Martinez,La Feria,86.91,192.78,117.93,167.83,478.54,Single-ply,SBD,M,
Boys,99.79,1,Orlando Morales,La Feria,97.07,265.35,138.35,233.6,637.3,Single-ply,SBD,M,
Boys,99.79,2,Rogelio Garza,Rio Hondo,97.07,210.92,127.01,231.33,569.26,Single-ply,SBD,M,
Boys,124.74,1,Matthew Lopez #1,Rio Hondo,123.29,283.5,183.7,249.48,716.68,Single-ply,SBD,M,
Boys,124.74,2,Antonio Marroquin,La Feria,110.5,272.16,156.49,238.14,666.78,Single-ply,SBD,M,
Boys,124.74,3,Adrian Gonzalez,Rio Hondo,119.84,272.16,156.49,204.12,632.76,Single-ply,SBD,M,
Boys,139.71,1,David Gomez,Rio Hondo,128.46,215.46,158.76,167.83,542.04,Single-ply,SBD,M,
Boys,139.71+,1,Jaden Brooks,Raymondville,185.16,226.8,165.56,247.21,639.57,Single-ply,SBD,M,
Boys,139.71+,2,Triston Garza,La Feria,149.96,272.16,161.03,195.04,628.23,Single-ply,SBD,M,
Boys,139.71+,3,Miguel Chavarria,Rio Hondo,145.24,210.92,124.74,188.24,523.9,Single-ply,SBD,M,
Boys,139.71+,4,Lando Cantu,Raymondville,141.88,206.38,111.13,183.7,501.22,Single-ply,SBD,M,
