Division,WeightClassKg,Place,Name,Team,BodyweightKg,Best3SquatKg,Best3BenchKg,Best3DeadliftKg,TotalKg,Equipment,Event,Sex
Boys,51.71,1,Rudy Becerra,Boling,50.08,95.25,58.97,104.33,258.55,Single-ply,SBD,M
Boys,51.71,2,Andrew Dirba,East Bernard,51.71,83.91,49.9,102.06,235.87,Single-ply,SBD,M
Boys,51.71,3,Garrett Gilmore,La Grange,45.45,79.38,45.36,90.72,215.46,Single-ply,SBD,M
Boys,51.71,DQ,Trey Stephens,East Bernard,49.35,,,,,Single-ply,SBD,M
Boys,55.79,1,Kevin Manning,Boling,53.43,136.08,77.11,138.35,351.53,Single-ply,SBD,M
Boys,55.79,2,Austin Draper,East Bernard,55.52,124.74,61.23,127.01,312.98,Single-ply,SBD,M
Boys,55.79,3,Clay Wittneben,Needville,54.98,81.65,54.43,120.2,256.28,Single-ply,SBD,M
Boys,59.87,1,Kameron Matthews,East Bernard,57.33,120.2,63.5,133.81,317.51,Single-ply,SBD,M
Boys,59.87,2,Jastin Arbing,Boling,58.51,117.93,72.57,127.01,317.51,Single-ply,SBD,M
Boys,59.87,DQ,Fransisco Salas,Needville,59.51,115.67,,,,Single-ply,SBD,M
Boys,67.13,1,Collin Kovarcik,Needville,64.68,197.31,122.47,192.78,512.56,Single-ply,SBD,M
Boys,67.13,2,Jacob Rhodes,Needville,66.68,158.76,92.99,192.78,444.52,Single-ply,SBD,M
Boys,67.13,3,Carlos Olmedo,Boling,63.23,142.88,70.31,122.47,335.66,Single-ply,SBD,M
Boys,67.13,4,Blaise Hubenak,Boling,66.68,124.74,74.84,122.47,322.05,Single-ply,SBD,M
Boys,67.13,5,Niklas Schatz,East Bernard,65.41,120.2,61.23,113.4,294.84,Single-ply,SBD,M
Boys,74.84,1,Jacob Vacek,Needville,68.13,188.24,106.59,165.56,460.4,Single-ply,SBD,M
Boys,74.84,2,Keaton McDonald,East Bernard,72.39,136.08,90.72,181.44,408.23,Single-ply,SBD,M
Boys,74.84,3,Kyler Teykl,Needville,71.3,158.76,99.79,145.15,403.7,Single-ply,SBD,M
Boys,74.84,4,Brock Gardiner,La Grange,69.04,102.06,70.31,124.74,297.1,Single-ply,SBD,M
Boys,74.84,5,Caleb Burton,La Grange,67.31,102.06,65.77,99.79,267.62,Single-ply,SBD,M
Boys,82.1,1,Hunter Goudeau,East Bernard,80.1,183.7,97.52,226.8,508.02,Single-ply,SBD,M
Boys,82.1,2,Ashton Stredick,Needville,76.93,165.56,95.25,170.1,430.91,Single-ply,SBD,M
Boys,82.1,3,Jericho Haardt,La Grange,80.83,147.42,115.67,163.29,426.38,Single-ply,SBD,M
Boys,82.1,4,Deviro Yanis,La Grange,76.2,154.22,83.91,151.95,390.09,Single-ply,SBD,M
Boys,82.1,5,Johnny Martinez,Boling,76.02,136.08,86.18,138.35,360.61,Single-ply,SBD,M
Boys,89.81,1,Quade Miller,Needville,86.64,206.38,140.61,210.92,557.92,Single-ply,SBD,M
Boys,89.81,2,Kole Matula,Needville,86.09,172.37,117.93,174.63,464.93,Single-ply,SBD,M
Boys,89.81,3,Walker Kalinowski,Needville,87.91,165.56,106.59,158.76,430.91,Single-ply,SBD,M
Boys,89.81,DQ,Grant Prazak,East Bernard,88,113.4,,,,Single-ply,SBD,M
Boys,89.81,DQ,Ronald Hargrove,Needville,85.64,,,,,Single-ply,SBD,M
Boys,99.79,1,Adam Altrech,Needville,96.25,249.48,142.88,219.99,612.35,Single-ply,SBD,M
Boys,99.79,2,Jose Haro,Boling,95.44,179.17,124.74,219.99,523.9,Single-ply,SBD,M
Boys,99.79,3,Ryan Hlavinka,East Bernard,99.52,197.31,108.86,181.44,487.61,Single-ply,SBD,M
Boys,99.79,DQ,Xavier Lott,Needville,98.61,174.63,,,,Single-ply,SBD,M
Boys,109.77,1,Manuel Delgado,Boling,104.69,167.83,102.06,140.61,410.5,Single-ply,SBD,M
Boys,109.77,2,Mark Arbuckle,La Grange,107.59,136.08,83.91,142.88,362.87,Single-ply,SBD,M
Boys,109.77,3,Trent Reyes,Boling,103.87,127.01,79.38,111.13,317.51,Single-ply,SBD,M
Boys,109.77,DQ,Destin Shuler,East Bernard,103.78,226.8,,,,Single-ply,SBD,M
Boys,124.74,1,Josh Cervantez,La Grange,115.39,226.8,111.13,192.78,530.7,Single-ply,SBD,M
Boys,124.74,2,Chris Hein,Needville,111.13,174.63,108.86,181.44,464.93,Single-ply,SBD,M
Boys,124.74,3,Ricardo Marquez,Needville,110.95,181.44,111.13,167.83,460.4,Single-ply,SBD,M
Boys,124.74+,1,Jayden Evans,Needville,142.61,165.56,124.74,158.76,449.06,Single-ply,SBD,M
Boys,124.74+,DQ,JR Shauer,East Bernard,134.08,,,,,Single-ply,SBD,M
