Name,Age,Sex,State,BodyweightKg,Division,WeightClassKg,Squat1Kg,Squat2Kg,Squat3Kg,Best3SquatKg,Squat4Kg,Bench1Kg,Bench2Kg,Bench3Kg,Best3BenchKg,Bench4Kg,Deadlift1Kg,Deadlift2Kg,Deadlift3Kg,Best3DeadliftKg,Deadlift4Kg,TotalKg,Event,Equipment,Place
Ashley Christiansen,19,F,NC,42.77,Open,44,30,32.5,-35,32.5,,37.5,-42.5,-42.5,37.5,,77.5,-80,-80,77.5,,147.5,SBD,Raw,1
Ella Tiller,10,F,NC,42.68,Youth,44,-42.5,-42.5,42.5,42.5,,17.5,-25,-25,17.5,,55,62.5,65,65,,125,SBD,Raw,1
Brooke Zak,12,F,NC,42.59,Teen 12-13,44,37.5,45,50,50,,25,27.5,-30,27.5,,60,72.5,77.5,77.5,,155,SBD,Raw,1
Ashley Christiansen,19,F,NC,42.77,Teen 18-19,44,30,32.5,-35,32.5,,37.5,-42.5,-42.5,37.5,,77.5,-80,-80,77.5,,147.5,SBD,Raw,1
Kaitlyn Davis,26,F,NE,46.08,Open,48,92.5,,,92.5,,,52.5,55,55,,125,,,125,,272.5,SBD,Raw,1
Mackenzie Taylor,11,F,NC,45.99,Youth,48,35,47.5,52.5,52.5,-75,20,25,30,30,,55,65,-75,65,,147.5,SBD,Raw,1
Rocky Luedeker,,F,AZ,44.63,Masters 60-64,48,35,37.5,42.5,42.5,48.5,35,37.5,40.5,40.5,-42.5,62.5,70,77.5,77.5,80.5,160,SBD,Raw,1
Keri Davis,27,F,VA,49.94,Open,52,,,87.5,87.5,,,,50,50,,,,135,135,,272.5,SBD,Raw,1
Caitlin Ruegg,28,F,PA,48.17,Open,52,85,92.5,95,95,,47.5,55,-60,55,,90,102.5,107.5,107.5,,257.5,SBD,Raw,2
Jennifer Waldron,45,F,KY,50.48,Open,52,70,75,80,80,,42.5,47.5,,47.5,,,,117.5,117.5,,245,SBD,Raw,3
Kim Roberts,48,F,FL,51.39,Open,52,-77.5,77.5,-85,77.5,,47.5,50,52.5,52.5,,100,110,,110,,240,SBD,Raw,4
Jennifer Waldron,45,F,KY,50.48,Masters 45-49,52,70,75,80,80,,42.5,47.5,,47.5,,,,117.5,117.5,,245,SBD,Raw,1
Kim Roberts,48,F,FL,51.39,Masters 45-49,52,-77.5,77.5,-85,77.5,,47.5,50,52.5,52.5,,100,110,,110,,240,SBD,Raw,2
Trish Kirkland,64,F,FL,50.67,Masters 60-64,52,42.5,52.5,-60,52.5,,32.5,37.5,-40,37.5,,57.5,62.5,72.5,72.5,,162.5,SBD,Raw,1
Natasha Beasley,35,F,VA,55.38,Open,56,,,100,100,,,,80.5,80.5,,,,165,165,,345,SBD,Raw,1
Bianca Luedeker,34,F,AZ,52.84,Open,56,90,95,97.5,97.5,,65,67.5,-70,67.5,,112.5,120,130,130,,295,SBD,Raw,2
Leah Newton,29,F,KY,54.52,Open,56,82.5,85,90,90,,45,,,45,,95,100,107.5,107.5,,242.5,SBD,Raw,3
Anna Zak,15,F,NC,54.07,Open,56,40,47.5,52.5,52.5,,27,29.5,32.5,32.5,,65,85,92.5,92.5,,177.5,SBD,Raw,4
Anna Zak,15,F,NC,54.07,Teen 14-15,56,40,47.5,52.5,52.5,,27,29.5,32.5,32.5,,65,85,92.5,92.5,,177.5,SBD,Raw,1
Natasha Beasley,35,F,VA,55.38,Submasters 35-39,56,,,100,100,,,,80.5,80.5,,,,165,165,,345,SBD,Raw,1
Paula Jager,58,F,FL,54.16,Masters 55-59,56,60,70,77.5,77.5,,42.5,50,55,55,,92.5,102.5,-112.5,102.5,,235,SBD,Raw,1
Cindy Weindorf,31,F,PA,56.7,Open,60,60,67.5,70,70,,40,42.5,45,45,,95,105,110,110,,225,SBD,Raw,1
Payton Grande,20,F,MA,59.87,Juniors 20-24,60,72.5,82.5,-92.5,82.5,,45,50,52.5,52.5,,117,127.5,137.5,137.5,,272.5,SBD,Raw,1
Kimberly Capers,39,F,MD,59.96,Submasters 35-39,60,82.5,88.5,92.5,92.5,,57.5,60,62.5,62.5,,125,-132.5,-132.5,125,,280,SBD,Raw,1
Naomi Kutin,16,F,NJ,65.41,Open,67.5,127.5,137.5,-145.5,137.5,,55,60,-62.5,60,,150,160,-170,160,,357.5,SBD,Raw,1
Tricia Floyd,37,F,VA,64.73,Open,67.5,,,110,110,,,,52.5,52.5,,,,190,190,,352.5,SBD,Raw,2
Lori Bailey,47,F,NC,66.68,Open,67.5,85,87.5,112.5,112.5,,62.5,67.5,-70,67.5,,125,137.5,147.5,147.5,,327.5,SBD,Raw,3
LaKeisha Kanen,43,F,NC,63.96,Open,67.5,-107.5,107.5,110,110,,57.5,62.5,65,65,,120,137.5,142.5,142.5,,317.5,SBD,Raw,4
Lesley DeAngelo,49,F,CT,64.41,Open,67.5,82.5,87.5,92.5,92.5,,45,-50,-50,45,,90,102.5,110,110,,247.5,SBD,Raw,5
Kaja Ferebee,17,F,NC,67.09,Open,67.5,82.5,87.5,92.5,92.5,,40,45,-50,45,,102.5,110,-127.5,110,,247.5,SBD,Raw,6
Emily Bourque,27,F,MA,65.09,Open,67.5,75,82.5,85,85,,42.5,47.5,50,50,,92.5,102.5,110,110,,245,SBD,Raw,7
Corinne Deem,15,F,NC,61.37,Open,67.5,47.5,52.5,60,60,,44,-46.5,-46.5,44,,90,100,105,105,,209,SBD,Raw,8
Corinne Deem,15,F,NC,61.37,Teen 14-15,67.5,47.5,52.5,60,60,,44,-46.5,-46.5,44,,90,100,105,105,,209,SBD,Raw,1
Naomi Kutin,16,F,NJ,65.41,Teen 16-17,67.5,127.5,137.5,-145.5,137.5,,55,60,-62.5,60,,150,160,-170,160,,357.5,SBD,Raw,1
Kaja Ferebee,17,F,NC,67.09,Teen 16-17,67.5,82.5,87.5,92.5,92.5,,40,45,-50,45,,102.5,110,-127.5,110,,247.5,SBD,Raw,2
Hannah Haskell,18,F,NY,66.18,Teen 18-19,67.5,70,80,82.5,82.5,,45,50,-55,50,,110,120,137.5,137.5,,270,SBD,Raw,1
Angela Kalogeias,,F,AZ,62.46,Juniors 20-24,67.5,110,117.5,-127.5,117.5,,62.5,65,-70,65,,112.5,120,127.5,127.5,,310,SBD,Raw,1
Tricia Floyd,37,F,VA,64.73,Submasters 35-39,67.5,,,110,110,,,,52.5,52.5,,,,190,190,,352.5,SBD,Raw,1
LaKeisha Kanen,43,F,NC,63.96,Masters 40-44,67.5,-107.5,107.5,110,110,,57.5,62.5,65,65,,120,137.5,142.5,142.5,,317.5,SBD,Raw,1
Mellisa Palmer,,F,AZ,65.14,Masters 40-44,67.5,65,70,75,75,,47.5,50,-52.5,50,,90,95,100,100,,225,SBD,Raw,2
Lori Bailey,47,F,NC,66.68,Masters 45-49,67.5,85,87.5,112.5,112.5,,62.5,67.5,-70,67.5,,125,137.5,147.5,147.5,,327.5,SBD,Raw,1
Marina Bosuk,,F,AZ,64.09,Masters 45-49,67.5,82.5,90,92.5,92.5,95,52.5,55,57.5,57.5,,102.5,107.5,110,110,,260,SBD,Raw,2
Lesley DeAngelo,49,F,CT,64.41,Masters 45-49,67.5,82.5,87.5,92.5,92.5,,45,-50,-50,45,,90,102.5,110,110,,247.5,SBD,Raw,3
Sherry Pridgen,52,F,NC,64.95,Masters 50-54,67.5,-60,60,72.5,72.5,,47.5,55,57.5,57.5,,105,112.5,117.5,117.5,,247.5,SBD,Raw,1
Jane Bickel,57,F,PA,64.09,Masters 55-59,67.5,52.5,57.5,65,65,,40,45,-47.5,45,,95,110,-127.5,110,,220,SBD,Raw,1
Debra Cohen,61,F,NJ,65.36,Masters 60-64,67.5,75,82.5,87.5,87.5,,57.5,60,-62.5,60,,120,-127.5,127.5,127.5,,275,SBD,Raw,1
Angela Kalogeias,,F,AZ,62.46,Classic Open,67.5,110,117.5,-127.5,117.5,,62.5,65,-70,65,,112.5,120,127.5,127.5,,310,SBD,Raw,1
Debra Cohen,61,F,NJ,65.36,Classic Open,67.5,75,82.5,87.5,87.5,,57.5,60,-62.5,60,,120,-127.5,127.5,127.5,,275,SBD,Raw,2
Maria Rojas,28,F,VA,69.31,Open,75,,,130,130,,,,75,75,,,,147.5,147.5,,352.5,SBD,Raw,1
Kayla Meisner,24,F,KY,73.3,Open,75,115,125,130,130,,72.5,,,72.5,,135,147.5,,147.5,,350,SBD,Raw,2
Jennifer Tillett,50,F,NC,71.67,Open,75,72.5,75,77.5,77.5,,55,57.5,-60,57.5,,-130,130,-132.5,130,,265,SBD,Raw,3
Raquel Ganong,30,F,KY,73.3,Open,75,77.5,82.5,87.5,87.5,,,42.5,52.5,52.5,,82.5,92.5,115,115,,255,SBD,Raw,4
Kim Doutt,57,F,PA,72.89,Open,75,65,67.5,72.5,72.5,,57.5,60,62.5,62.5,-65,95,97.5,100,100,,235,SBD,Raw,5
Michelle Hutt,47,F,NC,72.26,Open,75,47.5,-50,-50,47.5,,-30,30,32.5,32.5,,82.5,85,87.5,87.5,,167.5,SBD,Raw,6
Mary Ross,11,F,VA,71.3,Youth,75,,,30,30,,,,25,25,,,,85,85,,140,SBD,Raw,1
Lily Stoddard,12,F,NY,70.31,Teen 12-13,75,62.5,-82.5,85,85,,-42.5,47.5,-52.5,47.5,,85,100,113,113,,245,SBD,Raw,1
Kayla Meisner,24,F,KY,73.3,Juniors 20-24,75,115,125,130,130,,72.5,,,72.5,,135,147.5,,147.5,,350,SBD,Raw,1
Michelle Woods,45,F,VA,70.08,Masters 45-49,75,72.5,85,-90,85,,60,65,72.5,72.5,,100,115,125,125,,282.5,SBD,Raw,1
Michelle Hutt,47,F,NC,72.26,Masters 45-49,75,47.5,-50,-50,47.5,,-30,30,32.5,32.5,,82.5,85,87.5,87.5,,167.5,SBD,Raw,2
Jennifer Tillett,50,F,NC,71.67,Masters 50-54,75,72.5,75,77.5,77.5,,55,57.5,-60,57.5,,-130,130,-132.5,130,,265,SBD,Raw,1
Kim Doutt,57,F,PA,72.89,Masters 55-59,75,65,67.5,72.5,72.5,,57.5,60,62.5,62.5,-65,95,97.5,100,100,,235,SBD,Raw,1
Emily Karl,29,F,MD,74.98,Classic Open,75,110,122.5,135,135,,60,62.5,65,65,,145,150,160,160,,360,SBD,Raw,1
Chrystal Garcia,34,F,AZ,73.53,Classic Open,75,102.5,105,112.5,112.5,117.5,67.5,70,77.5,77.5,-80,137.5,140,145,145,,335,SBD,Raw,2
Riki Napiorkowski,30,F,NY,86.77,Open,90,137.5,142.5,147.5,147.5,,97.5,102.5,105,105,,175,190,-200,190,,442.5,SBD,Raw,1
Rebecca Tucker,35,F,NY,89.49,Open,90,140,145,-150,145,,87.5,90,-92.5,90,,165,170,-175,170,,405,SBD,Raw,2
Tara Steadman,31,F,CO,86.55,Open,90,125,132.5,137.5,137.5,-140,95,100,102.5,102.5,105,140,150,155,155,-160,395,SBD,Raw,3
Amy Traver,51,F,CT,89.09,Open,90,75,80,-85,80,,45,50,-55,50,,135,142.5,150,150,,280,SBD,Raw,4
Jontiasha Goode,23,F,VA,87.68,Juniors 20-24,90,,,117.5,117.5,,,,70,70,,,,112.5,112.5,,300,SBD,Raw,1
Rebecca Tucker,35,F,NY,89.49,Submasters 35-39,90,140,145,-150,145,,87.5,90,-92.5,90,,165,170,-175,170,,405,SBD,Raw,1
Amy Traver,51,F,CT,89.09,Masters 50-54,90,75,80,-85,80,,45,50,-55,50,,135,142.5,150,150,,280,SBD,Raw,1
Karen Hansen,70,F,VA,86.09,Masters 70-74,90,,,73,73,,,,52.5,52.5,,,,126,126,,251.5,SBD,Raw,1
Sarah Heminger,40,F,MA,106.5,Open,90+,135,152.5,162.5,162.5,,80,85,92.5,92.5,,152.5,167.5,182.5,182.5,,437.5,SBD,Raw,1
Shannon Scott,34,F,NC,122.97,Open,90+,142.5,150,160,160,,-80,80,90,90,,150,165,-182.5,165,,415,SBD,Raw,2
Karri Goodall,29,F,KY,96.12,Open,90+,102.5,107.5,115,115,,52.5,55,,55,,117.5,125,,125,,295,SBD,Raw,3
Katie Adams,21,F,FL,94.8,Juniors 20-24,90+,-125,125,-137.5,125,,-52.5,57.5,-62.5,57.5,,153.5,-175,-175,153.5,,336,SBD,Raw,1
Sarah Heminger,40,F,MA,106.5,Masters 40-44,90+,135,152.5,162.5,162.5,,80,85,92.5,92.5,,152.5,167.5,182.5,182.5,,437.5,SBD,Raw,1
Kristen Ross,42,F,VA,107.46,Masters 40-44,90+,,,140,140,,,,75,75,,,,152.5,152.5,,367.5,SBD,Raw,2
Meredith Gunning,41,F,NY,130.23,Masters 40-44,90+,102.5,110,-117.5,110,,57.5,60,-65,60,,122.5,130,132.5,132.5,,302.5,SBD,Raw,3
Kaiden Kohler,11,M,VA,41.28,Youth,48,,,40,40,,,,32.5,32.5,,,,80,80,,152.5,SBD,Raw,1
Andrew Hill,6,M,NC,21.77,Youth,48,8,10.5,-12.5,10.5,,8,-10.5,10.5,10.5,,27,30,31,31,,52,SBD,Raw,2
John Ammons,19,M,NC,55.97,Open,56,100,105,110,110,,62.5,67.5,70,70,,137.5,147.5,152.5,152.5,,332.5,SBD,Raw,1
John Ammons,19,M,NC,55.97,Teen 18-19,56,100,105,110,110,,62.5,67.5,70,70,,137.5,147.5,152.5,152.5,,332.5,SBD,Raw,1
Kevin Smith #2,33,M,NC,58.97,Open,60,,,92.5,92.5,,,,92.5,92.5,,,,175,175,,360,SBD,Raw,1
Marcus Khorsand,23,M,NC,67.27,Open,67.5,142.5,-145,145,145,,95,100,102.5,102.5,,210,217.5,220,220,,467.5,SBD,Raw,1
Corey McLaughlin,22,M,PA,63.19,Open,67.5,102.5,110,115,115,,110,-115,115,115,,155,165,172.5,172.5,,402.5,SBD,Raw,2
Ben Zak,48,M,NC,67,Open,67.5,112.5,120,127.5,127.5,160,90,95,100,100,,150,160,,160,,387.5,SBD,Raw,3
Ian Bailey,18,M,NC,67.36,Open,67.5,102.5,120,127.5,127.5,,67.5,80,85,85,,142.5,-170,-170,142.5,,355,SBD,Raw,4
Gabe Blenis,12,M,NY,62.28,Teen 12-13,67.5,72.5,-92.5,92.5,92.5,,42.5,52.5,-60,52.5,,102.5,112.5,-125,112.5,,257.5,SBD,Raw,1
Colton Tomzit,,M,AZ,63.5,Teen 16-17,67.5,-92.5,102.5,112.5,112.5,,65,72.5,-77.5,72.5,,125,135,142,142,,327,SBD,Raw,1
Ian Bailey,18,M,NC,67.36,Teen 18-19,67.5,102.5,120,127.5,127.5,,67.5,80,85,85,,142.5,-170,-170,142.5,,355,SBD,Raw,1
Marcus Khorsand,23,M,NC,67.27,Juniors 20-24,67.5,142.5,-145,145,145,,95,100,102.5,102.5,,210,217.5,220,220,,467.5,SBD,Raw,1
George James,45,M,MD,66.04,Masters 45-49,67.5,,,168,168,,,,101,101,,,,202.5,202.5,,471.5,SBD,Raw,1
Ben Zak,48,M,NC,67,Masters 45-49,67.5,112.5,120,127.5,127.5,160,90,95,100,100,,150,160,,160,,387.5,SBD,Raw,2
Monte Lofing,60,M,NE,66.77,Masters 60-64,67.5,170,180,187.5,187.5,190,90,95,97.5,97.5,,165,175,182.5,182.5,,467.5,SBD,Raw,1
Lee Luedeker,67,M,AZ,66.36,Masters 65-69,67.5,-95,95,-102.5,95,,87.5,95,100,100,,135,150,-157.5,150,,345,SBD,Raw,1
George James,45,M,MD,66.04,Law/Fire/Military,67.5,,,168,168,,,,101,101,,,,202.5,202.5,,471.5,SBD,Raw,1
Marcus Khorsand,23,M,NC,67.27,Law/Fire/Military,67.5,142.5,-145,145,145,,95,100,102.5,102.5,,210,217.5,220,220,,467.5,SBD,Raw,2
Mark Dutton,16,M,NC,74.16,Open,75,145,150,155,155,,77.5,82.5,87.5,87.5,,210,-227.5,-227.5,210,,452.5,SBD,Raw,1
Trevor Collazo,34,M,VA,74.3,Open,75,,,120,120,,,,80,80,,,,135,135,,335,SBD,Raw,2
Dylan Cooper,11,M,NC,68.49,Youth,75,40,45,52.5,52.5,,27.5,30,32.5,32.5,,65,85,92.5,92.5,100,177.5,SBD,Raw,1
Ari Kutin,15,M,NJ,74.93,Teen 14-15,75,130,142.5,150,150,,85,90,-92.5,90,,185,200,210,210,,450,SBD,Raw,1
Nick Hines,14,M,CT,70.76,Teen 14-15,75,107.5,117.5,122.5,122.5,,65,70,-75,70,,135,137.5,142.5,142.5,,335,SBD,Raw,2
Eric Conant,17,M,NY,73.71,Teen 16-17,75,185,200.5,-205,200.5,,102.5,112.5,-117.5,112.5,,195,227.5,237.5,237.5,,550,SBD,Raw,1
Elliot Anderson,17,M,VA,72.21,Teen 16-17,75,112.5,140,147.5,147.5,,120,125,-130,125,,187.5,-200,,187.5,,460,SBD,Raw,2
Mark Dutton,16,M,NC,74.16,Teen 16-17,75,145,150,155,155,,77.5,82.5,87.5,87.5,,210,-227.5,-227.5,210,,452.5,SBD,Raw,3
Noah Midgette,19,M,VA,74.62,Teen 18-19,75,,,170,170,,,,122.5,122.5,,,,192.5,192.5,,485,SBD,Raw,1
Cory Davenport,18,M,DE,74.39,Teen 18-19,75,-125,142.5,-152.5,142.5,,102.5,105,-110,105,,147.5,160,172.5,172.5,,420,SBD,Raw,2
Jake Garner,22,M,NE,74.12,Juniors 20-24,75,177.5,182.5,187.5,187.5,,110,,,110,,220,227.5,232.5,232.5,,530,SBD,Raw,1
Devin Coleman,,M,AZ,73.57,Juniors 20-24,75,142.5,157.5,-162.5,157.5,,107.5,125,130,130,,185,192.5,200,200,,487.5,SBD,Raw,2
Kevin Outland,50,M,NC,73.66,Masters 50-54,75,145,-155,-157.5,145,,130,135,-137.5,135,,60,,,60,,340,SBD,Raw,1
William Deloney,,M,AZ,74.93,Masters 65-69,75,60,,,60,,-107.5,-107.5,107.5,107.5,-118,110,115,125,125,,292.5,SBD,Raw,1
Ronnie Powell,71,M,NE,72.39,Masters 70-74,75,117.5,120,125,125,,105,110,117.5,117.5,,182.5,197.5,210,210,,452.5,SBD,Raw,1
Jacob Holly,29,M,AZ,71.85,Classic Open,75,152.5,-177.5,-177.5,152.5,,97.5,-105,-105,97.5,,180,200,-205,200,,450,SBD,Raw,1
Raul Ortega,25,M,AZ,71.85,Classic Open,75,142.5,147.5,-150,147.5,,102.5,105,107.5,107.5,,172.5,182.5,187.5,187.5,,442.5,SBD,Raw,2
Kareem McMurrin,34,M,NC,77.79,Open,82.5,125,135,142.5,142.5,,-160,160,-165,160,,215,227.5,-232.5,227.5,,530,SBD,Raw,1
Dan Jared,29,M,IA,78.11,Open,82.5,155,165,175,175,,120,127.5,,127.5,,200,212.5,,212.5,,515,SBD,Raw,2
Mike Rapposelli,26,M,DE,79.83,Open,82.5,-152.5,-152.5,152.5,152.5,,-125,125,-130,125,,210,215,220,220,,497.5,SBD,Raw,3
Jayden Calloway,15,M,NC,82.05,Open,82.5,150,165,-175,165,,82.5,92.5,-95,92.5,,182.5,205,215,215,227.5,472.5,SBD,Raw,4
Benjamin Bedtke,29,M,AZ,79.11,Open,82.5,125,-135,-135,125,,70,77.5,-82.5,77.5,,167.5,182.5,192.5,192.5,,395,SBD,Raw,5
James Logsdon,37,M,KY,82.01,Open,82.5,102.5,110,,110,,82.5,87.5,90,90,,152.5,160,,160,,360,SBD,Raw,6
Eddie Altemose,34,M,PA,80.2,Open,82.5,85,97.5,107.5,107.5,,75,-85,-85,75,,132.5,145,155,155,,337.5,SBD,Raw,7
Jayden Calloway,15,M,NC,82.05,Teen 14-15,82.5,150,165,-175,165,,82.5,92.5,-95,92.5,,182.5,205,215,215,227.5,472.5,SBD,Raw,1
Nicholas Holmes,,M,MD,80.65,Teen 14-15,82.5,100,115,117.5,117.5,,87.5,-92.5,97.5,97.5,,135,165,-180,165,,380,SBD,Raw,2
Kyle Meadows,14,M,IL,82.42,Teen 14-15,82.5,110,125,140,140,,,,75,75,,142.5,150,165,165,,380,SBD,Raw,3
Colton Peach,,M,AZ,80.83,Teen 14-15,82.5,112.5,122.5,137.5,137.5,148,75,-85,-85,75,,117.5,132.5,152.5,152.5,,365,SBD,Raw,4
Zach Mills,17,M,NY,77.7,Teen 16-17,82.5,125,142.5,155,155,,102.5,-112.5,112.5,112.5,,167.5,200,,200,,467.5,SBD,Raw,1
Connor Strauss,16,M,NY,81.42,Teen 16-17,82.5,120,-132.5,-132.5,120,,70,-82.5,82.5,82.5,,140,152.5,-160,152.5,,355,SBD,Raw,2
Jesse Zelkin,,M,AZ,81.56,Teen 18-19,82.5,157.5,170,182.5,182.5,,112.5,122.5,-130,122.5,,202.5,215,-227.5,215,,520,SBD,Raw,1
James Logsdon,37,M,KY,82.01,Submasters 35-39,82.5,102.5,110,,110,,82.5,87.5,90,90,,152.5,160,,160,,360,SBD,Raw,1
Rick Boston,54,M,NE,81.19,Masters 50-54,82.5,152.5,175,,175,,105,117.5,125,125,,127.5,137.5,155,155,,455,SBD,Raw,1
Tony Conyers,59,M,FL,75.48,Masters 55-59,82.5,205,227.5,,227.5,,150,165,,165,,227.5,-275,275,275,,667.5,SBD,Raw,1
Larry Nash,58,M,VA,77.38,Masters 55-59,82.5,165,172.5,182.5,182.5,190,120,-127.5,127.5,127.5,,165,182.5,192.5,192.5,,502.5,SBD,Raw,2
Vinny Gengaro,63,M,NJ,82.24,Masters 60-64,82.5,160,-162.5,162.5,162.5,,117.5,120,122.5,122.5,,172.5,-182.5,182.5,182.5,,467.5,SBD,Raw,1
Larry Emerson,70,M,MA,80.92,Masters 70-74,82.5,142.5,147.5,150,150,,85,87.5,-90,87.5,,205,215,-218,215,,452.5,SBD,Raw,1
Jesse Zelkin,,M,AZ,81.56,Classic Open,82.5,157.5,170,182.5,182.5,,112.5,122.5,-130,122.5,,202.5,215,-227.5,215,,520,SBD,Raw,1
William Waller,47,M,VA,86.14,Open,90,,,262.5,262.5,,,,155,155,,,,282.5,282.5,,700,SBD,Raw,1
Brandon Russell,31,M,PA,86.91,Open,90,195,205,215,215,,165,180,-195,180,,220,240,250,250,,645,SBD,Raw,2
Brian Trail,27,M,AZ,87.68,Open,90,170,182.5,,182.5,,142.5,150,-152.5,150,,242.5,262.5,-267.5,262.5,,595,SBD,Raw,3
Eathan Sanders,26,M,VA,88.04,Open,90,,,190,190,,120,,,120,,,,235,235,,545,SBD,Raw,4
Tim Earl,,M,AZ,88.09,Open,90,142.5,,,142.5,,165,-170.5,-170.5,165,,237.5,,,237.5,,545,SBD,Raw,5
Nicholas Grady,26,M,NC,89.86,Open,90,162.5,185,192.5,192.5,,-125,137.5,-147.5,137.5,,172.5,187.5,192.5,192.5,,522.5,SBD,Raw,6
Austin Carlson,29,M,IA,89.81,Open,90,165,177.5,,177.5,,115,,,115,,190,210,215,215,,507.5,SBD,Raw,7
Scott Resetar,31,M,VA,89.81,Open,90,,,182.5,182.5,,,,130,130,,,,190,190,,502.5,SBD,Raw,8
Anthony Bannerman,47,M,NC,84.28,Open,90,131.5,-135,135,135,,154,160,-165,160,,-184,191.5,195,195,,490,SBD,Raw,9
Rob Clary,51,M,AZ,89.09,Open,90,120,130,140,140,,117.5,127.5,138,138,140,182.5,192.5,200,200,,477.5,SBD,Raw,10
Brendan Whitaker,34,M,PA,86.36,Open,90,122.5,137.5,147.5,147.5,,110,117.5,-122.5,117.5,,170,190,-205,190,,455,SBD,Raw,11
Hunter Dale,16,M,OH,88.68,Open,90,135,140,147.5,147.5,,90,92.5,-102.5,92.5,,165,175,187.5,187.5,,427.5,SBD,Raw,12
Hunter Dale,16,M,OH,88.68,Teen 16-17,90,135,140,147.5,147.5,,90,92.5,-102.5,92.5,,165,175,187.5,187.5,,427.5,SBD,Raw,1
Jerry Chavez,,M,AZ,87.09,Juniors 20-24,90,152.5,172.5,185,185,,115,125,142.5,142.5,,197.5,217.5,235,235,,562.5,SBD,Raw,1
Austin Lee,22,M,NC,88.27,Juniors 20-24,90,185,202.5,212.5,212.5,,115,125,132.5,132.5,,185,200,215,215,,560,SBD,Raw,2
Tim Earl,,M,AZ,88.09,Juniors 20-24,90,142.5,,,142.5,,165,-170.5,-170.5,165,,237.5,,,237.5,,545,SBD,Raw,3
Danny Nguyen,23,M,IA,88.45,Juniors 20-24,90,165,185,190,190,,115,,117.5,117.5,,210,215,222.5,222.5,,530,SBD,Raw,4
Cosme Gonzalez,24,M,DE,88.18,Juniors 20-24,90,175,185,190,190,,-100,105,-115,105,,175,185,195,195,,490,SBD,Raw,5
Tommy Thompson,37,M,PA,87.77,Submasters 35-39,90,132.5,142.5,147.5,147.5,,102.5,105,-110,105,,165,177.5,185,185,,437.5,SBD,Raw,1
William Waller,47,M,VA,86.14,Masters 45-49,90,,,262.5,262.5,,,,155,155,,,,282.5,282.5,,700,SBD,Raw,1
Anthony Bannerman,47,M,NC,84.28,Masters 45-49,90,131.5,-135,135,135,,154,160,-165,160,,-184,191.5,195,195,,490,SBD,Raw,2
Rob Clary,51,M,AZ,89.09,Masters 50-54,90,120,130,140,140,,117.5,127.5,138,138,140,182.5,192.5,200,200,,477.5,SBD,Raw,1
Tom Halbert,,M,NY,88.99,Masters 50-54,90,-150,150,-155,150,,150,155,-160,155,,152.5,160,167.5,167.5,,472.5,SBD,Raw,2
Kurt Morem,,M,AZ,87.14,Masters 50-54,90,102.5,112.5,122.5,122.5,,102.5,-107.5,107.5,107.5,,145,150,165,165,,395,SBD,Raw,3
Roy Apseloff,60,M,VA,88.86,Masters 60-64,90,147.5,172.5,182.5,182.5,,102.5,110,-112.5,110,,255,-265,,255,,547.5,SBD,Raw,1
Jake Knuth,32,M,NE,99.7,Open,100,207.5,222.5,232.5,232.5,,,162.5,,162.5,,230,245,260,260,,655,SBD,Raw,1
Adam Perry,27,M,IL,92.99,Open,100,,205,,205,,165,177.5,,177.5,,250,,267.5,267.5,,650,SBD,Raw,2
Seth Riley,25,M,VA,96.62,Open,100,,,227.5,227.5,,,,152.5,152.5,,,,255,255,,635,SBD,Raw,3
Kyle Farmer,26,M,KY,96.62,Open,100,202.5,220,,220,,135,145,,145,,242.5,265,,265,,630,SBD,Raw,4
Lacy Jackson,24,M,DE,96.52,Open,100,182.5,195,-210,195,,107.5,120,-135,120,,237.5,247.5,257.5,257.5,,572.5,SBD,Raw,5
Josh Cue,34,M,NC,98.16,Open,100,185,195,-205,195,,130,135,-140,135,,222,235,242.5,242.5,,572.5,SBD,Raw,6
Tyler Scheinost,33,M,MA,93.39,Open,100,175,185,192.5,192.5,,127.5,137.5,142.5,142.5,,195,207.5,220,220,,555,SBD,Raw,7
Ryan Davis,28,M,NY,97.89,Open,100,140,152.5,-160,152.5,,120,125,130,130,,175,182.5,192.5,192.5,,475,SBD,Raw,8
David Zavadil,54,M,VA,93.89,Open,100,135,150,160,160,,80,-90,-90,80,,170,190,-220,190,,430,SBD,Raw,9
Jason Flood,34,M,CT,97.98,Open,100,112.5,122.5,135,135,,110,115,-117.5,115,,165,175,-185,175,,425,SBD,Raw,10
Jim McKenna,69,M,PA,99.56,Open,100,65,67.5,70,70,,127.5,132.5,-135,132.5,,110,115,120,120,,322.5,SBD,Raw,11
Quinton Reed,21,M,PA,97.89,Juniors 20-24,100,247.5,260,-272.5,260,,142.5,152.5,157.5,157.5,,275,285,-292.5,285,,702.5,SBD,Raw,1
David Zavadil,54,M,VA,93.89,Masters 50-54,100,135,150,160,160,,80,-90,-90,80,,170,190,-220,190,,430,SBD,Raw,1
Ray Ganong,64,M,KY,98.61,Masters 60-64,100,60,85,102.5,102.5,,117,120,,120,,62.5,145,195,195,,417.5,SBD,Raw,1
Jim McKenna,69,M,PA,99.56,Masters 65-69,100,65,67.5,70,70,,127.5,132.5,-135,132.5,,110,115,120,120,,322.5,SBD,Raw,1
Alan Dean Foster,,M,AZ,91.94,Masters 70-74,100,-45,-45,45,45,,100,106,-112.5,106,,100,110,120,120,,271,SBD,Raw,1
Bruce Knox,32,M,MD,98.29,Classic Open,100,227.5,245,250,250,,175,182.5,-187.5,182.5,,265,282.5,292.5,292.5,,725,SBD,Raw,1
Zach Santangelo,33,M,PA,98.88,Classic Open,100,202.5,220,225,225,,147.5,157.5,-162.5,157.5,,225,247.5,-260,247.5,,630,SBD,Raw,2
Chesleigh Denison,30,M,KY,109.18,Open,110,,242.5,252.5,252.5,,,152.5,162.5,162.5,,290,,,290,,705,SBD,Raw,1
Jeremy Beckner,30,M,IL,105.01,Open,110,217.5,222.5,232.5,232.5,,162.5,170,,170,,227.5,242.5,262.5,262.5,,665,SBD,Raw,2
Joseph Peer,25,M,NY,106.91,Open,110,205,225,-235,225,,147.5,157.5,-162.5,157.5,,230,242.5,265,265,,647.5,SBD,Raw,3
Travis Cinfel,30,M,NE,108.32,Open,110,185,190,,190,,152.5,160,,160,,215,227.5,,227.5,,577.5,SBD,Raw,4
Tim Durrett,44,M,VA,106.55,Open,110,,,202.5,202.5,,,,150,150,,,,220,220,,572.5,SBD,Raw,5
Taylor Patrick,25,M,NC,107.95,Open,110,175,182.5,,182.5,,130,135,-137.5,135,,207.5,220,227.5,227.5,,545,SBD,Raw,6
Thomas Black,29,M,KY,107.32,Open,110,157.5,167.5,,167.5,,145,,,145,,187.5,200,220,220,,532.5,SBD,Raw,7
Collin Jennings,16,M,NC,104.05,Open,110,130,142.5,150,150,,-100,107.5,-112.5,107.5,,182.5,192.5,-200,192.5,,450,SBD,Raw,8
Collin Jennings,16,M,NC,104.05,Teen 16-17,110,130,142.5,150,150,,-100,107.5,-112.5,107.5,,182.5,192.5,-200,192.5,,450,SBD,Raw,1
Justin Foster,38,M,KY,102.6,Submasters 35-39,110,152.5,,160,160,,97.5,102.5,107.5,107.5,,175,182.5,190,190,,457.5,SBD,Raw,1
Eric Tuthill,,M,AZ,102.74,Masters 40-44,110,207.5,215,-220,215,,145,-155,155,155,,227.5,-235,,227.5,,597.5,SBD,Raw,1
Tim Durrett,44,M,VA,106.55,Masters 40-44,110,,,202.5,202.5,,,,150,150,,,,220,220,,572.5,SBD,Raw,2
James Frankson,48,M,VA,109.77,Masters 45-49,110,125,-130,130,130,,80,90,97.5,97.5,,130,135,145,145,,372.5,SBD,Raw,1
Nate Matthews,59,M,OH,109.32,Masters 55-59,110,185,-192.5,192.5,192.5,,180,185,187.5,187.5,,270,280,-282.5,280,,660,SBD,Raw,1
Larry Savage,,M,AZ,109.09,Masters 55-59,110,155,165,185,185,187.5,145,150,160,160,,195,210.5,215,215,,560,SBD,Raw,2
Paul Adler,31,M,PA,109.77,Classic Open,110,120,132.5,-145,132.5,,80,92.5,-97.5,92.5,,145,162.5,172.5,172.5,,397.5,SBD,Raw,1
Shawn Fante,33,M,KY,112.72,Open,125,210,230,,230,,162.5,,175,175,,245,,,245,,650,SBD,Raw,1
Taylor Matthews,30,M,NC,122.97,Open,125,212.5,-232.5,-232.5,212.5,,150,160,-167.5,160,,242.5,262.5,277.5,277.5,,650,SBD,Raw,2
Austin Poff,24,M,NC,123.38,Open,125,210,215,220,220,,135,140,-145,140,,255,272.5,282.5,282.5,,642.5,SBD,Raw,3
Mark Fleming,27,M,NE,120.02,Open,125,205,220,230,230,,145,,150,150,,227.5,250,,250,,630,SBD,Raw,4
David West,27,M,AZ,111.4,Open,125,200,-210,210,210,,125,135,137.5,137.5,,232.5,245,255,255,,602.5,SBD,Raw,5
Daryl Matzke,30,M,NY,124.01,Open,125,170,180,190,190,,150,165,-177.5,165,,220,230,240,240,,595,SBD,Raw,6
Jaylen Owens,17,M,NC,114.99,Open,125,160,172.5,185,185,,100,107.5,117.5,117.5,,210,220,227.5,227.5,,530,SBD,Raw,7
Brian Snell,26,M,MA,114.76,Open,125,170,-180,180,180,,110,117.5,-120,117.5,,190,200,215,215,,512.5,SBD,Raw,8
Jaylen Owens,17,M,NC,114.99,Teen 16-17,125,160,172.5,185,185,,100,107.5,117.5,117.5,,210,220,227.5,227.5,,530,SBD,Raw,1
Austin Poff,24,M,NC,123.38,Juniors 20-24,125,210,215,220,220,,135,140,-145,140,,255,272.5,282.5,282.5,,642.5,SBD,Raw,1
Jeremy Maisenbach,,M,AZ,121.65,Submasters 35-39,125,160,177.5,182.5,182.5,,117.5,-127.5,-127.5,117.5,,200,217.5,-227.5,217.5,,517.5,SBD,Raw,1
Shawn Dorsey,43,M,NE,124.01,Masters 40-44,125,205,220,230,230,,135,145,150,150,,180,192.5,205,205,,585,SBD,Raw,1
Jeremy Maisenbach,,M,AZ,121.65,Classic Open,125,160,177.5,182.5,182.5,,117.5,-127.5,-127.5,117.5,,200,217.5,-227.5,217.5,,517.5,SBD,Raw,1
Matthew Rice,30,M,NC,126.46,Open,140,267.5,277.5,,277.5,,145,-152.5,,145,,265,285,,285,,707.5,SBD,Raw,1
Nathan Daniels,25,M,NC,136.98,Open,140,220,230,237.5,237.5,,150,155,-160,155,,220,227.5,-235,227.5,,620,SBD,Raw,2
Daniel Sherwood,35,M,VA,128.05,Submasters 35-39,140,,,230,230,,,,175,175,,,,240,240,,645,SBD,Raw,1
David Villeneuve,50,M,VT,130.14,Masters 50-54,140,247.5,260,272.5,272.5,,170,-182.5,-182.5,170,,280,287.5,300,300,,742.5,SBD,Raw,1
Baron Dixon,52,M,VA,140.61,Open,140+,,,172.5,172.5,,,,155,155,,,,265,265,,592.5,SBD,Raw,1
Baron Dixon,52,M,VA,140.61,Masters 50-54,140+,,,172.5,172.5,,,,155,155,,,,265,265,,592.5,SBD,Raw,1
Brooke Zak,12,F,NC,42.59,Teen 12-13,44,,,,,,25,27.5,-30,27.5,,60,72.5,77.5,77.5,,105,BD,Raw,1
Rocky Luedeker,,F,AZ,44.63,Masters 60-64,48,,,,,,35,37.5,40.5,40.5,-42.5,62.5,70,77.5,77.5,80.5,117.5,BD,Raw,1
Bianca Luedeker,,F,AZ,52.84,Open,56,,,,,,65,67.5,-70,67.5,,112.5,120,130,130,,197.5,BD,Raw,1
Anna Zak,15,F,NC,54.07,Open,56,,,,,,27,29.5,32.5,32.5,,65,85,92.5,92.5,,125,BD,Raw,2
Anna Zak,15,F,NC,54.07,Teen 14-15,56,,,,,,27,29.5,32.5,32.5,,65,85,92.5,92.5,,125,BD,Raw,1
Lori Bailey,47,F,NC,66.68,Open,67.5,,,,,,62.5,67.5,-70,67.5,,125,137.5,147.5,147.5,,215,BD,Raw,1
LaKeisha Kanen,43,F,NC,63.96,Open,67.5,,,,,,57.5,62.5,65,65,,120,137.5,142.5,142.5,,207.5,BD,Raw,2
Kaja Ferebee,17,F,NC,67.09,Open,67.5,,,,,,40,45,-50,45,,102.5,110,-127.5,110,,155,BD,Raw,3
Corinne Deem,15,F,NC,61.37,Open,67.5,,,,,,44,-46.5,-46.5,44,,90,100,105,105,,149,BD,Raw,4
Corinne Deem,15,F,NC,61.37,Teen 14-15,67.5,,,,,,44,-46.5,-46.5,44,,90,100,105,105,,149,BD,Raw,1
Kaja Ferebee,17,F,NC,67.09,Teen 16-17,67.5,,,,,,40,45,-50,45,,102.5,110,-127.5,110,,155,BD,Raw,1
LaKeisha Kanen,43,F,NC,63.96,Masters 40-44,67.5,,,,,,57.5,62.5,65,65,,120,137.5,142.5,142.5,,207.5,BD,Raw,1
Cher Myers,61,F,FL,60.1,Masters 60-64,67.5,,,,,,32.5,-37.5,-37.5,32.5,,70,80,-87.5,80,,112.5,BD,Raw,1
Chrystal Garcia,34,F,AZ,73.53,Open,75,,,,,,67.5,70,77.5,77.5,,137.5,140,145,145,,222.5,BD,Raw,1
Jennifer Tillett,50,F,NC,71.67,Open,75,,,,,,55,57.5,-60,57.5,,-130,130,-132.5,130,,187.5,BD,Raw,2
Ann Gartman,31,F,MA,70.17,Open,75,,,,,,42.5,52.5,55,55,,100,107.5,117.5,117.5,,172.5,BD,Raw,3
Michelle Hutt,47,F,NC,72.26,Open,75,,,,,,-30,30,32.5,32.5,,82.5,85,87.5,87.5,,120,BD,Raw,4
Michelle Hutt,47,F,NC,72.26,Masters 45-49,75,,,,,,-30,30,32.5,32.5,,82.5,85,87.5,87.5,,120,BD,Raw,1
Jennifer Tillett,50,F,NC,71.67,Masters 50-54,75,,,,,,55,57.5,-60,57.5,,-130,130,-132.5,130,,187.5,BD,Raw,1
Linda Lee,58,F,VA,79.7,Masters 55-59,82.5,,,,,,,,75,75,,,,137.5,137.5,,212.5,BD,Raw,1
Shannon Scott,34,F,NC,122.97,Open,90+,,,,,,-80,80,90,90,,150,165,-182.5,165,,255,BD,Raw,1
Jessica Newcomb,36,F,VA,91.4,Submasters 35-39,90+,,,,,,,,55,55,,,,80,80,,135,BD,Raw,1
Debra Ingersoll,53,F,FL,106,Masters 50-54,90+,,,,,,37.5,40,45,45,,70,77.5,92.5,92.5,,137.5,BD,Raw,1
Caden Cooper,7,M,NC,24.99,Youth,48,,,,,,13.5,-16,-16,13.5,,40,42.5,48.5,48.5,,62,BD,Raw,1
John Ammons,19,M,NC,55.97,Open,56,,,,,,62.5,67.5,70,70,,137.5,147.5,152.5,152.5,,222.5,BD,Raw,1
John Ammons,19,M,NC,55.97,Teen 18-19,56,,,,,,62.5,67.5,70,70,,137.5,147.5,152.5,152.5,,222.5,BD,Raw,1
Sergio Lara,14,M,NC,59.28,Open,60,,,,,,42.5,55,-57.5,55,,120,125,132.5,132.5,,187.5,BD,Raw,1
Sergio Lara,14,M,NC,59.28,Teen 14-15,60,,,,,,42.5,55,-57.5,55,,120,125,132.5,132.5,,187.5,BD,Raw,1
Marcus Khorsand,23,M,NC,67.27,Open,67.5,,,,,,95,100,102.5,102.5,,210,217.5,220,220,,322.5,BD,Raw,1
Ben Zak,48,M,NC,67,Open,67.5,,,,,,90,95,100,100,,150,160,,160,,260,BD,Raw,2
Ian Bailey,18,M,NC,67.36,Open,67.5,,,,,,67.5,80,85,85,,142.5,-170,-170,142.5,,227.5,BD,Raw,3
Ian Bailey,18,M,NC,67.36,Teen 18-19,67.5,,,,,,67.5,80,85,85,,142.5,-170,-170,142.5,,227.5,BD,Raw,1
Marcus Khorsand,23,M,NC,67.27,Juniors 20-24,67.5,,,,,,95,100,102.5,102.5,,210,217.5,220,220,,322.5,BD,Raw,1
Ben Zak,48,M,NC,67,Masters 45-49,67.5,,,,,,90,95,100,100,,150,160,,160,,260,BD,Raw,1
Monte Lofing,60,M,NE,66.77,Masters 60-64,67.5,,,,,,90,95,97.5,97.5,,165,175,182.5,182.5,,280,BD,Raw,1
Lee Luedeker,67,M,AZ,66.36,Masters 65-69,67.5,,,,,,87.5,95,100,100,,135,150,-157.5,150,,250,BD,Raw,1
Marcus Khorsand,23,M,NC,67.27,Law/Fire/Military,67.5,,,,,,95,100,102.5,102.5,,210,217.5,220,220,,322.5,BD,Raw,1
Marcus Khorsand,23,M,NC,67.27,Law/Fire/Military,67.5,,,,,,95,100,102.5,102.5,,210,217.5,220,220,,322.5,BD,Raw,2
Mark Dutton,16,M,NC,74.16,Open,75,,,,,,77.5,82.5,87.5,87.5,,210,-227.5,-227.5,210,,297.5,BD,Raw,1
Mark Dutton,16,M,NC,74.16,Teen 16-17,75,,,,,,77.5,82.5,87.5,87.5,,210,-227.5,-227.5,210,,297.5,BD,Raw,1
Ronnie Powell,71,M,NE,72.39,Masters 70-74,75,,,,,,105,110,117.5,117.5,,182.5,197.5,210,210,,327.5,BD,Raw,1
Kareem McMurrin,34,M,NC,77.79,Open,82.5,,,,,,-160,160,-165,160,,215,227.5,-232.5,227.5,,387.5,BD,Raw,1
Steve Turlington,51,M,NC,81.96,Open,82.5,,,,,,-102,112.5,-125,112.5,,-204,205,-215,205,,317.5,BD,Raw,2
Jayden Calloway,15,M,NC,82.05,Open,82.5,,,,,,82.5,92.5,-95,92.5,,182.5,205,215,215,227.5,307.5,BD,Raw,3
Jayden Calloway,15,M,NC,82.05,Teen 14-15,82.5,,,,,,82.5,92.5,-95,92.5,,182.5,205,215,215,227.5,307.5,BD,Raw,1
Jesse Zelkin,,M,AZ,81.56,Teen 18-19,82.5,,,,,,112.5,122.5,-130,122.5,,202.5,215,-227.5,215,,337.5,BD,Raw,1
Brian Trail,27,M,AZ,87.68,Open,90,,,,,,142.5,150,-152.5,150,,242.5,262.5,-267.5,262.5,,412.5,BD,Raw,1
Anthony Bannerman,47,M,NC,84.28,Open,90,,,,,,154,160,-165,160,,-184,191.5,195,195,,355,BD,Raw,2
Matthew Holtry,39,M,NC,87.36,Open,90,,,,,,,,112.5,112.5,,,,222.5,222.5,,335,BD,Raw,3
Matthew Holtry,39,M,NC,87.36,Submasters 35-39,90,,,,,,,,112.5,112.5,,,,222.5,222.5,,335,BD,Raw,1
Anthony Bannerman,47,M,NC,84.28,Masters 45-49,90,,,,,,154,160,-165,160,,-184,191.5,195,195,,355,BD,Raw,1
Rob Clary,51,M,AZ,89.09,Masters 50-54,90,,,,,,117.5,127.5,138,138,140,182.5,192.5,200,200,,337.5,BD,Raw,1
Andrew Kersting,32,M,AZ,97.52,Open,100,,,,,,130,132.5,-137.5,132.5,,250,260,272.5,272.5,,405,BD,Raw,1
Josh Cue,34,M,NC,98.16,Open,100,,,,,,130,135,-140,135,,222,235,242.5,242.5,,377.5,BD,Raw,2
David Zavadil,54,M,VA,93.89,Open,100,,,,,,80,-90,-90,80,,170,190,-220,190,,270,BD,Raw,3
Jake Narvet,17,M,OH,97.3,Teen 16-17,100,,,,,,137.5,142.5,,142.5,,207.5,227.5,,227.5,,370,BD,Raw,1
David Zavadil,54,M,VA,93.89,Masters 50-54,100,,,,,,80,-90,-90,80,,170,190,-220,190,,270,BD,Raw,1
Carl Inman,64,M,NC,98.16,Masters 60-64,100,,,,,,130,135,137.5,137.5,,147.5,182.5,-185,182.5,,320,BD,Raw,1
Alan Dean Foster,,M,AZ,91.94,Masters 70-74,100,,,,,,100,106,-112.5,106,,100,110,120,120,,226,BD,Raw,1
Vinnie Gengaro,31,M,NJ,109.04,Open,110,,,,,,-150,150,-160,150,,205,210,217.5,217.5,,367.5,BD,Raw,1
Collin Jennings,16,M,NC,104.05,Open,110,,,,,,-100,107.5,-112.5,107.5,,182.5,192.5,-200,192.5,,300,BD,Raw,2
Collin Jennings,16,M,NC,104.05,Teen 16-17,110,,,,,,-100,107.5,-112.5,107.5,,182.5,192.5,-200,192.5,,300,BD,Raw,1
Eric Tuthill,,M,AZ,102.74,Masters 40-44,110,,,,,,145,-155,155,155,,227.5,-235,,227.5,,382.5,BD,Raw,1
Gerren Short,41,M,VA,109.77,Masters 40-44,110,,,,,,,,180,180,,,,200,200,,380,BD,Raw,2
Austin Poff,24,M,NC,123.38,Open,125,,,,,,135,140,-145,140,,255,272.5,282.5,282.5,,422.5,BD,Raw,1
Jaylen Owens,17,M,NC,114.99,Open,125,,,,,,100,107.5,117.5,117.5,,210,220,227.5,227.5,,345,BD,Raw,2
Jaylen Owens,17,M,NC,114.99,Teen 16-17,125,,,,,,100,107.5,117.5,117.5,,210,220,227.5,227.5,,345,BD,Raw,1
Austin Poff,24,M,NC,123.38,Juniors 20-24,125,,,,,,135,140,-145,140,,255,272.5,282.5,282.5,,422.5,BD,Raw,1
Stephen Kozlowski,60,M,VA,116.75,Masters 60-64,125,,,,,,,,170,170,,,,217.5,217.5,,387.5,BD,Raw,1
Daniel Corridean,42,M,NC,132.99,Open,140,,,,,,165,177.5,-182.5,177.5,,275,295,-305,295,,472.2,BD,Raw,1
Nathan Daniels,25,M,NC,136.98,Open,140,,,,,,150,155,-160,155,,220,227.5,-235,227.5,,382.5,BD,Raw,2
Torrey Whitehurst,38,M,NC,130.59,Submasters 35-39,140,,,,,,160,175,-187.5,175,,230,252.5,-272.5,252.5,,427.5,BD,Raw,1
Daniel Corridean,42,M,NC,132.99,Masters 40-44,140,,,,,,165,177.5,-182.5,177.5,,275,295,-305,295,,472.2,BD,Raw,1
Robert Gains,55,M,VA,140.39,Open,140+,,,,,,,,197.5,197.5,,,,267.5,267.5,,465,BD,Raw,1
Robert Gains,55,M,VA,140.39,Masters 55-59,140+,,,,,,,,197.5,197.5,,,,267.5,267.5,,465,BD,Raw,1
Tiffani Teeter,11,F,PA,42.68,Youth,44,,,,,,25,30,32.5,32.5,,,,,,,32.5,B,Raw,1
Brooke Zak,12,F,NC,42.59,Teen 12-13,44,,,,,,25,27.5,-30,27.5,,,,,,,27.5,B,Raw,1
Amanda Lajeunsse,,F,AZ,45.5,Juniors 20-24,48,,,,,,55,60.5,,60.5,,,,,,,60,B,Raw,1
Jennifer Waldron,45,F,KY,50.48,Open,52,,,,,,42.5,47.5,,47.5,,,,,,,47.5,B,Raw,1
Jennifer Waldron,45,F,KY,50.48,Masters 45-49,52,,,,,,42.5,47.5,,47.5,,,,,,,47.5,B,Raw,1
Natasha Beasley,35,F,VA,55.38,Open,56,,,,,,,,80.5,80.5,,,,,,,80,B,Raw,1
Leah Newton,29,F,KY,54.48,Open,56,,,,,,45,,,45,,,,,,,45,B,Raw,2
Tiffany Barney,45,F,CT,55.11,Open,56,,,,,,45,-50,-50,45,,,,,,,45,B,Raw,3
Anna Zak,15,F,NC,54.07,Open,56,,,,,,27,29.5,32.5,32.5,,,,,,,32.5,B,Raw,4
Anna Zak,15,F,NC,54.07,Teen 14-15,56,,,,,,27,29.5,32.5,32.5,,,,,,,32.5,B,Raw,1
Natasha Beasley,35,F,VA,55.38,Submasters 35-39,56,,,,,,,,80.5,80.5,,,,,,,80,B,Raw,1
Tiffany Barney,45,F,CT,55.11,Masters 45-49,56,,,,,,45,-50,-50,45,,,,,,,45,B,Raw,1
Katie Harris,,F,AZ,59.96,Juniors 20-24,60,,,,,,35,-42.5,-47.5,35,,,,,,,35,B,Raw,1
Kimberly Capers,39,F,MD,59.96,Submasters 35-39,60,,,,,,57.5,60,62.5,62.5,,,,,,,62.5,B,Raw,1
Judy Wolff,66,F,MA,59.65,Masters 65-69,60,,,,,,47.5,50,-52.5,50,,,,,,,50,B,Raw,1
Elena Mishurina,35,F,KY,67,Open,67.5,,,,,,67.5,,,67.5,,,,,,,67.5,B,Raw,1
LaKeisha Kanen,43,F,NC,63.96,Open,67.5,,,,,,57.5,62.5,65,65,,,,,,,65,B,Raw,2
Nikki Dorval,36,F,CT,62.6,Open,67.5,,,,,,45,-50,-55,45,,,,,,,45,B,Raw,3
Kaja Ferebee,17,F,NC,67.09,Open,67.5,,,,,,40,45,-50,45,,,,,,,45,B,Raw,4
Corinne Deem,15,F,NC,61.37,Open,67.5,,,,,,44,-46.5,-46.5,44,,,,,,,44,B,Raw,5
Darby Colian,45,F,OH,64.09,Open,67.5,,,,,,30,32.5,,32.5,,,,,,,32.5,B,Raw,6
Daron Gawronski,53,F,CT,62.82,Open,67.5,,,,,,27.5,30,-32.5,30,,,,,,,30,B,Raw,7
Corinne Deem,15,F,NC,61.37,Teen 14-15,67.5,,,,,,44,-46.5,-46.5,44,,,,,,,44,B,Raw,1
Isabella Devito,,F,AZ,62.28,Teen 14-15,67.5,,,,,,22.5,-25,-25,22.5,,,,,,,22.5,B,Raw,2
Kaja Ferebee,17,F,NC,67.09,Teen 16-17,67.5,,,,,,40,45,-50,45,,,,,,,45,B,Raw,1
Elena Mishurina,35,F,KY,67,Submasters 35-39,67.5,,,,,,67.5,,,67.5,,,,,,,67.5,B,Raw,1
Nikki Dorval,36,F,CT,62.6,Submasters 35-39,67.5,,,,,,45,-50,-55,45,,,,,,,45,B,Raw,2
LaKeisha Kanen,43,F,NC,63.96,Masters 40-44,67.5,,,,,,57.5,62.5,65,65,,,,,,,65,B,Raw,1
Darby Colian,45,F,OH,64.09,Masters 45-49,67.5,,,,,,30,32.5,,32.5,,,,,,,32.5,B,Raw,1
Daron Gawronski,53,F,CT,62.82,Masters 50-54,67.5,,,,,,27.5,30,-32.5,30,,,,,,,30,B,Raw,1
Kayla Meisner,24,F,KY,73.26,Open,75,,,,,,72.5,,,72.5,,,,,,,72.5,B,Raw,1
Jennifer Tillett,50,F,NC,71.67,Open,75,,,,,,55,57.5,-60,57.5,,,,,,,57.5,B,Raw,2
Kirsten Cole,27,F,NY,67.9,Open,75,,,,,,50,52.5,55,55,,,,,,,55,B,Raw,3
Michelle Hutt,47,F,NC,72.26,Open,75,,,,,,-30,30,32.5,32.5,,,,,,,32.5,B,Raw,4
Mary Ross,11,F,VA,71.3,Youth,75,,,,,,,,25,25,,,,,,,25,B,Raw,1
Michelle Woods,45,F,VA,70.08,Masters 45-49,75,,,,,,60,67.5,72.5,72.5,,,,,,,72.5,B,Raw,1
Michelle Hutt,47,F,NC,72.26,Masters 45-49,75,,,,,,-30,30,32.5,32.5,,,,,,,32.5,B,Raw,2
Jennifer Tillett,50,F,NC,71.67,Masters 50-54,75,,,,,,55,57.5,-60,57.5,,,,,,,57.5,B,Raw,1
Susan Daigle-Leach,,F,AZ,67.72,Masters 55-59,75,,,,,,50,52.5,55,55,56,,,,,,55,B,Raw,1
Cyndi Crossland,55,F,OK,82.46,Masters 55-59,82.5,,,,,,67.5,72.5,80,80,87.5,,,,,,80,B,Raw,1
Linda Lee,58,F,VA,79.7,Masters 55-59,82.5,,,,,,,,75,75,,,,,,,75,B,Raw,2
Riki Napiorkowski,30,F,NY,86.77,Open,90,,,,,,97.5,102.5,105,105,,,,,,,105,B,Raw,1
Amanda Corjulo,29,F,CT,89.81,Open,90,,,,,,35,37.5,-40,37.5,,,,,,,37.5,B,Raw,2
Sandy Flaus,62,F,VA,85.68,Masters 60-64,90,,,,,,61.5,-65,-65,61.5,,,,,,,61.5,B,Raw,1
Cassidy Comly,26,F,PA,95.98,Open,90+,,,,,,102.5,105,110,110,,,,,,,110,B,Raw,1
Cassidy Comly,26,F,PA,98.61,Open,90+,,,,,,102.5,110,-115,110,,,,,,,110,B,Raw,2
Charlie Comly-Dubbs,41,F,PA,117.66,Open,90+,,,,,,-100,105,107.5,107.5,-112.5,,,,,,107.5,B,Raw,3
Shannon Scott,34,F,NC,122.97,Open,90+,,,,,,-80,80,90,90,,,,,,,90,B,Raw,4
Heather Koch,36,F,NY,100.29,Open,90+,,,,,,62.5,65,-72.5,65,,,,,,,65,B,Raw,5
Victoria Paul,29,F,KY,99.88,Open,90+,,,,,,,62.5,,62.5,,,,,,,62.5,B,Raw,6
Briana Dooda,27,F,AZ,90.26,Open,90+,,,,,,47.5,52.5,55,55,-60,,,,,,55,B,Raw,7
Karri Goodall,29,F,KY,96.07,Open,90+,,,,,,52.5,55,,55,,,,,,,55,B,Raw,8
Heather Koch,36,F,NY,100.29,Submasters 35-39,90+,,,,,,62.5,65,-72.5,65,,,,,,,65,B,Raw,1
Charlie Comly-Dubbs,41,F,PA,117.66,Masters 40-44,90+,,,,,,-100,105,107.5,107.5,-112.5,,,,,,107.5,B,Raw,1
Sarah Heminger,40,F,MA,106.5,Masters 40-44,90+,,,,,,80,85,92.5,92.5,,,,,,,92.5,B,Raw,2
Kristen Ross,42,F,VA,107.46,Masters 40-44,90+,,,,,,,,75,75,,,,,,,75,B,Raw,3
John Ammons,19,M,NC,55.97,Open,56,,,,,,62.5,67.5,70,70,,,,,,,70,B,Raw,1
John Ammons,19,M,NC,55.97,Teen 18-19,56,,,,,,62.5,67.5,70,70,,,,,,,70,B,Raw,1
Gary Teeter,53,M,PA,59.96,Open,60,,,,,,100,110,-115,110,,,,,,,110,B,Raw,1
Rob Marcellino,29,M,NJ,57.42,Open,60,,,,,,52.5,60,65,65,,,,,,,65,B,Raw,2
Sergio Lara,14,M,NC,59.28,Open,60,,,,,,42.5,55,-57.5,55,,,,,,,55,B,Raw,3
Will Barney,13,M,CT,59.87,Open,60,,,,,,50,55,-62.5,55,,,,,,,55,B,Raw,4
Will Barney,13,M,CT,59.87,Teen 12-13,60,,,,,,50,55,-62.5,55,,,,,,,55,B,Raw,1
Sergio Lara,14,M,NC,59.28,Teen 14-15,60,,,,,,42.5,55,-57.5,55,,,,,,,55,B,Raw,1
Zach Drustrup,22,M,IA,58.97,Juniors 20-24,60,,,,,,62.5,67.5,75,75,,,,,,,75,B,Raw,1
Gary Teeter,54,M,PA,66.59,Open,67.5,,,,,,110,115,117.5,117.5,,,,,,,117.5,B,Raw,1
Marcus Khorsand,23,M,NC,67.27,Open,67.5,,,,,,95,100,102.5,102.5,,,,,,,102.5,B,Raw,2
Ben Zak,48,M,NC,67,Open,67.5,,,,,,90,95,100,100,,,,,,,100,B,Raw,3
Ian Bailey,18,M,NC,67.36,Open,67.5,,,,,,67.5,80,85,85,,,,,,,85,B,Raw,4
Dylan Vazquez,14,M,CT,62.37,Teen 14-15,67.5,,,,,,-45,47.5,50,50,,,,,,,50,B,Raw,1
Ian Bailey,18,M,NC,67.36,Teen 18-19,67.5,,,,,,67.5,80,85,85,,,,,,,85,B,Raw,1
Marcus Khorsand,23,M,NC,67.27,Juniors 20-24,67.5,,,,,,95,100,102.5,102.5,,,,,,,102.5,B,Raw,1
Ben Zak,48,M,NC,67,Masters 45-49,67.5,,,,,,90,95,100,100,,,,,,,100,B,Raw,1
Marcus Khorsand,23,M,NC,67.27,Law/Fire/Military,67.5,,,,,,95,100,102.5,102.5,,,,,,,102.5,B,Raw,1
Nasir Nantambu,40,M,NC,74.39,Open,75,,,,,,140,147.5,152.5,152.5,,,,,,,152.5,B,Raw,1
Jon Demarais,32,M,NY,68.58,Open,75,,,,,,110,115,117.5,117.5,,,,,,,117.5,B,Raw,2
Andrew Long,29,M,NY,73.8,Open,75,,,,,,105,110,117.5,117.5,,,,,,,117.5,B,Raw,3
Steve Orseno,42,M,MA,74.84,Open,75,,,,,,102.5,115,-125,115,,,,,,,115,B,Raw,4
Josh Baker,36,M,AZ,74.25,Open,75,,,,,,87.5,-97.5,97.5,97.5,,,,,,,97.5,B,Raw,5
Mark Dutton,16,M,NC,74.16,Open,75,,,,,,77.5,82.5,87.5,87.5,,,,,,,87.5,B,Raw,6
Trent Walker,16,M,NC,72.08,Open,75,,,,,,80,-82.5,82.5,82.5,,,,,,,82.5,B,Raw,7
Colin Majeski,14,M,CT,74.84,Teen 14-15,75,,,,,,50,52.5,-60,52.5,,,,,,,52.5,B,Raw,1
Mark Dutton,16,M,NC,74.16,Teen 16-17,75,,,,,,77.5,82.5,87.5,87.5,,,,,,,87.5,B,Raw,1
Trent Walker,16,M,NC,72.08,Teen 16-17,75,,,,,,80,-82.5,82.5,82.5,,,,,,,82.5,B,Raw,2
Ben Henson,23,M,MA,73.48,Juniors 20-24,75,,,,,,130,-137.5,137.5,137.5,,,,,,,137.5,B,Raw,1
Nasir Nantambu,40,M,NC,74.39,Masters 40-44,75,,,,,,140,147.5,152.5,152.5,,,,,,,152.5,B,Raw,1
Steve Orseno,42,M,MA,74.84,Masters 40-44,75,,,,,,102.5,115,-125,115,,,,,,,115,B,Raw,2
Jason Thomas,46,M,PA,71.4,Masters 45-49,75,,,,,,105,115,,115,,,,,,,115,B,Raw,1
William Devito,,M,AZ,72.03,Masters 45-49,75,,,,,,92.5,100,105,105,,,,,,,105,B,Raw,2
Kevin Outland,50,M,NC,73.66,Masters 50-54,75,,,,,,130,135,-137.5,135,,,,,,,135,B,Raw,1
Michael Aranda,,M,AZ,71.53,Masters 50-54,75,,,,,,52.5,-57.5,-57.5,52.5,,,,,,,52.5,B,Raw,2
Dan Gordon,,M,AZ,74.34,Masters 70-74,75,,,,,,85,95,100,100,-102.5,,,,,,100,B,Raw,1
Joe Weissenburger,,M,AZ,74.93,Masters 80+,75,,,,,,50,55,-60.5,55,,,,,,,55,B,Raw,1
Nasir Nantambu,40,M,NC,74.39,Law/Fire/Military,75,,,,,,140,147.5,152.5,152.5,,,,,,,152.5,B,Raw,1
Ben Henson,23,M,MA,73.48,Law/Fire/Military,75,,,,,,130,-137.5,137.5,137.5,,,,,,,137.5,B,Raw,2
Kareem McMurrin,34,M,NC,77.79,Open,82.5,,,,,,-160,160,-165,160,,,,,,,160,B,Raw,1
Raymond Harris #1,58,M,VA,79.24,Open,82.5,,,,,,,,145,145,,,,,,,145,B,Raw,2
Michael Gentzel,35,M,PA,78.15,Open,82.5,,,,,,120,125,135,135,,,,,,,135,B,Raw,3
Michael Barber,26,M,NY,79.38,Open,82.5,,,,,,122.5,127.5,132.5,132.5,,,,,,,132.5,B,Raw,4
Joe Orencia,71,M,PA,80.1,Open,82.5,,,,,,87.5,92.5,95,95,,,,,,,95,B,Raw,5
Jayden Calloway,15,M,NC,82.05,Open,82.5,,,,,,82.5,92.5,-95,92.5,,,,,,,92.5,B,Raw,6
James Logsdon,37,M,KY,81.96,Open,82.5,,,,,,82.5,87.5,90,90,,,,,,,90,B,Raw,7
Nicholas Holmes,,M,MD,80.65,Teen 14-15,82.5,,,,,,87.5,-92.5,97.5,97.5,,,,,,,97.5,B,Raw,1
Jayden Calloway,15,M,NC,82.05,Teen 14-15,82.5,,,,,,82.5,92.5,-95,92.5,,,,,,,92.5,B,Raw,2
August Yoder,18,M,NE,81.92,Teen 18-19,82.5,,,,,,,122.5,130,130,,,,,,,130,B,Raw,1
Daniel Conant,21,M,NY,77.38,Juniors 20-24,82.5,,,,,,130,-132.5,-132.5,130,,,,,,,130,B,Raw,1
Brian Bennis,39,M,MD,81.42,Submasters 35-39,82.5,,,,,,145,152.5,157.5,157.5,,,,,,,157.5,B,Raw,1
Raymond Harris #1,58,M,VA,79.24,Masters 55-59,82.5,,,,,,,,145,145,,,,,,,145,B,Raw,1
Gary Leach,,M,AZ,81.83,Masters 60-64,82.5,,,,,,97.5,100,102.5,102.5,,,,,,,102.5,B,Raw,1
Larry Eastman,66,M,PA,80.29,Masters 65-69,82.5,,,,,,115,117.5,-120,117.5,,,,,,,117.5,B,Raw,1
Robert Nicholas,74,M,OH,81.37,Masters 70-74,82.5,,,,,,97.5,102.5,,102.5,,,,,,,102.5,B,Raw,1
Al Gentzel,71,M,NJ,79.97,Masters 70-74,82.5,,,,,,60,65,67.5,67.5,,,,,,,67.5,B,Raw,2
Raymond Harris #1,58,M,VA,79.24,Law/Fire/Military,82.5,,,,,,,,145,145,,,,,,,145,B,Raw,1
Rickie Dozier,24,M,NC,89.99,Open,90,,,,,,182.5,-295,,182.5,,,,,,,182.5,B,Raw,1
Tim Earl,,M,AZ,88.09,Open,90,,,,,,165,-170.5,-170.5,165,,,,,,,165,B,Raw,2
Anthony Bannerman,47,M,NC,84.28,Open,90,,,,,,154,160,-165,160,,,,,,,160,B,Raw,3
John Cooper,43,M,NC,88.18,Open,90,,,,,,132.5,142,142.5,142.5,,,,,,,142.5,B,Raw,4
Gary Hastings,29,M,NJ,89.45,Open,90,,,,,,135,-142.5,-142.5,135,,,,,,,135,B,Raw,5
Tyler Pence,15,M,VA,88.09,Teen 14-15,90,,,,,,93,97.5,102.5,102.5,,,,,,,102.5,B,Raw,1
Evan Burak,15,M,NY,88.09,Teen 14-15,90,,,,,,102.5,-105,,102.5,,,,,,,102.5,B,Raw,2
JP Stanier,17,M,NC,85.09,Teen 16-17,90,,,,,,50,-52.5,52.5,52.5,,,,,,,52.5,B,Raw,1
Rickie Dozier,24,M,NC,89.99,Juniors 20-24,90,,,,,,182.5,-295,,182.5,,,,,,,182.5,B,Raw,1
Tim Earl,,M,AZ,88.09,Juniors 20-24,90,,,,,,165,-170.5,-170.5,165,,,,,,,165,B,Raw,2
Axel Anderson,37,M,VA,88.18,Submasters 35-39,90,,,,,,137.5,-142.5,142.5,142.5,-147.5,,,,,,142.5,B,Raw,1
John Cooper,43,M,NC,88.18,Masters 40-44,90,,,,,,132.5,142,142.5,142.5,,,,,,,142.5,B,Raw,1
Anthony Bannerman,47,M,NC,84.28,Masters 45-49,90,,,,,,154,160,-165,160,,,,,,,160,B,Raw,1
Dan Henson,53,M,FL,83.91,Masters 50-54,90,,,,,,160,162.5,165,165,,,,,,,165,B,Raw,1
John Taylor #9,70,M,NE,89.81,Masters 70-74,90,,,,,,105,115,120,120,,,,,,,120,B,Raw,1
Ken Thunberg,,M,CA,95.12,Open,100,,,,,,165,175,182.5,182.5,185,,,,,,182.5,B,Raw,1
Adam Perry,27,M,IL,92.99,Open,100,,,,,,165,177.5,,177.5,,,,,,,177.5,B,Raw,2
Ray Matusko,52,M,NC,96.98,Open,100,,,,,,152.5,165,170,170,,,,,,,170,B,Raw,3
Craig Perry,65,M,KY,98.07,Open,100,,,,,,160,165,170,170,,,,,,,170,B,Raw,4
Randy Elbert,48,M,MD,90.26,Open,100,,,,,,147.5,155,-160,155,,,,,,,155,B,Raw,5
Demetrius Blowe,43,M,NC,96.3,Open,100,,,,,,102.5,142.5,155,155,,,,,,,155,B,Raw,6
Kyle Farmer,26,M,KY,96.57,Open,100,,,,,,135,145,,145,,,,,,,145,B,Raw,7
Josh Cue,34,M,NC,98.16,Open,100,,,,,,130,135,-140,135,,,,,,,135,B,Raw,8
Oronde Moore,42,M,CT,96.62,Open,100,,,,,,107.5,115,-120,115,,,,,,,115,B,Raw,9
David Zavadil,54,M,VA,93.89,Open,100,,,,,,80,-90,-90,80,,,,,,,80,B,Raw,10
Austin Oliver,19,M,NC,92.58,Teen 18-19,100,,,,,,-142.5,145,-150,145,,,,,,,145,B,Raw,1
Demetrius Blowe,43,M,NC,96.3,Masters 40-44,100,,,,,,102.5,142.5,155,155,,,,,,,155,B,Raw,1
Ray Matusko,52,M,NC,96.98,Masters 50-54,100,,,,,,152.5,165,170,170,,,,,,,170,B,Raw,1
Tom Reumont,53,M,MD,99.43,Masters 50-54,100,,,,,,160,-167.5,-167.5,160,,,,,,,160,B,Raw,2
Dan French,54,M,KY,96.66,Masters 50-54,100,,,,,,125,132.5,145,145,,,,,,,145,B,Raw,3
David Zavadil,54,M,VA,93.89,Masters 50-54,100,,,,,,80,-90,-90,80,,,,,,,80,B,Raw,4
Ken Thunberg,,M,CA,95.12,Masters 55-59,100,,,,,,165,175,182.5,182.5,185,,,,,,182.5,B,Raw,1
Craig Perry,65,M,KY,98.07,Masters 65-69,100,,,,,,160,165,170,170,,,,,,,170,B,Raw,1
Chris Walter,46,M,NE,100.43,Open,110,,,,,,195,200,205,205,,,,,,,205,B,Raw,1
Gerren Short,41,M,VA,109.77,Open,110,,,,,,,,180,180,,,,,,,180,B,Raw,2
Nathan Tong,32,M,VA,107.14,Open,110,,,,,,163,172.5,177.5,177.5,,,,,,,177.5,B,Raw,3
Jesse Johnson #2,42,M,CT,105.23,Open,110,,,,,,145,-150,150,150,,,,,,,150,B,Raw,4
Thomas Black,29,M,KY,107.27,Open,110,,,,,,145,,,145,,,,,,,145,B,Raw,5
Jamal Phillips,30,M,NY,107.41,Open,110,,,,,,115,125,137.5,137.5,,,,,,,137.5,B,Raw,6
Tommy Faryniarz,18,M,CT,102.51,Open,110,,,,,,125,127.5,-137.5,127.5,,,,,,,127.5,B,Raw,7
Collin Jennings,16,M,NC,104.05,Open,110,,,,,,-100,107.5,-112.5,107.5,,,,,,,107.5,B,Raw,8
Joseph Williams,69,M,VA,103.28,Open,110,,,,,,-80,-85,-85,,,,,,,,,B,Raw,DQ
Shawn Shepherd,41,M,IN,107.95,Open,110,,,,,,,,,,,,,,,,,B,Raw,DQ
Collin Jennings,16,M,NC,104.05,Teen 16-17,110,,,,,,-100,107.5,-112.5,107.5,,,,,,,107.5,B,Raw,1
Tommy Faryniarz,18,M,CT,102.51,Teen 18-19,110,,,,,,125,127.5,-137.5,127.5,,,,,,,127.5,B,Raw,1
Gerren Short,41,M,VA,109.77,Masters 40-44,110,,,,,,,,180,180,,,,,,,180,B,Raw,1
Jesse Johnson #2,42,M,CT,105.23,Masters 40-44,110,,,,,,145,-150,150,150,,,,,,,150,B,Raw,2
Shawn Shepherd,41,M,IN,107.95,Masters 40-44,110,,,,,,,,,,,,,,,,,B,Raw,DQ
Chris Walter,46,M,NE,100.43,Masters 45-49,110,,,,,,195,200,205,205,,,,,,,205,B,Raw,1
Lance Grush,48,M,NE,108.5,Masters 45-49,110,,,,,,165,170,175,175,,,,,,,175,B,Raw,2
Phil Roehner,51,M,MI,106.78,Masters 50-54,110,,,,,,125,137.5,,137.5,,,,,,,137.5,B,Raw,1
Joseph Rascoe,56,M,NC,105.1,Masters 55-59,110,,,,,,165,177.5,-180,177.5,,,,,,,177.5,B,Raw,1
John Probasco,56,M,NE,104.51,Masters 55-59,110,,,,,,,,147.5,147.5,,,,,,,147.5,B,Raw,2
Joseph Williams,69,M,VA,103.28,Masters 65-69,110,,,,,,-80,-85,-85,,,,,,,,,B,Raw,DQ
Bernie Rhodes,69,M,VA,108.77,Masters 65-69,110,,,,,,-110,-117.5,-117.5,,,,,,,,,B,Raw,DQ
Nathan Tong,32,M,VA,107.14,Law/Fire/Military,110,,,,,,163,172.5,177.5,177.5,,,,,,,177.5,B,Raw,1
Jesse Johnson #2,42,M,CT,105.23,Law/Fire/Military,110,,,,,,145,-150,150,150,,,,,,,150,B,Raw,2
Jeff Yoder,45,M,NE,124.74,Open,125,,,,,,192.5,200,207.5,207.5,,,,,,,207.5,B,Raw,1
Robert Dillingham,37,M,VA,119.25,Open,125,,,,,,,,185,185,,,,,,,185,B,Raw,2
Shawn Fante,33,M,KY,112.67,Open,125,,,,,,162.5,,175,175,,,,,,,175,B,Raw,3
Earl Smiley,60,M,KY,120.79,Open,125,,,,,,152.5,165,170,170,,,,,,,170,B,Raw,4
Chris Fawbush,32,M,KY,124.38,Open,125,,,,,,165,,,165,,,,,,,165,B,Raw,5
Taylor Matthews,30,M,NC,122.97,Open,125,,,,,,150,160,-167.5,160,,,,,,,160,B,Raw,6
Austin Poff,24,M,NC,123.38,Open,125,,,,,,135,140,-145,140,,,,,,,140,B,Raw,7
Jaylen Owens,17,M,NC,114.99,Open,125,,,,,,100,107.5,117.5,117.5,,,,,,,117.5,B,Raw,8
Jaylen Owens,17,M,NC,114.99,Teen 16-17,125,,,,,,100,107.5,117.5,117.5,,,,,,,117.5,B,Raw,1
Zach Latting,16,M,NY,118.89,Teen 16-17,125,,,,,,-110,-110,110,110,,,,,,,110,B,Raw,2
Austin Poff,24,M,NC,123.38,Juniors 20-24,125,,,,,,135,140,-145,140,,,,,,,140,B,Raw,1
Robert Dillingham,37,M,VA,119.25,Submasters 35-39,125,,,,,,,,185,185,,,,,,,185,B,Raw,1
Jeff Yoder,45,M,NE,124.74,Masters 45-49,125,,,,,,192.5,200,207.5,207.5,,,,,,,207.5,B,Raw,1
Earl Smiley,60,M,KY,120.79,Masters 60-64,125,,,,,,152.5,165,170,170,,,,,,,170,B,Raw,1
Milo Mazurick,61,M,CT,114.31,Masters 60-64,125,,,,,,-90,97.5,100,100,,,,,,,100,B,Raw,2
Andrew Polzella,31,M,CT,116.12,Law/Fire/Military,125,,,,,,120,122.5,-127.5,122.5,,,,,,,122.5,B,Raw,1
Daniel Corridean,42,M,NC,132.99,Open,140,,,,,,165,177.5,-182.5,177.5,,,,,,,177.5,B,Raw,1
Nathan Daniels,25,M,NC,136.98,Open,140,,,,,,150,155,-160,155,,,,,,,155,B,Raw,2
Skyler Yoder,18,M,NE,139.25,Teen 18-19,140,,,,,,155,162.5,,162.5,,,,,,,162.5,B,Raw,1
Daniel Corridean,42,M,NC,132.99,Masters 40-44,140,,,,,,165,177.5,-182.5,177.5,,,,,,,177.5,B,Raw,1
George Neal,65,M,MD,136.53,Masters 65-69,140,,,,,,137.5,140,142.5,142.5,,,,,,,142.5,B,Raw,1
Pedro Mejias,39,M,NY,202.48,Open,140+,,,,,,270,-277.5,-277.5,270,,,,,,,270,B,Raw,1
Wyatt Lozano,,M,NY,176.45,Open,140+,,,,,,212.5,-227.5,-227.5,212.5,,,,,,,212.5,B,Raw,2
Terry Cox,52,M,IL,141.66,Open,140+,,,,,,192.5,202.5,205,205,,,,,,,205,B,Raw,3
Marvin Bishop,41,M,OH,193.96,Open,140+,,,,,,197.5,202.5,,202.5,,,,,,,202.5,B,Raw,4
Robert Gains,55,M,VA,140.39,Open,140+,,,,,,,,197.5,197.5,,,,,,,197.5,B,Raw,5
Pedro Mejias,39,M,NY,202.48,Submasters 35-39,140+,,,,,,270,-277.5,-277.5,270,,,,,,,270,B,Raw,1
Marvin Bishop,41,M,OH,193.96,Masters 40-44,140+,,,,,,197.5,202.5,,202.5,,,,,,,202.5,B,Raw,1
Terry Cox,52,M,IL,141.66,Masters 50-54,140+,,,,,,192.5,202.5,205,205,,,,,,,205,B,Raw,1
Robert Gains,55,M,VA,140.39,Masters 55-59,140+,,,,,,,,197.5,197.5,,,,,,,197.5,B,Raw,1
Sofia Corridean,5,F,NC,20.87,Youth,44,,,,,,,,,,,25,32.5,42.5,42.5,,42.5,D,Raw,1
Brooke Zak,12,F,NC,42.59,Teen 12-13,44,,,,,,,,,,,60,72.5,77.5,77.5,,77.5,D,Raw,1
Jennifer Waldron,45,F,KY,50.48,Open,52,,,,,,,,,,,,,117.5,117.5,,117.5,D,Raw,1
Jennifer Waldron,45,F,KY,50.48,Masters 45-49,52,,,,,,,,,,,,,117.5,117.5,,117.5,D,Raw,1
Anna Zak,15,F,NC,54.07,Open,56,,,,,,,,,,,65,85,92.5,92.5,,92.5,D,Raw,1
Cindy Weindorf,,F,PA,56.7,Open,60,,,,,,,,,,,95,105,110,110,,110,D,Raw,1
Kimberly Capers,39,F,MD,59.96,Submasters 35-39,60,,,,,,,,,,,125,-132.5,-132.5,125,,125,D,Raw,1
Tricia Floyd,37,F,VA,64.73,Open,67.5,,,,,,,,,,,,,190,190,,190,D,Raw,1
Lori Bailey,47,F,NC,66.68,Open,67.5,,,,,,,,,,,125,137.5,147.5,147.5,,147.5,D,Raw,2
LaKeisha Kanen,43,F,NC,63.96,Open,67.5,,,,,,,,,,,120,137.5,142.5,142.5,,142.5,D,Raw,3
Nikki Dorval,36,F,CT,62.6,Open,67.5,,,,,,,,,,,112.5,127.5,-137.5,127.5,,127.5,D,Raw,4
Kaja Ferebee,17,F,NC,67.09,Open,67.5,,,,,,,,,,,102.5,110,-127.5,110,,110,D,Raw,5
Corinne Deem,15,F,NC,61.37,Open,67.5,,,,,,,,,,,90,100,105,105,,105,D,Raw,6
Corinne Deem,15,F,NC,61.37,Teen 14-15,67.5,,,,,,,,,,,90,100,105,105,,105,D,Raw,1
Alexandra Hugi,,F,NY,63.19,Teen 14-15,67.5,,,,,,,,,,,-65,67.5,75,75,,75,D,Raw,2
Isabella Devito,,F,AZ,62.28,Teen 14-15,67.5,,,,,,,,,,,52.5,57.5,65,65,,65,D,Raw,3
Kaja Ferebee,17,F,NC,67.09,Teen 16-17,67.5,,,,,,,,,,,102.5,110,-127.5,110,,110,D,Raw,1
Hannah Haskell,,F,NY,66.18,Teen 18-19,67.5,,,,,,,,,,,110,120,137.5,137.5,,137.5,D,Raw,1
Tricia Floyd,37,F,VA,64.73,Submasters 35-39,67.5,,,,,,,,,,,,,190,190,,190,D,Raw,1
Nikki Dorval,36,F,CT,62.6,Submasters 35-39,67.5,,,,,,,,,,,112.5,127.5,-137.5,127.5,,127.5,D,Raw,2
LaKeisha Kanen,43,F,NC,63.96,Masters 40-44,67.5,,,,,,,,,,,120,137.5,142.5,142.5,,142.5,D,Raw,1
Daron Gawronski,53,F,CT,62.82,Masters 50-54,67.5,,,,,,,,,,,82.5,87.5,92.5,92.5,,92.5,D,Raw,1
Suzanne LaForge,58,F,FL,66.18,Masters 55-59,67.5,,,,,,,,,,,170,185,,185,,185,D,Raw,1
Jennifer Tillett,50,F,NC,71.67,Open,75,,,,,,,,,,,-130,130,-132.5,130,,130,D,Raw,1
Michelle Hutt,47,F,NC,72.26,Open,75,,,,,,,,,,,82.5,85,87.5,87.5,,87.5,D,Raw,2
Mary Ross,11,F,VA,71.3,Youth,75,,,,,,,,,,,,,85,85,,85,D,Raw,1
Lily Stoddard,,F,NY,70.31,Teen 12-13,75,,,,,,,,,,,85,100,113,113,,112.5,D,Raw,1
Michelle Woods,45,F,VA,70.08,Masters 45-49,75,,,,,,,,,,,100,115,125,125,,125,D,Raw,1
Michelle Hutt,47,F,NC,72.26,Masters 45-49,75,,,,,,,,,,,82.5,85,87.5,87.5,,87.5,D,Raw,2
Jennifer Tillett,50,F,NC,71.67,Masters 50-54,75,,,,,,,,,,,-130,130,-132.5,130,,130,D,Raw,1
Kim Doutt,,F,PA,72.89,Masters 55-59,75,,,,,,,,,,,95,97.5,100,100,,100,D,Raw,1
Riki Napiorkowski,30,F,NY,86.77,Open,90,,,,,,,,,,,175,190,-200,190,,190,D,Raw,1
Reyna Florentino,30,F,NY,89.4,Open,90,,,,,,,,,,,150,165,175,175,,175,D,Raw,2
Christina Santora,48,F,CT,89.81,Open,90,,,,,,,,,,,85,92.5,97.5,97.5,,97.5,D,Raw,3
Christina Santora,48,F,CT,89.81,Masters 45-49,90,,,,,,,,,,,85,92.5,97.5,97.5,,97.5,D,Raw,1
Shannon Scott,34,F,NC,122.97,Open,90+,,,,,,,,,,,150,165,-182.5,165,,165,D,Raw,1
Sarah Heminger,40,F,MA,106.5,Masters 40-44,90+,,,,,,,,,,,152.5,167.5,182.5,182.5,,182.5,D,Raw,1
Kristen Ross,42,F,VA,107.46,Masters 40-44,90+,,,,,,,,,,,,,152.5,152.5,,152.5,D,Raw,2
Meredith Gunning,41,F,NY,130.23,Masters 40-44,90+,,,,,,,,,,,122.5,130,132.5,132.5,,132.5,D,Raw,3
Cody Colondrillo,11,M,PA,30.66,Youth,48,,,,,,,,,,,45,50,55,55,,55,D,Raw,1
John Ammons,19,M,NC,55.97,Open,56,,,,,,,,,,,137.5,147.5,152.5,152.5,,152.5,D,Raw,1
John Ammons,19,M,NC,55.97,Teen 18-19,56,,,,,,,,,,,137.5,147.5,152.5,152.5,,152.5,D,Raw,1
Sergio Lara,14,M,NC,59.28,Open,60,,,,,,,,,,,120,125,132.5,132.5,,132.5,D,Raw,1
Sergio Lara,14,M,NC,59.28,Teen 14-15,60,,,,,,,,,,,120,125,132.5,132.5,,132.5,D,Raw,1
Marcus Khorsand,23,M,NC,67.27,Open,67.5,,,,,,,,,,,210,217.5,220,220,,220,D,Raw,1
Ben Zak,48,M,NC,67,Open,67.5,,,,,,,,,,,150,160,,160,,160,D,Raw,2
Ian Bailey,18,M,NC,67.36,Open,67.5,,,,,,,,,,,142.5,-170,-170,142.5,,142.5,D,Raw,3
Carson Kato,14,M,NC,64.95,Open,67.5,,,,,,,,,,,120,132.5,137.5,137.5,,137.5,D,Raw,4
Carson Kato,14,M,NC,64.95,Teen 14-15,67.5,,,,,,,,,,,120,132.5,137.5,137.5,,137.5,D,Raw,1
Dylan Vazquez,14,M,CT,62.37,Teen 14-15,67.5,,,,,,,,,,,80,85,92.5,92.5,,92.5,D,Raw,2
Ian Bailey,18,M,NC,67.36,Teen 18-19,67.5,,,,,,,,,,,142.5,-170,-170,142.5,,142.5,D,Raw,1
Marcus Khorsand,23,M,NC,67.27,Juniors 20-24,67.5,,,,,,,,,,,210,217.5,220,220,,220,D,Raw,1
Ben Zak,48,M,NC,67,Masters 45-49,67.5,,,,,,,,,,,150,160,,160,,160,D,Raw,1
Marcus Khorsand,23,M,NC,67.27,Law/Fire/Military,67.5,,,,,,,,,,,210,217.5,220,220,,220,D,Raw,1
Andrew Long,29,M,NY,73.8,Open,75,,,,,,,,,,,220,230,235,235,,235,D,Raw,1
Mark Dutton,16,M,NC,74.16,Open,75,,,,,,,,,,,210,-227.5,-227.5,210,,210,D,Raw,2
Chris Schaeuble,34,M,CT,73.71,Open,75,,,,,,,,,,,142.5,152.5,-160,152.5,,152.5,D,Raw,3
Josh Baker,36,M,AZ,74.25,Open,75,,,,,,,,,,,125,140,145,145,,145,D,Raw,4
Colin Majeski,14,M,CT,74.84,Teen 14-15,75,,,,,,,,,,,125,137.5,-142.5,137.5,,137.5,D,Raw,1
Mark Dutton,16,M,NC,74.16,Teen 16-17,75,,,,,,,,,,,210,-227.5,-227.5,210,,210,D,Raw,1
William Devito,,M,AZ,72.03,Masters 45-49,75,,,,,,,,,,,130,142.5,150,150,,150,D,Raw,1
Michael Aranda,,M,AZ,71.53,Masters 50-54,75,,,,,,,,,,,80,82.5,85,85,,85,D,Raw,1
Joe Weissenburger,,M,AZ,74.93,Masters 80+,75,,,,,,,,,,,60,,,60,,60,D,Raw,1
Kareem McMurrin,34,M,NC,77.79,Open,82.5,,,,,,,,,,,215,227.5,-232.5,227.5,,227.5,D,Raw,1
Jayden Calloway,15,M,NC,82.05,Open,82.5,,,,,,,,,,,182.5,205,215,215,227.5,215,D,Raw,2
Jayden Calloway,15,M,NC,82.05,Teen 14-15,82.5,,,,,,,,,,,182.5,205,215,215,227.5,215,D,Raw,1
Nicholas Holmes,,M,MD,80.65,Teen 14-15,82.5,,,,,,,,,,,135,165,-180,165,,165,D,Raw,2
Larry Emerson,70,M,MA,80.92,Masters 70-74,82.5,,,,,,,,,,,205,215,-218,215,,215,D,Raw,1
Pete Miller,75,M,VA,80.92,Masters 75-79,82.5,,,,,,,,,,,,,142.5,142.5,,142.5,D,Raw,1
Aaron Pickrell,49,M,NC,89.27,Open,90,,,,,,,,,,,210,230,252.5,252.5,,252.5,D,Raw,1
Tim Earl,,M,AZ,88.09,Open,90,,,,,,,,,,,237.5,,,237.5,,237.5,D,Raw,2
Aaron Kanute,34,M,CT,87.09,Open,90,,,,,,,,,,,200,212.5,-222.5,212.5,,212.5,D,Raw,3
Anthony Bannerman,47,M,NC,84.28,Open,90,,,,,,,,,,,-184,191.5,195,195,,195,D,Raw,4
Calvin Brown,33,M,NY,83.05,Open,90,,,,,,,,,,,170,185,190,190,,190,D,Raw,5
Aaron Bicknell,47,M,CT,89.36,Open,90,,,,,,,,,,,165,172.5,-175,172.5,,172.5,D,Raw,6
Seth Francis,17,M,NC,89.86,Open,90,,,,,,,,,,,-227.5,,-245,,,,D,Raw,DQ
Seth Francis,17,M,NC,89.86,Teen 16-17,90,,,,,,,,,,,-227.5,,-245,,,,D,Raw,DQ
Tim Earl,,M,AZ,88.09,Juniors 20-24,90,,,,,,,,,,,237.5,,,237.5,,237.5,D,Raw,1
Chris Colondrillo,44,M,PA,88.81,Masters 40-44,90,,,,,,,,,,,205,217.5,-227.5,217.5,,217.5,D,Raw,1
Aaron Pickrell,49,M,NC,89.27,Masters 45-49,90,,,,,,,,,,,210,230,252.5,252.5,,252.5,D,Raw,1
Anthony Bannerman,47,M,NC,84.28,Masters 45-49,90,,,,,,,,,,,-184,191.5,195,195,,195,D,Raw,2
Aaron Bicknell,47,M,CT,89.36,Masters 45-49,90,,,,,,,,,,,165,172.5,-175,172.5,,172.5,D,Raw,3
Jules Lloyd,72,M,CT,84.59,Masters 70-74,90,,,,,,,,,,,102.5,110,120,120,,120,D,Raw,1
Josh Cue,34,M,NC,98.16,Open,100,,,,,,,,,,,222,235,242.5,242.5,,242.5,D,Raw,1
Ryan Davis,,M,NY,97.89,Open,100,,,,,,,,,,,175,182.5,192.5,192.5,,192.5,D,Raw,2
David Zavadil,54,M,VA,93.89,Open,100,,,,,,,,,,,170,190,-220,190,,190,D,Raw,3
Joshua Smith,21,M,KY,98.11,Juniors 20-24,100,,,,,,,,,,,267.5,,282.5,282.5,,282.5,D,Raw,1
David Zavadil,54,M,VA,93.89,Masters 50-54,100,,,,,,,,,,,170,190,-220,190,,190,D,Raw,1
John Niedzwick,69,M,VA,96.25,Masters 65-69,100,,,,,,,,,,,,,190,190,,190,D,Raw,1
Tommy Faryniarz,18,M,CT,102.51,Open,110,,,,,,,,,,,182.5,200,-215,200,,200,D,Raw,1
Collin Jennings,16,M,NC,104.05,Open,110,,,,,,,,,,,182.5,192.5,-200,192.5,,192.5,D,Raw,2
Joseph Williams,69,M,VA,103.28,Open,110,,,,,,,,,,,125,130,142.5,142.5,,142.5,D,Raw,3
Collin Jennings,16,M,NC,104.05,Teen 16-17,110,,,,,,,,,,,182.5,192.5,-200,192.5,,192.5,D,Raw,1
Tommy Faryniarz,18,M,CT,102.51,Teen 18-19,110,,,,,,,,,,,182.5,200,-215,200,,200,D,Raw,1
Stanley Hunter,41,M,NY,107.82,Masters 40-44,110,,,,,,,,,,,220,235,-240,235,,235,D,Raw,1
Tim Durrett,44,M,VA,106.55,Masters 40-44,110,,,,,,,,,,,,,220,220,,220,D,Raw,2
Gerren Short,41,M,VA,109.77,Masters 40-44,110,,,,,,,,,,,,,200,200,,200,D,Raw,3
Jeff Willson,51,M,CT,104.78,Masters 50-54,110,,,,,,,,,,,142.5,152.5,157.5,157.5,,157.5,D,Raw,1
Joseph Williams,69,M,VA,103.28,Masters 65-69,110,,,,,,,,,,,125,130,142.5,142.5,,142.5,D,Raw,1
Austin Poff,24,M,NC,123.38,Open,125,,,,,,,,,,,255,272.5,282.5,282.5,,282.5,D,Raw,1
Daryl Matzke,,M,NY,124.01,Open,125,,,,,,,,,,,220,230,240,240,,240,D,Raw,2
Jaylen Owens,17,M,NC,114.99,Open,125,,,,,,,,,,,210,220,227.5,227.5,,227.5,D,Raw,3
Zach Latting,16,M,NY,118.89,Teen 16-17,125,,,,,,,,,,,200,210,232.5,232.5,,232.5,D,Raw,1
Jaylen Owens,17,M,NC,114.99,Teen 16-17,125,,,,,,,,,,,210,220,227.5,227.5,,227.5,D,Raw,2
Austin Poff,24,M,NC,123.38,Juniors 20-24,125,,,,,,,,,,,255,272.5,282.5,282.5,,282.5,D,Raw,1
Ty Evans #1,36,M,FL,115.21,Submasters 35-39,125,,,,,,,,,,,287.5,-330,330,330,,330,D,Raw,1
Todd King,52,M,NC,113.26,Masters 50-54,125,,,,,,,,,,,200,212.5,222.5,222.5,,222.5,D,Raw,1
Milo Mazurick,61,M,CT,114.31,Masters 60-64,125,,,,,,,,,,,157.5,167.5,175,175,,175,D,Raw,1
Daniel Corridean,42,M,NC,132.99,Open,140,,,,,,,,,,,275,295,-305,295,,295,D,Raw,1
Baron Dixon,52,M,VA,139.25,Open,140,,,,,,,,,,,,,265,265,,265,D,Raw,2
Nathan Daniels,25,M,NC,136.98,Open,140,,,,,,,,,,,220,227.5,-235,227.5,,227.5,D,Raw,3
Daniel Corridean,42,M,NC,132.99,Masters 40-44,140,,,,,,,,,,,275,295,-305,295,,295,D,Raw,1
Baron Dixon,52,M,VA,139.25,Masters 50-54,140,,,,,,,,,,,,,265,265,,265,D,Raw,1
George Neal,65,M,MD,136.53,Masters 65-69,140,,,,,,,,,,,210,212.5,-215,212.5,,212.5,D,Raw,1
Bob Shirley,65,M,VA,135.4,Masters 65-69,140,,,,,,,,,,,,,205,205,,205,D,Raw,2
