Division,WeightClassKg,Place,Name,Team,BodyweightKg,Best3SquatKg,Best3BenchKg,Best3DeadliftKg,TotalKg,Equipment,Event,Sex
Boys,51.71,1,Charlie Rosa,Karnes City,51.26,138.35,74.84,156.49,369.68,Single-ply,SBD,M
Boys,51.71,2,Benny Lara,Victoria West,50.8,140.61,65.77,131.54,337.93,Single-ply,SBD,M
Boys,51.71,3,Aspen Whitstine,Port Lavaca Calhoun,51.71,117.93,68.04,133.81,319.78,Single-ply,SBD,M
Boys,51.71,4,Jacob Villareal,Gonzales,51.17,131.54,52.16,129.27,312.98,Single-ply,SBD,M
Boys,51.71,5,Kyle Bailey,Karnes City,51.62,124.74,65.77,113.4,303.91,Single-ply,SBD,M
Boys,51.71,6,JT Bryce,George West,49.9,90.72,45.36,99.79,235.87,Single-ply,SBD,M
Boys,51.71,DQ,Tj Shands,Lenorah Grady,49.9,,,,,Single-ply,SBD,M
Boys,55.79,1,Jesus Rios,Palacios,54.43,151.95,122.47,197.31,471.74,Single-ply,SBD,M
Boys,55.79,2,Moc Moo,Port Lavaca Calhoun,55.79,176.9,102.06,161.03,439.98,Single-ply,SBD,M
Boys,55.79,3,Hunter Long,San Antonio Brooks Academy,54.43,117.93,70.31,145.15,333.39,Single-ply,SBD,M
Boys,55.79,4,Samuel Moczygemba,Poth,53.25,92.99,63.5,115.67,272.16,Single-ply,SBD,M
Boys,55.79,5,Bailey Parrett,Yorktown,53.52,102.06,65.77,102.06,269.89,Single-ply,SBD,M
Boys,55.79,6,Javier Camacho,Weimar,52.98,81.65,47.63,95.25,224.53,Single-ply,SBD,M
Boys,59.87,1,Jarrett Burford,Port Lavaca Calhoun,59.6,208.65,127.01,208.65,544.31,Single-ply,SBD,M
Boys,59.87,2,Victor Monsevias,Kenedy,59.87,181.44,83.91,172.37,437.72,Single-ply,SBD,M
Boys,59.87,3,Tyler Le,Palacios,56.7,151.95,77.11,174.63,403.7,Single-ply,SBD,M
Boys,59.87,4,Tyrese Martinez,Stockdale,56.34,142.88,81.65,165.56,390.09,Single-ply,SBD,M
Boys,59.87,5,Wesley Lover,Karnes City,57.79,138.35,90.72,158.76,387.82,Single-ply,SBD,M
Boys,59.87,6,Cy Strieber,Yorktown,59.42,142.88,81.65,161.03,385.55,Single-ply,SBD,M
Boys,59.87,7,Zach Fuchs,Cuero,58.97,117.93,74.84,124.74,317.51,Single-ply,SBD,M
Boys,59.87,8,Johnny Reger,Poth,59.42,106.59,54.43,124.74,285.76,Single-ply,SBD,M
Boys,59.87,9,Diego Martinez,Stockdale,59.42,83.91,74.84,120.2,278.96,Single-ply,SBD,M
Boys,67.13,1,Beau Burns,Victoria West,67.04,190.51,111.13,185.97,487.61,Single-ply,SBD,M
Boys,67.13,2,Alex Ortiz #3,Gonzales,65.68,174.63,104.33,163.29,442.25,Single-ply,SBD,M
Boys,67.13,3,Eric Callaway,Victoria West,66.86,165.56,104.33,172.37,442.25,Single-ply,SBD,M
Boys,67.13,4,Abraham Ruiz,Victoria East,66.68,165.56,108.86,149.69,424.11,Single-ply,SBD,M
Boys,67.13,5,Rigo Franco,Poth,60.51,147.42,99.79,158.76,405.97,Single-ply,SBD,M
Boys,67.13,6,Trey Green,Victoria West,66.95,147.42,90.72,165.56,403.7,Single-ply,SBD,M
Boys,67.13,7,Tom Palacio,Nixon Smiley,61.23,133.81,97.52,165.56,396.89,Single-ply,SBD,M
Boys,67.13,8,Brent Gisler,Karnes City,66.41,147.42,86.18,147.42,381.02,Single-ply,SBD,M
Boys,67.13,9,Marcos Almeida,Stockdale,65.68,133.81,86.18,142.88,362.87,Single-ply,SBD,M
Boys,67.13,10,Brandon Garcia,Nixon Smiley,67.13,122.47,83.91,129.27,335.66,Single-ply,SBD,M
Boys,67.13,11,Jeremiah Good,Yorktown,67.13,131.54,68.04,131.54,331.12,Single-ply,SBD,M
Boys,67.13,12,Eran Krause,Yorktown,61.23,113.4,61.23,136.08,310.71,Single-ply,SBD,M
Boys,67.13,13,Garrett Darr,Poth,61.69,102.06,81.65,111.13,294.84,Single-ply,SBD,M
Boys,67.13,14,Joseph Garza,Port Lavaca Calhoun,65.77,199.58,90.72,,290.3,Single-ply,SB,M
Boys,67.13,15,Fabian Torres,Nixon Smiley,60.33,111.13,54.43,113.4,278.96,Single-ply,SBD,M
Boys,67.13,16,Noe Lopez,Nixon Smiley,66.68,108.86,61.23,106.59,276.69,Single-ply,SBD,M
Boys,67.13,17,Dylan Hernandez,Runge,63.05,83.91,58.97,102.06,244.94,Single-ply,SBD,M
Boys,67.13,18,Gareson Conkel,Stockdale,66.32,92.99,47.63,92.99,233.6,Single-ply,SBD,M
Boys,67.13,19,Nathan Besch,Weimar,66.22,158.76,,,158.76,Single-ply,S,M
Boys,74.84,20,Corban Ramos,Victoria East,67.36,138.35,,,138.35,Single-ply,S,M
Boys,67.13,21,Eli Ramirez,Runge,63.78,83.91,,,83.91,Single-ply,S,M
Boys,67.13,DQ,Triston Barefield,Cuero,66.68,,,,,Single-ply,S,M
Boys,67.13,DQ,Travis Puhlmann,La Vernia,66.68,,,,,Single-ply,S,M
Boys,74.84,1,Abraham Ramirez #2,Cuero,73.48,195.04,136.08,199.58,530.7,Single-ply,SBD,M
Boys,74.84,2,Hunter Dollery,Victoria West,74.39,197.31,115.67,204.12,517.1,Single-ply,SBD,M
Boys,74.84,3,Jardan Ramierez,Kenedy,68.95,176.9,106.59,215.46,498.95,Single-ply,SBD,M
Boys,82.1,4,Blake Galvan,Odem,74.93,183.7,113.4,201.85,498.95,Single-ply,SBD,M
Boys,74.84,5,Dante Pizana,Odem,74.03,183.7,129.27,181.44,494.42,Single-ply,SBD,M
Boys,74.84,6,Chayce Grevey,Victoria West,74.48,185.97,115.67,190.51,492.15,Single-ply,SBD,M
Boys,74.84,7,Davantee Herron,Victoria East,73.48,176.9,106.59,195.04,478.54,Single-ply,SBD,M
Boys,74.84,8,Aj Carter,Victoria West,72.39,176.9,104.33,183.7,464.93,Single-ply,SBD,M
Boys,74.84,9,Jose Cumpean,Port Lavaca Calhoun,67.59,179.17,108.86,158.76,446.79,Single-ply,SBD,M
Boys,74.84,10,Justin Alexander,Universal City Randolph,69.4,151.95,106.59,181.44,439.98,Single-ply,SBD,M
Boys,74.84,11,Miguel Rivera,Universal City Randolph,71.94,147.42,97.52,183.7,428.64,Single-ply,SBD,M
Boys,74.84,12,Larry Falcon,Poth,74.84,170.1,102.06,145.15,417.3,Single-ply,SBD,M
Boys,74.84,13,Jacob Gonzalez,Karnes City,74.03,151.95,97.52,158.76,408.23,Single-ply,SBD,M
Boys,74.84,14,Noah Rodriguez,Kenedy,71.67,136.08,95.25,174.63,405.97,Single-ply,SBD,M
Boys,74.84,15,Morgan Segovia,Palacios,70.31,163.29,77.11,163.29,403.7,Single-ply,SBD,M
Boys,74.84,16,Michael Barraza,Refugio,71.21,124.74,83.91,158.76,367.41,Single-ply,SBD,M
Boys,74.84,17,Tony Turrubiartes,Karnes City,72.3,136.08,74.84,156.49,367.41,Single-ply,SBD,M
Boys,74.84,18,Dyllan Maldonado,Nixon Smiley,74.39,127.01,88.45,147.42,362.87,Single-ply,SBD,M
Boys,74.84,19,Eddie Lopez,Universal City Randolph,71.67,127.01,81.65,145.15,353.8,Single-ply,SBD,M
Boys,74.84,20,Manny Salazar,Refugio,73.94,106.59,72.57,163.29,342.46,Single-ply,SBD,M
Boys,74.84,21,Colin Schuetze,Weimar,71.67,117.93,70.31,124.74,312.98,Single-ply,SBD,M
Boys,74.84,22,Tyler Talley,Stockdale,68.04,97.52,77.11,117.93,292.57,Single-ply,SBD,M
Boys,74.84,23,Gilibaldo Garcia,San Antonio Brooks Academy,70.31,104.33,61.23,122.47,288.03,Single-ply,SBD,M
Boys,74.84,24,Isaai Ortega,San Antonio Brooks Academy,72.12,92.99,45.36,106.59,244.94,Single-ply,SBD,M
Boys,74.84,DQ,Elex Martinez,Cuero,69.4,,,,,Single-ply,SBD,M
Boys,82.1,1,Christian Hosley,Universal City Randolph,77.84,217.72,151.95,217.72,587.4,Single-ply,SBD,M
Boys,82.1,2,Danny Rodriguez #2,Palacios,77.11,210.92,117.93,226.8,555.65,Single-ply,SBD,M
Boys,82.1,3,Travis Dibble,Victoria West,81.92,199.58,127.01,222.26,548.85,Single-ply,SBD,M
Boys,82.1,4,Eric Lucio,Louise,78.02,226.8,97.52,217.72,542.04,Single-ply,SBD,M
Boys,82.1,5,Tristan Summy,La Vernia,80.74,192.78,117.93,204.12,514.83,Single-ply,SBD,M
Boys,82.1,6,Anthony McGuill,Refugio,79.83,192.78,108.86,208.65,510.29,Single-ply,SBD,M
Boys,82.1,7,Shavar Richard,Port Lavaca Calhoun,78.02,195.04,104.33,208.65,508.02,Single-ply,SBD,M
Boys,82.1,8,Ken'twuan Freeman,Victoria West,78.38,204.12,108.86,195.04,508.02,Single-ply,SBD,M
Boys,82.1,9,Mitchell Rees,Karnes City,78.47,185.97,102.06,188.24,476.27,Single-ply,SBD,M
Boys,82.1,10,Qashaun Bryant,Victoria East,78.47,185.97,102.06,183.7,471.74,Single-ply,SBD,M
Boys,82.1,11,Xavier Rivera,Port Lavaca Calhoun,79.38,170.1,106.59,192.78,469.47,Single-ply,SBD,M
Boys,82.1,12,Michael Lara,George West,79.83,181.44,102.06,174.63,458.13,Single-ply,SBD,M
Boys,82.1,13,Daniel Guillen,Victoria East,80.29,176.9,97.52,170.1,444.52,Single-ply,SBD,M
Boys,82.1,14,Kyler McBlane,Stockdale,80.29,163.29,95.25,183.7,442.25,Single-ply,SBD,M
Boys,82.1,15,Tony Renfro,Stockdale,75.3,165.56,99.79,172.37,437.72,Single-ply,SBD,M
Boys,82.1,16,Max Avendano,Nixon Smiley,81.65,165.56,90.72,161.03,417.3,Single-ply,SBD,M
Boys,82.1,17,Brock Gonzales,Universal City Randolph,76.2,127.01,81.65,167.83,376.48,Single-ply,SBD,M
Boys,82.1,18,Brian Metting,Yorktown,77.11,120.2,72.57,151.95,344.73,Single-ply,SBD,M
Boys,82.1,19,Kaleb Henning,Refugio,78.93,131.54,83.91,127.01,342.46,Single-ply,SBD,M
Boys,82.1,20,Eric Pena,Cuero,76.2,170.1,88.45,197.31,455.86,Single-ply,SBD,M
Boys,82.1,21,Isaiah Montes,Louise,81.65,117.93,68.04,122.47,308.44,Single-ply,SBD,M
Boys,82.1,22,Jesse Lopez,Port Lavaca Calhoun,76.34,183.7,58.97,,242.67,Single-ply,SB,M
Boys,82.1,23,Wyatt Cowsert,La Vernia,78.02,156.49,,,156.49,Single-ply,S,M
Boys,89.81,1,Dylan Esquivel,Victoria West,88.63,213.19,136.08,240.4,589.67,Single-ply,SBD,M
Boys,89.81,2,Lane McClelland,George West,82.55,226.8,133.81,217.72,578.33,Single-ply,SBD,M
Boys,89.81,3,Jj Figueroa,Palacios,85.28,199.58,99.79,210.92,510.29,Single-ply,SBD,M
Boys,89.81,4,Eric Luck,Victoria East,88.9,192.78,136.08,181.44,510.29,Single-ply,SBD,M
Boys,89.81,5,Andres Moncada,Karnes City,85.73,204.12,108.86,188.24,501.22,Single-ply,SBD,M
Boys,89.81,6,Trent Schauer,Gonzales,86.27,181.44,122.47,195.04,498.95,Single-ply,SBD,M
Boys,89.81,7,Sully Latka,La Vernia,86.18,201.85,102.06,188.24,492.15,Single-ply,SBD,M
Boys,89.81,8,Connor McLaughlin,Stockdale,83.91,174.63,113.4,188.24,476.27,Single-ply,SBD,M
Boys,89.81,9,Miguel Gutierrez,Poth,85.82,165.56,83.91,151.95,401.43,Single-ply,SBD,M
Boys,89.81,10,John Rodriguez,Cuero,89.36,165.56,88.45,140.61,394.63,Single-ply,SBD,M
Boys,89.81,11,Matthew Leal,Runge,82.74,106.59,61.23,129.27,297.1,Single-ply,SBD,M
Boys,89.81,12,Teriq Barron,Louise,84.82,154.22,58.97,,213.19,Single-ply,SB,M
Boys,99.79,1,Bryan London,Universal City Randolph,95.98,231.33,145.15,258.55,635.03,Single-ply,SBD,M
Boys,99.79,2,Michael de la Garza,Victoria West,97.16,231.33,145.15,226.8,603.28,Single-ply,SBD,M
Boys,99.79,3,Bobby Morris,Victoria East,92.53,235.87,127.01,238.14,601.01,Single-ply,SBD,M
Boys,99.79,4,James Johnson,Victoria East,90.26,244.94,115.67,226.8,587.4,Single-ply,SBD,M
Boys,99.79,5,Curtis Nix,Victoria East,94.35,219.99,124.74,238.14,582.87,Single-ply,SBD,M
Boys,99.79,6,Matthew Montgomery,La Vernia,92.99,199.58,136.08,204.12,539.77,Single-ply,SBD,M
Boys,99.79,7,Alex Taylor,Weimar,92.53,195.04,90.72,165.56,451.32,Single-ply,SBD,M
Boys,99.79,8,Miguel Montes,Louise,97.52,183.7,86.18,151.95,421.84,Single-ply,SBD,M
Boys,99.79,9,Kase Clark,Karnes City,91.53,151.95,79.38,181.44,412.77,Single-ply,SBD,M
Boys,99.79,10,Michael Rios,Runge,92.99,154.22,90.72,165.56,410.5,Single-ply,SBD,M
Boys,99.79,11,Josh Garcia,Runge,98.43,156.49,90.72,142.88,390.09,Single-ply,SBD,M
Boys,99.79,12,Colton Irwin,Stockdale,95.07,136.08,92.99,158.76,387.82,Single-ply,SBD,M
Boys,99.79,13,Bailey Trevino,George West,96.71,226.8,124.74,,351.53,Single-ply,SB,M
Boys,99.79,14,Jose Olalde,Nixon Smiley,96.62,154.22,58.97,,213.19,Single-ply,SB,M
Boys,99.79,DQ,Kj Schultz,Yorktown,96.62,,,,,Single-ply,SB,M
Boys,109.77,1,Eddie Garcia,Port Lavaca Calhoun,107.05,292.57,147.42,240.4,680.39,Single-ply,SBD,M
Boys,109.77,2,Devin Tagle,Refugio,106.59,206.38,161.03,204.12,571.53,Single-ply,SBD,M
Boys,109.77,3,Brent Karnowski,Victoria East,105.69,215.46,124.74,215.46,555.65,Single-ply,SBD,M
Boys,109.77,4,Kevin Carpenter,Palacios,109.77,181.44,102.06,226.8,510.29,Single-ply,SBD,M
Boys,109.77,5,Tyler Constatino,La Vernia,108.41,183.7,127.01,192.78,503.49,Single-ply,SBD,M
Boys,109.77,6,Jermiah Cantu,Gonzales,107.95,199.58,120.2,181.44,501.22,Single-ply,SBD,M
Boys,109.77,7,Jose Avalos,Louise,108.86,204.12,108.86,170.1,483.08,Single-ply,SBD,M
Boys,109.77,8,Robert Reyes,Runge,109.32,161.03,104.33,151.95,417.3,Single-ply,SBD,M
Boys,109.77,9,Brandon Nunez,Runge,102.51,124.74,79.38,142.88,347,Single-ply,SBD,M
Boys,109.77,DQ,Regan Billings,Yorktown,104.78,,,,,Single-ply,SBD,M
Boys,109.77,DQ,Zach Beach,La Vernia,109.32,,,,,Single-ply,SBD,M
Boys,124.74,1,Trent Enriquez,Karnes City,119.93,272.16,167.83,249.48,689.46,Single-ply,SBD,M
Boys,124.74,2,Josh Carroll,Stockdale,122.02,238.14,165.56,226.8,630.49,Single-ply,SBD,M
Boys,124.74,3,Connor Towns,La Vernia,116.12,224.53,115.67,233.6,573.79,Single-ply,SBD,M
Boys,124.74,4,Christian Mascorro,Refugio,114.12,217.72,142.88,210.92,571.53,Single-ply,SBD,M
Boys,124.74,5,Andrew Munoz,Cuero,123.38,226.8,124.74,201.85,553.38,Single-ply,SBD,M
Boys,124.74,6,Joshua Leal,Karnes City,111.86,204.12,122.47,213.19,539.77,Single-ply,SBD,M
Boys,124.74,7,Joe Ragusin,Yorktown,113.85,192.78,113.4,197.31,503.49,Single-ply,SBD,M
Boys,124.74,8,Alex Ibarra,La Vernia,119.75,179.17,115.67,204.12,498.95,Single-ply,SBD,M
Boys,124.74,9,Evan Krause,Yorktown,122.47,183.7,108.86,183.7,476.27,Single-ply,SBD,M
Boys,124.74,10,Seth Harris,Kenedy,124.74,161.03,117.93,197.31,476.27,Single-ply,SBD,M
Boys,124.74,11,Justin Broll,Yorktown,114.76,188.24,111.13,172.37,471.74,Single-ply,SBD,M
Boys,124.74,12,Colton Oglesby,Cuero,113.85,174.63,92.99,165.56,433.18,Single-ply,SBD,M
Boys,124.74,13,Rudy Vasquez,Kenedy,110.68,165.56,97.52,158.76,421.84,Single-ply,SBD,M
Boys,124.74,14,Jake Hughes,Yorktown,110.68,131.54,79.38,142.88,353.8,Single-ply,SBD,M
Boys,124.74,15,Dante Medina,Nixon Smiley,114.31,201.85,,,201.85,Single-ply,S,M
Boys,124.74,DQ,Robert Martinez,Louise,122.92,,,,,Single-ply,S,M
Boys,124.74,DQ,Robert Olivarez,La Vernia,115.67,,,,,Single-ply,S,M
Boys,124.74,DQ,Haden Haas,Cuero,120.66,,,,,Single-ply,S,M
Boys,124.74,DQ,Nikko Garza,Weimar,115.21,,,,,Single-ply,S,M
Boys,124.74+,1,James Cooksey,Kenedy,138.8,283.5,156.49,242.67,682.66,Single-ply,SBD,M
Boys,124.74+,2,David Arciniega,Odem,144.15,249.48,142.88,242.67,635.03,Single-ply,SBD,M
Boys,124.74+,3,Jorge Rios,Port Lavaca Calhoun,152.86,233.6,145.15,240.4,619.15,Single-ply,SBD,M
Boys,124.74+,4,James Nino,Weimar,132.9,244.94,136.08,226.8,607.81,Single-ply,SBD,M
Boys,124.74+,5,Michael Diaz,Stockdale,126.1,233.6,147.42,210.92,591.94,Single-ply,SBD,M
Boys,124.74+,6,Cesar Romero,Universal City Randolph,132.45,226.8,117.93,242.67,587.4,Single-ply,SBD,M
Boys,124.74+,7,Malik Brown,Refugio,130.63,151.95,115.67,170.1,437.72,Single-ply,SBD,M
Boys,124.74+,8,Jake Carr,Palacios,131.54,156.49,106.59,151.95,415.04,Single-ply,SBD,M
Boys,124.74+,9,Brandon Winters,Runge,126.55,138.35,61.23,156.49,356.07,Single-ply,SBD,M
Boys,124.74+,DQ,Denzel Joyce,La Vernia,126.1,,,,,Single-ply,SBD,M
Boys,124.74+,DQ,Jacob Perez #2,Cuero,142.43,,,,,Single-ply,SBD,M
Boys,124.74+,DQ,Phillip Tamm,Cuero,132.45,,,,,Single-ply,SBD,M
Boys,,NS,David Lee Zuniga,George West,,,,,,Single-ply,SBD,M
Boys,,NS,Angel Flores #2,Kenedy,,,,,,Single-ply,SBD,M
Boys,,NS,Travis Decker,Gonzales,,,,,,Single-ply,SBD,M
Boys,,NS,Mikel Scarbrough,Nixon Smiley,,,,,,Single-ply,SBD,M
Boys,,NS,Matthew Stringham,Port Lavaca Calhoun,,,,,,Single-ply,SBD,M
Boys,,NS,Saul Rosales,Weimar,,,,,,Single-ply,SBD,M
Boys,,NS,Cody Kuhl,Universal City Randolph,,,,,,Single-ply,SBD,M
Boys,,NS,Alex Gill,Universal City Randolph,,,,,,Single-ply,SBD,M
Boys,,NS,Mike Stokes #2,Universal City Randolph,,,,,,Single-ply,SBD,M
Boys,,NS,Paul Esparza,San Antonio Brooks Academy,,,,,,Single-ply,SBD,M
Boys,,NS,Evan O'Berg,Universal City Randolph,,,,,,Single-ply,SBD,M
