Division,WeightClassKg,Place,Name,Team,BodyweightKg,Best3SquatKg,Best3BenchKg,Best3DeadliftKg,TotalKg,Equipment,Event,Sex
Girls,44.23,1,Julissa Gonzalez,Kyle Lehman,44.18,65.77,43.09,83.91,192.78,Single-ply,SBD,F
Girls,44.23,2,Liz Perkins,Moody,44.18,70.31,34.02,83.91,188.24,Single-ply,SBD,F
Girls,44.23,3,Kelsey White,Georgetown East View,44.23,65.77,38.56,81.65,185.97,Single-ply,SBD,F
Girls,44.23,4,Alisha Johnson,Georgetown,44,40.82,27.22,63.5,131.54,Single-ply,SBD,F
Girls,44.23,DQ,Marisa Chapa,Hutto,44,61.23,29.48,92.99,,Single-ply,SBD,F
Girls,44.23,DQ,Elizabeth Warren,Moody,44,88.45,31.75,88.45,,Single-ply,SBD,F
Girls,47.85,1,LeUyen Do,Georgetown East View,47.63,104.33,56.7,122.47,283.5,Single-ply,SBD,F
Girls,47.85,2,Amanda Hubbard,Moody,47.26,92.99,58.97,115.67,267.62,Single-ply,SBD,F
Girls,47.85,3,Maria Luna,Waco University,46.81,97.52,49.9,86.18,233.6,Single-ply,SBD,F
Girls,47.85,4,Amanda Combatti,Hutto,44.68,72.57,40.82,97.52,210.92,Single-ply,SBD,F
Girls,47.85,5,Shelby Musgrove,Georgetown,46.9,77.11,31.75,88.45,197.31,Single-ply,SBD,F
Girls,47.85,6,Kallie Bartsch,BASTROP Cedar Creek,45.68,70.31,36.29,86.18,192.78,Single-ply,SBD,F
Girls,47.85,7,Alyssa Luna,Hutto,47.85,65.77,27.22,90.72,183.7,Single-ply,SBD,F
Girls,47.85,8,Audrei Garces,Del Valle,46.22,58.97,29.48,74.84,163.29,Single-ply,SBD,F
Girls,51.94,1,Cielo Houston,BASTROP Cedar Creek,51.85,77.11,43.09,111.13,231.33,Single-ply,SBD,F
Girls,51.94,2,Hannah Holmes #2,Hutto,48.94,86.18,36.29,90.72,213.19,Single-ply,SBD,F
Girls,51.94,3,Victoria Smith #2,Kyle Lehman,50.76,83.91,38.56,83.91,206.38,Single-ply,SBD,F
Girls,51.94,4,Esmeralda Flores,Jarrell,51.35,65.77,34.02,79.38,179.17,Single-ply,SBD,F
Girls,51.94,5,Dixi Cordell,Georgetown East View,51.8,49.9,27.22,43.09,120.2,Single-ply,SBD,F
Girls,51.94,DQ,Lauren Flores,Buda Hays,48.85,58.97,38.56,52.16,,Single-ply,SBD,F
Girls,51.94,DQ,Katelyn Tidwell,Buda Hays,51.71,77.11,29.48,77.11,,Single-ply,SBD,F
Girls,56.02,1,Gracie Hough,Buda Hays,55.11,106.59,47.63,131.54,285.76,Single-ply,SBD,F
Girls,56.02,2,Chassie Fisher,Moody,54.2,117.93,47.63,117.93,283.5,Single-ply,SBD,F
Girls,56.02,3,Memory Seale,Buda Hays,54.98,97.52,52.16,115.67,265.35,Single-ply,SBD,F
Girls,56.02,4,Allyson Fawley,Georgetown,54.43,102.06,49.9,104.33,256.28,Single-ply,SBD,F
Girls,56.02,5,Paige Sexton,Del Valle,54.02,79.38,36.29,108.86,224.53,Single-ply,SBD,F
Girls,56.02,6,Hannah Durnell,Austin Lake Travis,54.07,88.45,36.29,90.72,215.46,Single-ply,SBD,F
Girls,60.1,1,Kali Palomarez,Kyle Lehman,57.97,140.61,70.31,133.81,344.73,Single-ply,SBD,F
Girls,60.1,2,Aileen Andrew,Georgetown East View,59.87,117.93,63.5,127.01,308.44,Single-ply,SBD,F
Girls,60.1,3,Diana Cortes,Jarrell,57.52,124.74,56.7,108.86,290.3,Single-ply,SBD,F
Girls,60.1,4,Lexie Parrish,Georgetown,58.79,83.91,40.82,106.59,231.33,Single-ply,SBD,F
Girls,60.1,5,Sarai Saldana,Seguin,57.65,79.38,36.29,102.06,217.72,Single-ply,SBD,F
Girls,60.1,6,Cassidy Arriaga,Seguin,57.79,81.65,43.09,83.91,208.65,Single-ply,SBD,F
Girls,60.1,DQ,Hailey Scott,Hutto,59.87,83.91,40.82,102.06,,Single-ply,SBD,F
Girls,60.1,DQ,Makayla Weber,Del Valle,59.87,34.02,27.22,81.65,,Single-ply,SBD,F
Girls,60.1,DQ,Iris Frias-Ramos,Buda Hays,59.87,90.72,38.56,90.72,,Single-ply,SBD,F
Girls,60.1,DQ,Esmeralda Ornelas,Del Valle,59.87,,,,,Single-ply,SBD,F
Girls,60.1,DQ,Aniaya Fillyaw,Jarrell,59.87,111.13,43.09,111.13,,Single-ply,SBD,F
Girls,60.1,DQ,Jayce Cummings,Moody,59.87,111.13,47.63,111.13,,Single-ply,SBD,F
Girls,60.1,DQ,Emma Foster,Moody,59.87,90.72,47.63,90.72,,Single-ply,SBD,F
Girls,67.36,1,Kirstyne Huggins,Moody,67.36,129.27,61.23,133.81,324.32,Single-ply,SBD,F
Girls,67.36,2,Jamie Shaw,Austin Lake Travis,61.37,124.74,52.16,122.47,299.37,Single-ply,SBD,F
Girls,67.36,3,Stephanie Jiminez,Georgetown East View,61.42,115.67,49.9,117.93,283.5,Single-ply,SBD,F
Girls,67.36,4,Morgan Fitzgerald #1,Buda Hays,65.95,115.67,52.16,111.13,278.96,Single-ply,SBD,F
Girls,67.36,5,Sydney Vanderlinden,Georgetown,65.68,104.33,47.63,113.4,265.35,Single-ply,SBD,F
Girls,67.36,6,Claudia Palomarez,Kyle Lehman,62.87,106.59,43.09,104.33,254.01,Single-ply,SBD,F
Girls,67.36,7,Brenah Reed,Buda Hays,63.5,99.79,43.09,111.13,254.01,Single-ply,SBD,F
Girls,67.36,8,Arianna Reyes,Seguin,65.36,104.33,36.29,111.13,251.74,Single-ply,SBD,F
Girls,67.36,9,Alex Vieira,Jarrell,66.5,88.45,52.16,106.59,247.21,Single-ply,SBD,F
Girls,67.36,10,Maddie Bowen,Kyle Lehman,66.72,90.72,47.63,99.79,238.14,Single-ply,SBD,F
Girls,67.36,11,Angelica Hernandez,Jarrell,62.55,90.72,45.36,90.72,226.8,Single-ply,SBD,F
Girls,67.36,12,Kaylee Spielman,Georgetown East View,63.91,79.38,43.09,102.06,224.53,Single-ply,SBD,F
Girls,67.36,13,Bella Juliano,Hutto,66.63,72.57,43.09,106.59,222.26,Single-ply,SBD,F
Girls,67.36,14,Emily Dasher,Seguin,65.77,86.18,38.56,90.72,215.46,Single-ply,SBD,F
Girls,67.36,15,Cheyenne Cross,Jarrell,60.92,74.84,36.29,68.04,179.17,Single-ply,SBD,F
Girls,67.36,DQ,Dyanna Balderas,Austin Lake Travis,67.13,70.31,34.02,90.72,,Single-ply,SBD,F
Girls,67.36,DQ,Fajardo Rebecca,WACO UNIVERSITY,67.13,72.57,34.02,92.99,,Single-ply,SBD,F
Girls,67.36,DQ,Alissa Womack,Jarrell,67.13,113.4,58.97,113.4,,Single-ply,SBD,F
Girls,75.07,1,Bailey Armstrong,Georgetown,69.49,124.74,61.23,140.61,326.59,Single-ply,SBD,F
Girls,75.07,2,Katie Morrison,BASTROP Cedar Creek,71.8,122.47,56.7,136.08,315.25,Single-ply,SBD,F
Girls,75.07,3,Dezurai Martinez,Jarrell,73.12,106.59,63.5,122.47,292.57,Single-ply,SBD,F
Girls,75.07,4,Amber Garcia,Georgetown East View,68.45,108.86,45.36,129.27,283.5,Single-ply,SBD,F
Girls,75.07,5,Elizabeth Rodriguez,Del Valle,74.25,111.13,54.43,102.06,267.62,Single-ply,SBD,F
Girls,75.07,6,Tierra Green,Seguin,72.17,90.72,43.09,111.13,244.94,Single-ply,SBD,F
Girls,75.07,7,Anais Flores,Seguin,68.4,81.65,43.09,102.06,226.8,Single-ply,SBD,F
Girls,75.07,8,Abby Perlez,Hutto,69.76,81.65,36.29,86.18,204.12,Single-ply,SBD,F
Girls,75.07,DQ,Elizabeth Adair,Hutto,74.84,88.45,31.75,102.06,,Single-ply,SBD,F
Girls,75.07,DQ,Jada Demps,Del Valle,74.84,79.38,36.29,83.91,,Single-ply,SBD,F
Girls,75.07,DQ,Celia Sanchez,Del Valle,74.84,52.16,24.95,52.16,,Single-ply,SBD,F
Girls,75.07,DQ,Hailey Gonzalez,Moody,74.84,104.33,40.82,108.86,,Single-ply,SBD,F
Girls,75.07,DQ,Roxana Gonzalez,Del Valle,74.84,,,,,Single-ply,SBD,F
Girls,75.07,DQ,Biviana Botello,Georgetown East View,74.84,83.91,34.02,83.91,,Single-ply,SBD,F
Girls,82.33,1,Crystal Mendez,Buda Hays,81.47,154.22,63.5,136.08,353.8,Single-ply,SBD,F
Girls,82.33,2,Megan Salmon,Georgetown East View,81.33,113.4,72.57,138.35,324.32,Single-ply,SBD,F
Girls,82.33,3,Lilly Sheldon,Georgetown,81.69,124.74,58.97,124.74,308.44,Single-ply,SBD,F
Girls,82.33,4,Kelsay Underwood,Seguin,78.29,102.06,47.63,113.4,263.08,Single-ply,SBD,F
Girls,82.33,5,Naya Acosta,Del Valle,76.79,95.25,38.56,102.06,235.87,Single-ply,SBD,F
Girls,82.33,6,Vivian Covarrrubias,Kyle Lehman,82.1,90.72,47.63,90.72,229.06,Single-ply,SBD,F
Girls,82.33,7,Madison Collins,Hutto,77.66,79.38,45.36,88.45,213.19,Single-ply,SBD,F
Girls,90.04,1,Beth Bounds,Moody,85.87,163.29,70.31,161.03,394.63,Single-ply,SBD,F
Girls,90.04,2,Gabby Martinez,Kyle Lehman,87.63,142.88,77.11,131.54,351.53,Single-ply,SBD,F
Girls,90.04,3,Yulissa Recio,Moody,89.77,122.47,49.9,115.67,288.03,Single-ply,SBD,F
Girls,90.04,DQ,Kennedy Caldwell,Del Valle,89.81,,,,,Single-ply,SBD,F
Girls,90.04,DQ,Delanie Jackson,Buda Hays,89.81,124.74,47.63,102.06,,Single-ply,SBD,F
Girls,100.02,1,Kessiah Woodland,Georgetown East View,91.22,149.69,86.18,129.27,365.14,Single-ply,SBD,F
Girls,100.02,2,Melysa Alvarez,Kyle Lehman,99.47,154.22,70.31,122.47,347,Single-ply,SBD,F
Girls,100.02,3,Mariah Cavasos,Waco University,91.26,136.08,61.23,142.88,340.19,Single-ply,SBD,F
Girls,100.02,4,Maddison Perry,Moody,95.62,131.54,61.23,136.08,328.85,Single-ply,SBD,F
Girls,100.02,5,Areeona Young,Hutto,93.12,117.93,63.5,129.27,310.71,Single-ply,SBD,F
Girls,100.02,6,Nahiley Santana,Georgetown East View,91.58,117.93,56.7,113.4,288.03,Single-ply,SBD,F
Girls,100.02,DQ,Alexandria Matthews,Del Valle,99.79,,,,,Single-ply,SBD,F
Girls,100.02,DQ,Macy Vasquez,Georgetown,92.76,111.13,52.16,102.06,,Single-ply,SBD,F
Girls,100.02,DQ,Sailor Mayberry,Buda Hays,99.79,124.74,63.5,124.74,,Single-ply,SBD,F
Girls,100.02,DQ,Deonshae Milliner,Moody,99.79,115.67,52.16,117.93,,Single-ply,SBD,F
Girls,100.02+,1,Seauanna Watson,Kyle Lehman,100.11,151.95,65.77,147.42,365.14,Single-ply,SBD,F
Girls,100.02+,2,Destiny Hall,Waco University,113.35,142.88,61.23,142.88,347,Single-ply,SBD,F
Girls,100.02+,3,Hannah Jett,Georgetown,121.06,136.08,58.97,151.95,347,Single-ply,SBD,F
Girls,100.02+,4,Brittany Carrasco,Cameron Yoe,123.6,142.88,70.31,131.54,344.73,Single-ply,SBD,F
Girls,100.02+,5,Mia Dolin,Kyle Lehman,120.66,142.88,65.77,127.01,335.66,Single-ply,SBD,F
Girls,100.02+,6,Karla Anguiano,Seguin,125.37,145.15,49.9,127.01,322.05,Single-ply,SBD,F
Girls,100.02+,7,Dinora DeLaCruz,Austin Lake Travis,110.36,63.5,40.82,129.27,233.6,Single-ply,SBD,F
