Division,WeightClassKg,Place,Name,Team,BodyweightKg,Best3SquatKg,Best3BenchKg,Best3DeadliftKg,TotalKg,Equipment,Event,Sex
Boys,51.71,1,Devin Lasenby,Paris North Lamar,51.07,183.7,102.06,131.54,417.3,Single-ply,SBD,M
Boys,51.71,2,Jose Rodriguez,Athens,51.07,163.29,86.18,156.49,405.97,Single-ply,SBD,M
Boys,51.71,3,Brett Butler,Mabank,51.26,161.03,83.91,140.61,385.55,Single-ply,SBD,M
Boys,51.71,4,Kias Cooper,Center,50.98,151.95,72.57,145.15,369.68,Single-ply,SBD,M
Boys,51.71,5,Miguel Hernandez,Emory Rains,50.35,151.95,68.04,140.61,360.61,Single-ply,SBD,M
Boys,55.79,6,William Cross,Huntington,51.89,136.08,72.57,149.69,358.34,Single-ply,SBD,M
Boys,51.71,7,Rj Reynolds,Commerce,50.89,136.08,77.11,138.35,351.53,Single-ply,SBD,M
Boys,51.71,8,Eric Aceves,Madisonville,50.89,117.93,70.31,113.4,301.64,Single-ply,SBD,M
Boys,51.71,9,Tyler Chandler,Crandall,51.26,122.47,43.09,131.54,297.1,Single-ply,SBD,M
Boys,51.71,10,Johney Phleps,Palestine Westwood,48.44,127.01,58.97,102.06,288.03,Single-ply,SBD,M
Boys,55.79,1,Chantz Gibson,Palestine Westwood,55.34,174.63,92.99,167.83,435.45,Single-ply,SBD,M
Boys,55.79,2,Devon Harris,North Forney,53.61,156.49,92.99,172.37,421.84,Single-ply,SBD,M
Boys,55.79,3,Ralph Bustos,Kaufman,55.34,158.76,88.45,161.03,408.23,Single-ply,SBD,M
Boys,55.79,4,Daniel Pena,Ferris,54.7,147.42,72.57,176.9,396.89,Single-ply,SBD,M
Boys,59.87,5,Wilberth Jimminez,Pittsburg,55.88,147.42,97.52,149.69,394.63,Single-ply,SBD,M
Boys,55.79,6,Ricardo Rodriguez,Athens,54.52,129.27,83.91,158.76,371.95,Single-ply,SBD,M
Boys,55.79,7,Brandon Nettles,Texarkana Pleasant Grove,55.25,138.35,83.91,140.61,362.87,Single-ply,SBD,M
Boys,55.79,8,Dalton Krodle,Commerce,55.7,147.42,68.04,142.88,358.34,Single-ply,SBD,M
Boys,55.79,9,Colby Green,Bullard,54.52,154.22,65.77,122.47,342.46,Single-ply,SBD,M
Boys,55.79,10,Bj Wafer,Huntington,54.34,111.13,81.65,142.88,335.66,Single-ply,SBD,M
Boys,59.87,1,Tj Howard,Texarkana Liberty-Eylau,59.42,185.97,113.4,190.51,489.88,Single-ply,SBD,M
Boys,59.87,2,Kentrun Pemberton,Texarkana Liberty-Eylau,59.51,185.97,111.13,176.9,474,Single-ply,SBD,M
Boys,67.13,3,Theron Dingas,Palestine Westwood,60.06,181.44,83.91,176.9,442.25,Single-ply,SBD,M
Boys,67.13,4,Juan Mendez,Emory Rains,59.96,154.22,92.99,172.37,419.57,Single-ply,SBD,M
Boys,59.87,5,Luis Camacho,Athens,58.69,149.69,95.25,163.29,408.23,Single-ply,SBD,M
Boys,59.87,6,Colt Conway,Mabank,59.87,170.1,81.65,145.15,396.89,Single-ply,SBD,M
Boys,67.13,7,Ismael Castillo,Madisonville,60.06,163.29,83.91,149.69,396.89,Single-ply,SBD,M
Boys,59.87,8,Brooks Conlee,Bullard,58.97,149.69,63.5,163.29,376.48,Single-ply,SBD,M
Boys,59.87,9,Devin Eggins,Fairfield,59.87,151.95,77.11,142.88,371.95,Single-ply,SBD,M
Boys,67.13,DQ,Nick McKee,Longview Spring Hill,59.96,165.56,83.91,,,Single-ply,SBD,M
Boys,74.84,1,Jt Delay,Mabank,67.22,204.12,129.27,176.9,510.29,Single-ply,SBD,M
Boys,74.84,2,Dondrell Hawkins,Paris,67.36,215.46,106.59,174.63,496.68,Single-ply,SBD,M
Boys,67.13,3,Michael Murray #3,Palestine Westwood,64.14,199.58,97.52,192.78,489.88,Single-ply,SBD,M
Boys,67.13,4,Jesse Hudson #1,Emory Rains,66.22,195.04,90.72,195.04,480.81,Single-ply,SBD,M
Boys,67.13,5,JR Pena,Ferris,65.05,179.17,102.06,197.31,478.54,Single-ply,SBD,M
Boys,67.13,6,Rod Howard,Texarkana Liberty-Eylau,64.41,185.97,104.33,181.44,471.74,Single-ply,SBD,M
Boys,67.13,7,James Rogers #3,Kemp,65.23,174.63,106.59,176.9,458.13,Single-ply,SBD,M
Boys,67.13,8,Dustin Bendall,Brownsboro,66.13,167.83,92.99,192.78,453.59,Single-ply,SBD,M
Boys,67.13,DQ,Clem Bailey,Paris,66.5,204.12,,,,Single-ply,SBD,M
Boys,67.13,DQ,Andres Sandoval,Ferris,66.41,185.97,138.35,,,Single-ply,SBD,M
Boys,74.84,1,Dominick Sanders,Paris,74.3,226.8,127.01,238.14,591.94,Single-ply,SBD,M
Boys,74.84,2,Alec Pack,Longview Spring Hill,73.66,235.87,142.88,210.92,589.67,Single-ply,SBD,M
Boys,74.84,3,Dk Calloway,Carthage,72.85,226.8,122.47,215.46,564.72,Single-ply,SBD,M
Boys,74.84,4,Jason Haley,Texarkana Liberty-Eylau,74.12,231.33,92.99,226.8,551.11,Single-ply,SBD,M
Boys,74.84,5,James Wright #1,Wills Point,73.84,217.72,115.67,204.12,537.51,Single-ply,SBD,M
Boys,74.84,6,Houston Alexander,Bullard,74.66,190.51,131.54,195.04,517.1,Single-ply,SBD,M
Boys,74.84,7,Trent Bailey,Mabank,74.12,185.97,124.74,199.58,510.29,Single-ply,SBD,M
Boys,74.84,8,James Silkey,Quinlan Ford,73.75,199.58,127.01,176.9,503.49,Single-ply,SBD,M
Boys,74.84,DQ,Joseph Clark,Tyler Chapel Hill,74.66,,,,,Single-ply,SBD,M
Boys,74.84,DQ,De'Shun Brewer,Texarkana Liberty-Eylau,71.21,181.44,131.54,,,Single-ply,SBD,M
Boys,82.1,1,Ty Smith,Paris North Lamar,81.47,244.94,149.69,233.6,628.23,Single-ply,SBD,M
Boys,82.1,2,Maverick Jones,Paris North Lamar,79.83,258.55,136.08,217.72,612.35,Single-ply,SBD,M
Boys,82.1,3,Trent Tucker,Texarkana Liberty-Eylau,80.29,231.33,145.15,226.8,603.28,Single-ply,SBD,M
Boys,82.1,4,Tyraiel Hart,Tyler Chapel Hill,81.01,244.94,122.47,231.33,598.74,Single-ply,SBD,M
Boys,82.1,5,Mitchell Pinion,Kemp,78.65,233.6,138.35,204.12,576.06,Single-ply,SBD,M
Boys,82.1,6,Adam Galaz,Lindale,80.65,235.87,120.2,217.72,573.79,Single-ply,SBD,M
Boys,82.1,7,Isaiah Martinez,Commerce,81.01,219.99,145.15,208.65,573.79,Single-ply,SBD,M
Boys,82.1,8,Zack Holladay,Bullard,80.47,215.46,122.47,226.8,564.72,Single-ply,SBD,M
Boys,82.1,9,Bryce Sanford,Canton,81.37,215.46,127.01,188.24,530.7,Single-ply,SBD,M
Boys,82.1,10,Marcos Garza,Mabank,81.83,199.58,129.27,192.78,521.63,Single-ply,SBD,M
Boys,89.81,1,Dq Lipscomb,Paris,88.99,281.23,165.56,274.42,721.21,Single-ply,SBD,M
Boys,89.81,2,Giresse Forchu,North Forney,89.09,251.74,161.03,254.01,666.78,Single-ply,SBD,M
Boys,89.81,3,Taylor Lollis,Texarkana Liberty-Eylau,89.63,240.4,149.69,231.33,621.42,Single-ply,SBD,M
Boys,89.81,4,Kederrick Holmes,Texarkana Liberty-Eylau,89.54,235.87,138.35,244.94,619.15,Single-ply,SBD,M
Boys,89.81,5,Brandoyn Bell,Tyler Chapel Hill,87.54,238.14,138.35,222.26,598.74,Single-ply,SBD,M
Boys,89.81,6,Chase Emerson,Rusk,82.37,242.67,129.27,197.31,569.26,Single-ply,SBD,M
Boys,89.81,7,Kiounis Williams,Center,88.99,231.33,111.13,226.8,569.26,Single-ply,SBD,M
Boys,89.81,8,Nicoli Morgan,Palestine Westwood,89.36,217.72,106.59,240.4,564.72,Single-ply,SBD,M
Boys,89.81,DQ,Collin Craytor,Texarkana Pleasant Grove,88.54,226.8,127.01,,,Single-ply,SBD,M
Boys,99.79,DQ,Jacob Cartwright,Huntington,90.04,,,,,Single-ply,SBD,M
Boys,99.79,1,Casey Sergent,Quinlan Ford,99.16,317.51,163.29,283.5,764.3,Single-ply,SBD,M
Boys,99.79,2,Matt Wood,Bullard,97.61,265.35,145.15,247.21,657.71,Single-ply,SBD,M
Boys,99.79,3,Dante Marsh,Lindale,97.52,240.4,172.37,242.67,655.44,Single-ply,SBD,M
Boys,99.79,4,Terry Jackson,North Forney,95.07,242.67,151.95,235.87,630.49,Single-ply,SBD,M
Boys,99.79,5,Dakotta Cooksy,Quinlan Ford,98.79,267.62,136.08,226.8,630.49,Single-ply,SBD,M
Boys,99.79,6,Devon Burris,Crandall,94.8,226.8,151.95,219.99,598.74,Single-ply,SBD,M
Boys,99.79,7,Cody Sell,Fairfield,98.52,226.8,149.69,204.12,580.6,Single-ply,SBD,M
Boys,99.79,8,Etheridge Brooks,Madisonville,97.98,215.46,136.08,208.65,560.19,Single-ply,SBD,M
Boys,99.79,DQ,Morocco Arnold,Texarkana Liberty-Eylau,95.53,,,,,Single-ply,SBD,M
Boys,99.79,DQ,Keiundas Wade,Tyler Chapel Hill,99.16,217.72,,,,Single-ply,SBD,M
Boys,99.79,DQ,Tyler Wellborn,Texarkana Pleasant Grove,90.99,226.8,,,,Single-ply,SBD,M
Boys,109.77,1,Aaron Liker,Center,109.13,265.35,172.37,256.28,694,Single-ply,SBD,M
Boys,109.77,2,Ben Jaeger,Emory Rains,108.5,254.01,165.56,260.82,680.39,Single-ply,SBD,M
Boys,109.77,3,Jacob McKinney,Palestine Westwood,106.32,272.16,131.54,249.48,653.17,Single-ply,SBD,M
Boys,109.77,4,Dillen Kilpatrick,Fairfield,105.32,249.48,167.83,226.8,644.1,Single-ply,SBD,M
Boys,109.77,5,Matt Guerra,Ferris,107.86,260.82,151.95,204.12,616.89,Single-ply,SBD,M
Boys,109.77,6,Ke'Adric Nelson,Canton,106.87,238.14,117.93,249.48,605.55,Single-ply,SBD,M
Boys,109.77,7,Keven Garcia,Tyler Chapel Hill,100.79,226.8,151.95,213.19,591.94,Single-ply,SBD,M
Boys,109.77,8,Michael Raymond,Fairfield,107.05,258.55,111.13,213.19,582.87,Single-ply,SBD,M
Boys,109.77,9,Stetson Farrell,Lindale,106.14,240.4,140.61,197.31,578.33,Single-ply,SBD,M
Boys,109.77,10,Bryce Hale,Quinlan Ford,100.43,213.19,117.93,215.46,546.58,Single-ply,SBD,M
Boys,124.74,1,Cody Parker,Kemp,115.21,276.69,183.7,215.46,675.85,Single-ply,SBD,M
Boys,124.74,2,Ashton Reeves,Palestine Westwood,123.29,238.14,188.24,238.14,664.51,Single-ply,SBD,M
Boys,124.74,3,Chris Paul,Texarkana Liberty-Eylau,114.31,238.14,158.76,240.4,637.3,Single-ply,SBD,M
Boys,124.74,4,Brandon Phillips,Paris,118.84,294.84,142.88,199.58,637.3,Single-ply,SBD,M
Boys,124.74,5,Casey Hargrove,Emory Rains,115.67,233.6,156.49,235.87,625.96,Single-ply,SBD,M
Boys,124.74,6,Marquis Gill,Paris,113.85,256.28,151.95,215.46,623.69,Single-ply,SBD,M
Boys,124.74,7,Javaris Rankin,Center,114.03,249.48,138.35,231.33,619.15,Single-ply,SBD,M
Boys,124.74,DQ,William Anderson,Palestine,124.01,,,,,Single-ply,SBD,M
Boys,124.74,DQ,Brian Taylor,Pittsburg,119.02,226.8,,,,Single-ply,SBD,M
Boys,124.74,DQ,Cortez Crosby,Commerce,117.3,299.37,174.63,,,Single-ply,SBD,M
Boys,124.74+,1,Jonathan Northcutt,Emory Rains,132.09,299.37,215.46,272.16,786.98,Single-ply,SBD,M
Boys,124.74+,2,Josh Hamilton,Tyler Chapel Hill,129.91,285.76,176.9,238.14,700.8,Single-ply,SBD,M
Boys,124.74+,3,Daniel Quinones,Pittsburg,126.01,278.96,154.22,233.6,666.78,Single-ply,SBD,M
Boys,124.74+,4,Michael Stiles,Lindale,128,247.21,140.61,240.4,628.23,Single-ply,SBD,M
Boys,124.74+,5,Andre McKissack,Crandall,133.99,229.06,151.95,240.4,621.42,Single-ply,SBD,M
Boys,124.74+,6,Marquan Edmond,Texarkana Liberty-Eylau,161.66,231.33,172.37,204.12,607.81,Single-ply,SBD,M
Boys,124.74+,7,Micheal Craig,Madisonville,147.69,231.33,124.74,192.78,548.85,Single-ply,SBD,M
Boys,124.74+,8,Charlie Perry,Palestine,137.8,226.8,,,226.8,Single-ply,S,M
Boys,124.74+,DQ,Hunter Strebeck,Mabank,132.36,224.53,161.03,,,Single-ply,SB,M
Boys,124.74+,DQ,Rod Jackson,Commerce,135.35,,,,,Single-ply,S,M
