<svg width="36" height="36" viewBox="0 0 36 36" fill="none" xmlns="http://www.w3.org/2000/svg">
<path d="M27.12 18.6298L17.85 27.9148C16.6347 28.9949 15.0527 29.5697 13.4276 29.5219C11.8024 29.4741 10.257 28.8071 9.10736 27.6575C7.95771 26.5078 7.29076 24.9624 7.24292 23.3372C7.19508 21.7121 7.76997 20.1301 8.85 18.9148L20.85 6.91483C21.5664 6.23428 22.5169 5.85483 23.505 5.85483C24.4931 5.85483 25.4436 6.23428 26.16 6.91483C26.858 7.62222 27.2494 8.57603 27.2494 9.56983C27.2494 10.5636 26.858 11.5174 26.16 12.2248L15.81 22.5598C15.7076 22.6701 15.5844 22.7592 15.4476 22.8219C15.3107 22.8846 15.1629 22.9198 15.0124 22.9253C14.862 22.9309 14.7119 22.9068 14.5708 22.8544C14.4297 22.802 14.3003 22.7223 14.19 22.6198C14.0797 22.5174 13.9906 22.3942 13.9279 22.2574C13.8652 22.1205 13.8301 21.9727 13.8245 21.8223C13.8189 21.6718 13.843 21.5218 13.8954 21.3807C13.9479 21.2395 14.0276 21.1101 14.13 20.9998L21.825 13.3198C22.1075 13.0374 22.2661 12.6543 22.2661 12.2548C22.2661 11.8554 22.1075 11.4723 21.825 11.1898C21.5425 10.9074 21.1595 10.7487 20.76 10.7487C20.3605 10.7487 19.9775 10.9074 19.695 11.1898L12 18.8998C11.615 19.2819 11.3093 19.7364 11.1008 20.2371C10.8922 20.7378 10.7849 21.2749 10.7849 21.8173C10.7849 22.3598 10.8922 22.8968 11.1008 23.3975C11.3093 23.8983 11.615 24.3528 12 24.7348C12.7866 25.4841 13.8312 25.902 14.9175 25.902C16.0038 25.902 17.0484 25.4841 17.835 24.7348L28.17 14.3848C29.3623 13.1053 30.0114 11.4128 29.9806 9.66413C29.9497 7.91542 29.2413 6.24695 28.0046 5.01023C26.7679 3.77352 25.0994 3.06511 23.3507 3.03425C21.602 3.0034 19.9096 3.65251 18.63 4.84483L6.63 16.8448C5.01179 18.6371 4.14754 20.9846 4.2173 23.3983C4.28705 25.812 5.28545 28.1057 7.00445 29.8015C8.72346 31.4973 11.0305 32.4644 13.4449 32.5014C15.8593 32.5383 18.1949 31.6422 19.965 29.9998L29.25 20.7298C29.3899 20.59 29.5008 20.4239 29.5765 20.2412C29.6522 20.0585 29.6911 19.8626 29.6911 19.6648C29.6911 19.467 29.6522 19.2712 29.5765 19.0885C29.5008 18.9057 29.3899 18.7397 29.25 18.5998C29.1101 18.46 28.9441 18.349 28.7614 18.2733C28.5786 18.1976 28.3828 18.1587 28.185 18.1587C27.9872 18.1587 27.7914 18.1976 27.6086 18.2733C27.4259 18.349 27.2599 18.46 27.12 18.5998V18.6298Z" fill="#666666"/>
</svg>
