[
    {
        "nid": "TLT_Dazzle",
        "name": "Dazzled",
        "desc": "Inflicts Hit -10.",
        "icon_nid": "Skills",
        "icon_index": [
            2,
            2
        ],
        "components": [
            [
                "hit",
                -10
            ],
            [
                "time",
                2
            ],
            [
                "negative",
                null
            ]
        ]
    }
]