[
    {
        "nid": "Dragoon",
        "name": "Dragoon",
        "desc": "Devotees of the lance. Fast-moving vanguards that excel behind enemy lines.",
        "tier": 2,
        "movement_group": "Fleet",
        "promotes_from": "Skirmisher",
        "turns_into": [],
        "tags": [],
        "max_level": 10,
        "bases": {
            "HP": 14,
            "STR": 4,
            "MAG": 2,
            "SKL": 3,
            "SPD": 4,
            "LCK": 0,
            "DEF": 4,
            "RES": 4,
            "CON": 7,
            "MOV": 7
        },
        "growths": {
            "HP": 85,
            "STR": 45,
            "MAG": 35,
            "SKL": 55,
            "SPD": 105,
            "LCK": 45,
            "DEF": 20,
            "RES": 45,
            "CON": 0,
            "MOV": 0
        },
        "growth_bonus": {
            "HP": 0,
            "STR": 0,
            "MAG": 0,
            "SKL": 0,
            "SPD": 0,
            "LCK": 0,
            "DEF": 0,
            "RES": 0,
            "CON": 0,
            "MOV": 0
        },
        "promotion": {
            "HP": 5,
            "STR": 2,
            "MAG": 0,
            "SKL": 0,
            "SPD": 0,
            "LCK": 0,
            "DEF": 2,
            "RES": 2,
            "CON": 3,
            "MOV": 1
        },
        "max_stats": {
            "HP": 40,
            "STR": 17,
            "MAG": 15,
            "SKL": 17,
            "SPD": 20,
            "LCK": 20,
            "DEF": 15,
            "RES": 15,
            "CON": 20,
            "MOV": 30
        },
        "learned_skills": [
            [
                3,
                "Feat"
            ],
            [
                5,
                "TLT_Charge"
            ],
            [
                8,
                "Feat"
            ]
        ],
        "wexp_gain": {
            "Sword": [
                false,
                0,
                null
            ],
            "Lance": [
                true,
                10,
                null
            ],
            "Axe": [
                false,
                0,
                null
            ],
            "Bow": [
                false,
                0,
                null
            ],
            "Light": [
                false,
                0,
                null
            ],
            "Anima": [
                false,
                0,
                null
            ],
            "Dark": [
                false,
                0,
                null
            ],
            "Default": [
                false,
                0,
                null
            ]
        },
        "icon_nid": "Generic_Portrait_Dragoon",
        "icon_index": [
            0,
            0
        ],
        "map_sprite_nid": "Dragoon",
        "combat_anim_nid": "Dragoon",
        "fields": []
    }
]