[
    {
        "nid": "TLT_Synergy",
        "name": "Synergy",
        "desc": "Grants Hit/Avoid +10 if an ally is within 3 tiles.",
        "icon_nid": "Skills",
        "icon_index": [
            10,
            7
        ],
        "components": [
            [
                "class_skill",
                null
            ],
            [
                "hit",
                10
            ],
            [
                "avoid",
                10
            ],
            [
                "condition",
                "unit_funcs.check_focus(unit, 3) > 0"
            ]
        ]
    }
]