[
    {
        "name": "Turn11",
        "trigger": "turn_change",
        "level_nid": "3",
        "condition": "game.turncount == 11",
        "commands": [],
        "only_once": false,
        "priority": 20,
        "_source": [
            "add_group;Pack2;Pack2",
            "wait;500"
        ]
    }
]