[
    {
        "name": "Sam Arrive",
        "trigger": "turn_change",
        "level_nid": "5",
        "condition": "game.turncount == 7",
        "commands": [],
        "only_once": false,
        "priority": 19,
        "_source": [
            "music;Stalwarts Unite",
            "# Change Sam and Kayla to player controlled",
            "change_team;Sam;player",
            "change_team;Kayla;player",
            "add_lore;CFS",
            "add_lore;Kayla",
            "# Kayla and Sam arrives",
            "change_objective_loss;Ophie dies OR Sam dies,Party size falls below 5. Currently {eval:len(game.get_units_in_party())}",
            "move_cursor;25,16",
            "wait;200",
            "add_unit;Sam;20,16;immediate;closest",
            "add_unit;Kayla;21,16;immediate;closest",
            "move_unit;Sam;20,15;;push;no_block",
            "move_unit;Kayla;21,15;;push",
            "wait;200",
            "flicker_cursor;Sam",
            "multi_add_portrait;Sam;Left;Kayla;Right",
            "speak;Sam;Looks like we're not too late...",
            "speak;Kayla;I'd certainly hope not... dragging me out here on such short notice.|There'd better be something to see.",
            "speak;Sam;Look! They're making their way up the switchbacks.",
            "bop_portrait;Kayla",
            "speak;Kayla;Oh, how romantic!|Our heroes dashing through the sweltering desert, bandits on their tail.|It's just like a novel!",
            "speak;Sam;We're not here to discuss literature, Kayla.",
            "speak;Kayla;Tsk Tsk. A lady needs time to prepare, you know.|But if you're in such a rush...|Men, into formation! Spread out and take the ridge!",
            "multi_remove_portrait;Sam;Kayla",
            "# Mercenaries arrive",
            "add_unit;M1;23,16",
            "add_unit;M2;24,16",
            "wait;1000",
            "choice;battle_save;Would you like to save?;Yes,No;;h",
            "if;game.game_vars['battle_save'] == 'Yes'",
            "battle_save",
            "end"
        ]
    }
]