[
    {
        "nid": "Meteor",
        "name": "Meteor",
        "desc": "Affects medium sized area.",
        "icon_nid": "Anima",
        "icon_index": [
            0,
            11
        ],
        "components": [
            [
                "spell",
                null
            ],
            [
                "weapon_type",
                "Anima"
            ],
            [
                "weapon_rank",
                "A"
            ],
            [
                "magic",
                null
            ],
            [
                "uses",
                3
            ],
            [
                "uses_options",
                {
                    "lose_uses_on_miss": false,
                    "one_loss_per_combat": false
                }
            ],
            [
                "blast_aoe",
                1
            ],
            [
                "hit",
                45
            ],
            [
                "damage",
                13
            ],
            [
                "map_cast_anim",
                "AOE_Meteor"
            ],
            [
                "map_cast_sfx",
                "FireCharge"
            ],
            [
                "value",
                4500
            ],
            [
                "min_range",
                3
            ],
            [
                "max_range",
                10
            ],
            [
                "target_tile",
                null
            ],
            [
                "level_exp",
                null
            ],
            [
                "map_hit_add_blend",
                [
                    248,
                    128,
                    0
                ]
            ]
        ]
    }
]