[
    {
        "nid": "TLT_Underdog",
        "name": "Underdog",
        "desc": "Grants Damage +2 and Damage Taken -2 against enemies with greater max HP.",
        "icon_nid": "Skills",
        "icon_index": [
            9,
            5
        ],
        "components": [
            [
                "dynamic_damage",
                "2 if unit.stats['HP'] < target.stats['HP'] else 0"
            ],
            [
                "dynamic_resist",
                "2 if unit.stats['HP'] < target.stats['HP'] else 0"
            ]
        ]
    }
]