[
    {
        "nid": "Hand Axe",
        "name": "Hand Axe",
        "desc": "",
        "icon_nid": "Axe",
        "icon_index": [
            0,
            14
        ],
        "components": [
            [
                "weapon",
                null
            ],
            [
                "target_enemy",
                null
            ],
            [
                "level_exp",
                null
            ],
            [
                "damage",
                4
            ],
            [
                "hit",
                55
            ],
            [
                "weapon_type",
                "Axe"
            ],
            [
                "weapon_rank",
                "D"
            ],
            [
                "uses",
                20
            ],
            [
                "uses_options",
                {
                    "lose_uses_on_miss": false,
                    "one_loss_per_combat": false
                }
            ],
            [
                "weight",
                8
            ],
            [
                "value",
                300
            ],
            [
                "min_range",
                1
            ],
            [
                "max_range",
                2
            ]
        ]
    }
]