[
    {
        "nid": "TLT_Overwhelm",
        "name": "Overwhelm",
        "desc": "If attacking and damage would defeat enemy, grants Hit +30.",
        "icon_nid": "Skills",
        "icon_index": [
            8,
            5
        ],
        "components": [
            [
                "dynamic_accuracy",
                "30 if (mode in ('attack', 'splash') and combat_calcs.compute_damage(unit, target, item, target.get_weapon(), 'attack') >= target.get_hp()) else 0"
            ],
            [
                "class_skill",
                null
            ]
        ]
    }
]