[
    {
        "name": "Turn4",
        "trigger": "turn_change",
        "level_nid": "2",
        "condition": "game.turncount == 4",
        "commands": [],
        "only_once": false,
        "priority": 20,
        "_source": [
            "move_cursor;19,13",
            "add_group;EnemyRein;Starting",
            "wait;500"
        ]
    }
]