[
    {
        "nid": "Physic",
        "name": "Physic",
        "desc": "Restores (User's Magic + 10) HP at range.",
        "icon_nid": "Light",
        "icon_index": [
            0,
            13
        ],
        "components": [
            [
                "spell",
                null
            ],
            [
                "target_ally",
                null
            ],
            [
                "weapon_type",
                "Light"
            ],
            [
                "weapon_rank",
                "B"
            ],
            [
                "magic",
                null
            ],
            [
                "uses",
                15
            ],
            [
                "uses_options",
                {
                    "lose_uses_on_miss": false,
                    "one_loss_per_combat": false
                }
            ],
            [
                "value",
                3750
            ],
            [
                "min_range",
                0
            ],
            [
                "max_range",
                7
            ],
            [
                "magic_heal",
                10
            ],
            [
                "heal_exp",
                null
            ],
            [
                "map_hit_add_blend",
                [
                    96,
                    144,
                    232
                ]
            ]
        ]
    }
]