[
    {
        "name": "Theo Sphinx, Pt. I",
        "trigger": "on_base_convo",
        "level_nid": "4",
        "condition": "unit == \"Theo Sphinx, Pt. I\"",
        "commands": [],
        "only_once": false,
        "priority": 20,
        "_source": [
            "# Episode 1",
            "transition;Close",
            "music;Jazz Noir",
            "change_background;Study",
            "transition;Open",
            "add_portrait;Theo;Left",
            "speak;Theo;Listen... It started like this.|It was an uneventful Tuesday morning.|I should have known something was up.|My hangover from last night was gnashing my temples,|like a toothless rat on a nickel steak.|I needed another drink.|Or five.{w}{clear}That's when trouble walked in the door.;;;noir",
            "add_portrait;Prim;Right",
            "speak;Prim;Theo, I need your help.",
            "speak;Theo;A blue-haired dame, looking more nervous than a spinal column.|She was an old flame of mine who'd fallen on hard times.|But I wasn't looking to rekindle the relationship.;;;noir",
            "speak;Prim;Theo, what are you mumbling about?|Are you alright?|Anyways, I've lost a tome of mine...|Have you seen it around by chance?",
            "speak;Theo;This had bad news written on it like the front page of the morning paper.|But Theo Sphinx, Private Eye never refuses a case,|no matter how dangerous.;;;noir",
            "speak;Prim;Theo?",
            "speak;Theo;I agreed, reluctantly--|for the sake of the past.;;;noir",
            "speak;Prim;Oh you don't have to go through the trouble, I was just wondering if...",
            "remove_portrait;Prim",
            "speak;Theo;The dame prattled on, but I'd heard enough.|I dusted off my jacket, lit up my last cigar, grabbed my hat and walked out,|the scent of one too many cheap drinks hanging on the wallpaper.|I had a meeting with destiny, and she was a cold mistress.;;;noir",
            "remove_portrait;Theo",
            "ignore_base_convo;Theo Sphinx, Pt. I",
            "game_var;noir;1",
            "transition;Close",
            "change_background",
            "transition;Open"
        ]
    }
]