[
    {
        "nid": "TLT_Conductance",
        "name": "Conductance",
        "desc": "Grants Hit +15 and Damage +1 against enemies wielding metal weapons.",
        "icon_nid": "Skills",
        "icon_index": [
            4,
            6
        ],
        "components": [
            [
                "dynamic_damage",
                "1 if target.get_weapon() and item_system.weapon_type(target, target.get_weapon()) in ('Sword', 'Lance', 'Axe') else 0"
            ],
            [
                "dynamic_accuracy",
                "15 if target.get_weapon() and item_system.weapon_type(target, target.get_weapon()) in ('Sword', 'Lance', 'Axe') else 0"
            ],
            [
                "class_skill",
                null
            ]
        ]
    }
]