[
    {
        "nid": "Prologue",
        "size": [
            20,
            10
        ],
        "autotile_fps": 29,
        "layers": [
            {
                "nid": "base",
                "visible": true,
                "foreground": false,
                "terrain_grid": {
                    "8,6": "Wall",
                    "8,7": "Wall",
                    "8,8": "Wall",
                    "9,8": "Wall",
                    "10,8": "Wall",
                    "10,7": "Wall",
                    "11,7": "Wall",
                    "11,6": "Wall",
                    "10,6": "Wall",
                    "9,6": "Wall",
                    "9,7": "Wall",
                    "11,8": "Wall",
                    "11,9": "Wall",
                    "12,9": "Wall",
                    "13,9": "Wall",
                    "14,9": "Wall",
                    "15,9": "Wall",
                    "15,8": "Wall",
                    "16,8": "Wall",
                    "17,8": "Wall",
                    "17,9": "Wall",
                    "16,9": "Wall",
                    "7,3": "Plain",
                    "6,9": "Ruins Floor",
                    "16,6": "Plain",
                    "12,1": "Plain",
                    "17,7": "Forest",
                    "14,4": "Plain",
                    "13,4": "Plain",
                    "19,4": "Plain",
                    "18,4": "Plain",
                    "0,7": "Wall",
                    "15,1": "Ruins Floor",
                    "1,6": "Wall",
                    "3,7": "Plain",
                    "2,5": "Ruins Floor",
                    "8,5": "Ruins Floor",
                    "5,8": "Plain",
                    "4,0": "Wall",
                    "9,0": "Wall",
                    "6,7": "Ruins Floor",
                    "5,5": "Ruins Floor",
                    "11,5": "Plain",
                    "16,3": "Plain",
                    "7,6": "Ruins Floor",
                    "12,6": "Plain",
                    "17,2": "Plain",
                    "14,1": "Plain",
                    "13,7": "Plain",
                    "19,3": "Plain",
                    "18,9": "Wall",
                    "0,4": "Plain",
                    "15,4": "Forest",
                    "1,1": "Plain",
                    "3,2": "Wall",
                    "2,6": "Wall",
                    "8,2": "Wall",
                    "4,5": "Ruins Floor",
                    "9,3": "Plain",
                    "6,0": "Stairs",
                    "11,0": "Wall",
                    "7,5": "Ruins Floor",
                    "16,0": "Ruins Floor",
                    "14,2": "Plain",
                    "0,1": "Plain",
                    "3,1": "Wall",
                    "9,9": "Ruins Floor",
                    "7,8": "Ruins Floor",
                    "14,8": "Plain",
                    "13,0": "Wall",
                    "12,8": "Plain",
                    "19,8": "Plain",
                    "18,0": "Door",
                    "2,1": "Wall",
                    "8,9": "Ruins Floor",
                    "9,4": "Ruins Floor",
                    "5,1": "Stairs",
                    "10,3": "Plain",
                    "7,2": "Wall",
                    "16,7": "Plain",
                    "12,2": "Plain",
                    "17,6": "Plain",
                    "14,5": "Plain",
                    "13,3": "Plain",
                    "19,7": "Plain",
                    "18,5": "Plain",
                    "15,0": "Ruins Floor",
                    "1,5": "Ruins Floor",
                    "3,6": "Plain",
                    "2,2": "Wall",
                    "4,1": "Wall",
                    "10,9": "Ruins Floor",
                    "6,4": "Plain",
                    "5,4": "Ruins Floor",
                    "11,4": "Plain",
                    "10,4": "Plain",
                    "16,4": "Plain",
                    "7,1": "Wall",
                    "12,7": "Plain",
                    "17,1": "Plain",
                    "14,6": "Plain",
                    "13,6": "Plain",
                    "19,2": "Plain",
                    "18,6": "Plain",
                    "0,5": "Forest",
                    "15,7": "Forest",
                    "1,0": "Forest",
                    "0,8": "Wall",
                    "3,5": "Ruins Floor",
                    "2,7": "Wall",
                    "8,3": "Plain",
                    "4,6": "Ruins Floor",
                    "9,2": "Wall",
                    "6,1": "Stairs",
                    "5,7": "Ruins Floor",
                    "11,3": "Plain",
                    "7,4": "Plain",
                    "16,1": "Ruins Floor",
                    "12,4": "Plain",
                    "14,3": "Plain",
                    "19,1": "Plain",
                    "0,2": "Plain",
                    "1,3": "Plain",
                    "4,8": "Ruins Floor",
                    "3,0": "Wall",
                    "2,8": "Wall",
                    "8,0": "Wall",
                    "6,2": "Stairs",
                    "18,1": "Plain",
                    "5,0": "Stairs",
                    "10,0": "Wall",
                    "12,3": "Plain",
                    "17,5": "Plain",
                    "13,2": "Plain",
                    "19,6": "Forest",
                    "18,2": "Plain",
                    "15,3": "Plain",
                    "1,4": "Ruins Floor",
                    "3,9": "Ruins Floor",
                    "2,3": "Plain",
                    "1,9": "Ruins Floor",
                    "4,2": "Wall",
                    "6,5": "Ruins Floor",
                    "5,3": "Plain",
                    "10,5": "Ruins Floor",
                    "16,5": "Plain",
                    "6,8": "Plain",
                    "7,0": "Wall",
                    "12,0": "Wall",
                    "17,0": "Wall",
                    "14,7": "Plain",
                    "13,5": "Plain",
                    "19,5": "Plain",
                    "18,7": "Plain",
                    "0,6": "Wall",
                    "15,6": "Plain",
                    "1,7": "Wall",
                    "0,9": "Wall",
                    "3,4": "Ruins Floor",
                    "2,4": "Ruins Floor",
                    "8,4": "Plain",
                    "5,9": "Ruins Floor",
                    "4,7": "Plain",
                    "9,1": "Wall",
                    "6,6": "Ruins Floor",
                    "5,6": "Ruins Floor",
                    "11,2": "Plain",
                    "16,2": "Plain",
                    "7,7": "Ruins Floor",
                    "12,5": "Plain",
                    "17,3": "Plain",
                    "14,0": "Plain",
                    "13,8": "Plain",
                    "19,0": "Wall",
                    "18,8": "Plain",
                    "0,3": "Plain",
                    "15,5": "Plain",
                    "1,2": "Plain",
                    "4,9": "Ruins Floor",
                    "3,3": "Plain",
                    "2,9": "Ruins Floor",
                    "8,1": "Wall",
                    "4,4": "Plain",
                    "6,3": "Plain",
                    "11,1": "Plain",
                    "0,0": "Plain",
                    "10,1": "Plain",
                    "17,4": "Plain",
                    "7,9": "Ruins Floor",
                    "13,1": "Plain",
                    "19,9": "Plain",
                    "18,3": "Plain",
                    "15,2": "Plain",
                    "3,8": "Plain",
                    "2,0": "Wall",
                    "1,8": "Wall",
                    "4,3": "Plain",
                    "9,5": "Ruins Floor",
                    "5,2": "Stairs",
                    "10,2": "Plain"
                },
                "sprite_grid": {
                    "7,3": [
                        "Prologue",
                        [
                            7,
                            3
                        ]
                    ],
                    "6,9": [
                        "Prologue",
                        [
                            6,
                            9
                        ]
                    ],
                    "16,6": [
                        "Prologue",
                        [
                            16,
                            6
                        ]
                    ],
                    "12,1": [
                        "Prologue",
                        [
                            12,
                            1
                        ]
                    ],
                    "17,7": [
                        "Prologue",
                        [
                            17,
                            7
                        ]
                    ],
                    "16,9": [
                        "Prologue",
                        [
                            16,
                            9
                        ]
                    ],
                    "14,4": [
                        "Prologue",
                        [
                            14,
                            4
                        ]
                    ],
                    "13,4": [
                        "Prologue",
                        [
                            13,
                            4
                        ]
                    ],
                    "19,4": [
                        "Prologue",
                        [
                            19,
                            4
                        ]
                    ],
                    "18,4": [
                        "Prologue",
                        [
                            18,
                            4
                        ]
                    ],
                    "0,7": [
                        "Prologue",
                        [
                            0,
                            7
                        ]
                    ],
                    "15,1": [
                        "Prologue",
                        [
                            15,
                            1
                        ]
                    ],
                    "1,6": [
                        "Prologue",
                        [
                            1,
                            6
                        ]
                    ],
                    "3,7": [
                        "Prologue",
                        [
                            3,
                            7
                        ]
                    ],
                    "2,5": [
                        "Prologue",
                        [
                            2,
                            5
                        ]
                    ],
                    "8,5": [
                        "Prologue",
                        [
                            8,
                            5
                        ]
                    ],
                    "5,8": [
                        "Prologue",
                        [
                            5,
                            8
                        ]
                    ],
                    "4,0": [
                        "Prologue",
                        [
                            4,
                            0
                        ]
                    ],
                    "10,8": [
                        "Prologue",
                        [
                            10,
                            8
                        ]
                    ],
                    "9,0": [
                        "Prologue",
                        [
                            9,
                            0
                        ]
                    ],
                    "6,7": [
                        "Prologue",
                        [
                            6,
                            7
                        ]
                    ],
                    "5,5": [
                        "Prologue",
                        [
                            5,
                            5
                        ]
                    ],
                    "11,5": [
                        "Prologue",
                        [
                            11,
                            5
                        ]
                    ],
                    "10,7": [
                        "Prologue",
                        [
                            10,
                            7
                        ]
                    ],
                    "7,6": [
                        "Prologue",
                        [
                            7,
                            6
                        ]
                    ],
                    "16,3": [
                        "Prologue",
                        [
                            16,
                            3
                        ]
                    ],
                    "12,6": [
                        "Prologue",
                        [
                            12,
                            6
                        ]
                    ],
                    "17,2": [
                        "Prologue",
                        [
                            17,
                            2
                        ]
                    ],
                    "14,1": [
                        "Prologue",
                        [
                            14,
                            1
                        ]
                    ],
                    "13,7": [
                        "Prologue",
                        [
                            13,
                            7
                        ]
                    ],
                    "19,3": [
                        "Prologue",
                        [
                            19,
                            3
                        ]
                    ],
                    "18,9": [
                        "Prologue",
                        [
                            18,
                            9
                        ]
                    ],
                    "0,4": [
                        "Prologue",
                        [
                            0,
                            4
                        ]
                    ],
                    "15,4": [
                        "Prologue",
                        [
                            15,
                            4
                        ]
                    ],
                    "1,1": [
                        "Prologue",
                        [
                            1,
                            1
                        ]
                    ],
                    "3,2": [
                        "Prologue",
                        [
                            3,
                            2
                        ]
                    ],
                    "2,6": [
                        "Prologue",
                        [
                            2,
                            6
                        ]
                    ],
                    "8,2": [
                        "Prologue",
                        [
                            8,
                            2
                        ]
                    ],
                    "4,5": [
                        "Prologue",
                        [
                            4,
                            5
                        ]
                    ],
                    "9,3": [
                        "Prologue",
                        [
                            9,
                            3
                        ]
                    ],
                    "6,0": [
                        "Prologue",
                        [
                            6,
                            0
                        ]
                    ],
                    "11,0": [
                        "Prologue",
                        [
                            11,
                            0
                        ]
                    ],
                    "7,5": [
                        "Prologue",
                        [
                            7,
                            5
                        ]
                    ],
                    "16,0": [
                        "Prologue",
                        [
                            16,
                            0
                        ]
                    ],
                    "14,2": [
                        "Prologue",
                        [
                            14,
                            2
                        ]
                    ],
                    "0,1": [
                        "Prologue",
                        [
                            0,
                            1
                        ]
                    ],
                    "3,1": [
                        "Prologue",
                        [
                            3,
                            1
                        ]
                    ],
                    "9,9": [
                        "Prologue",
                        [
                            9,
                            9
                        ]
                    ],
                    "7,8": [
                        "Prologue",
                        [
                            7,
                            8
                        ]
                    ],
                    "14,8": [
                        "Prologue",
                        [
                            14,
                            8
                        ]
                    ],
                    "13,0": [
                        "Prologue",
                        [
                            13,
                            0
                        ]
                    ],
                    "12,8": [
                        "Prologue",
                        [
                            12,
                            8
                        ]
                    ],
                    "19,8": [
                        "Prologue",
                        [
                            19,
                            8
                        ]
                    ],
                    "18,0": [
                        "Prologue",
                        [
                            18,
                            0
                        ]
                    ],
                    "17,8": [
                        "Prologue",
                        [
                            17,
                            8
                        ]
                    ],
                    "2,1": [
                        "Prologue",
                        [
                            2,
                            1
                        ]
                    ],
                    "8,9": [
                        "Prologue",
                        [
                            8,
                            9
                        ]
                    ],
                    "9,4": [
                        "Prologue",
                        [
                            9,
                            4
                        ]
                    ],
                    "5,1": [
                        "Prologue",
                        [
                            5,
                            1
                        ]
                    ],
                    "10,3": [
                        "Prologue",
                        [
                            10,
                            3
                        ]
                    ],
                    "7,2": [
                        "Prologue",
                        [
                            7,
                            2
                        ]
                    ],
                    "16,7": [
                        "Prologue",
                        [
                            16,
                            7
                        ]
                    ],
                    "12,2": [
                        "Prologue",
                        [
                            12,
                            2
                        ]
                    ],
                    "17,6": [
                        "Prologue",
                        [
                            17,
                            6
                        ]
                    ],
                    "14,5": [
                        "Prologue",
                        [
                            14,
                            5
                        ]
                    ],
                    "13,3": [
                        "Prologue",
                        [
                            13,
                            3
                        ]
                    ],
                    "19,7": [
                        "Prologue",
                        [
                            19,
                            7
                        ]
                    ],
                    "18,5": [
                        "Prologue",
                        [
                            18,
                            5
                        ]
                    ],
                    "15,0": [
                        "Prologue",
                        [
                            15,
                            0
                        ]
                    ],
                    "1,5": [
                        "Prologue",
                        [
                            1,
                            5
                        ]
                    ],
                    "3,6": [
                        "Prologue",
                        [
                            3,
                            6
                        ]
                    ],
                    "2,2": [
                        "Prologue",
                        [
                            2,
                            2
                        ]
                    ],
                    "8,6": [
                        "Prologue",
                        [
                            8,
                            6
                        ]
                    ],
                    "4,1": [
                        "Prologue",
                        [
                            4,
                            1
                        ]
                    ],
                    "10,9": [
                        "Prologue",
                        [
                            10,
                            9
                        ]
                    ],
                    "9,7": [
                        "Prologue",
                        [
                            9,
                            7
                        ]
                    ],
                    "6,4": [
                        "Prologue",
                        [
                            6,
                            4
                        ]
                    ],
                    "5,4": [
                        "Prologue",
                        [
                            5,
                            4
                        ]
                    ],
                    "11,4": [
                        "Prologue",
                        [
                            11,
                            4
                        ]
                    ],
                    "10,4": [
                        "Prologue",
                        [
                            10,
                            4
                        ]
                    ],
                    "7,1": [
                        "Prologue",
                        [
                            7,
                            1
                        ]
                    ],
                    "16,4": [
                        "Prologue",
                        [
                            16,
                            4
                        ]
                    ],
                    "12,7": [
                        "Prologue",
                        [
                            12,
                            7
                        ]
                    ],
                    "11,9": [
                        "Prologue",
                        [
                            11,
                            9
                        ]
                    ],
                    "17,1": [
                        "Prologue",
                        [
                            17,
                            1
                        ]
                    ],
                    "14,6": [
                        "Prologue",
                        [
                            14,
                            6
                        ]
                    ],
                    "13,6": [
                        "Prologue",
                        [
                            13,
                            6
                        ]
                    ],
                    "19,2": [
                        "Prologue",
                        [
                            19,
                            2
                        ]
                    ],
                    "18,6": [
                        "Prologue",
                        [
                            18,
                            6
                        ]
                    ],
                    "0,5": [
                        "Prologue",
                        [
                            0,
                            5
                        ]
                    ],
                    "15,7": [
                        "Prologue",
                        [
                            15,
                            7
                        ]
                    ],
                    "1,0": [
                        "Prologue",
                        [
                            1,
                            0
                        ]
                    ],
                    "0,8": [
                        "Prologue",
                        [
                            0,
                            8
                        ]
                    ],
                    "3,5": [
                        "Prologue",
                        [
                            3,
                            5
                        ]
                    ],
                    "2,7": [
                        "Prologue",
                        [
                            2,
                            7
                        ]
                    ],
                    "8,3": [
                        "Prologue",
                        [
                            8,
                            3
                        ]
                    ],
                    "4,6": [
                        "Prologue",
                        [
                            4,
                            6
                        ]
                    ],
                    "9,2": [
                        "Prologue",
                        [
                            9,
                            2
                        ]
                    ],
                    "6,1": [
                        "Prologue",
                        [
                            6,
                            1
                        ]
                    ],
                    "5,7": [
                        "Prologue",
                        [
                            5,
                            7
                        ]
                    ],
                    "11,3": [
                        "Prologue",
                        [
                            11,
                            3
                        ]
                    ],
                    "7,4": [
                        "Prologue",
                        [
                            7,
                            4
                        ]
                    ],
                    "16,1": [
                        "Prologue",
                        [
                            16,
                            1
                        ]
                    ],
                    "12,4": [
                        "Prologue",
                        [
                            12,
                            4
                        ]
                    ],
                    "15,9": [
                        "Prologue",
                        [
                            15,
                            9
                        ]
                    ],
                    "14,3": [
                        "Prologue",
                        [
                            14,
                            3
                        ]
                    ],
                    "13,9": [
                        "Prologue",
                        [
                            13,
                            9
                        ]
                    ],
                    "19,1": [
                        "Prologue",
                        [
                            19,
                            1
                        ]
                    ],
                    "0,2": [
                        "Prologue",
                        [
                            0,
                            2
                        ]
                    ],
                    "1,3": [
                        "Prologue",
                        [
                            1,
                            3
                        ]
                    ],
                    "4,8": [
                        "Prologue",
                        [
                            4,
                            8
                        ]
                    ],
                    "3,0": [
                        "Prologue",
                        [
                            3,
                            0
                        ]
                    ],
                    "2,8": [
                        "Prologue",
                        [
                            2,
                            8
                        ]
                    ],
                    "9,8": [
                        "Prologue",
                        [
                            9,
                            8
                        ]
                    ],
                    "8,0": [
                        "Prologue",
                        [
                            8,
                            0
                        ]
                    ],
                    "6,2": [
                        "Prologue",
                        [
                            6,
                            2
                        ]
                    ],
                    "14,9": [
                        "Prologue",
                        [
                            14,
                            9
                        ]
                    ],
                    "12,9": [
                        "Prologue",
                        [
                            12,
                            9
                        ]
                    ],
                    "18,1": [
                        "Prologue",
                        [
                            18,
                            1
                        ]
                    ],
                    "5,0": [
                        "Prologue",
                        [
                            5,
                            0
                        ]
                    ],
                    "10,0": [
                        "Prologue",
                        [
                            10,
                            0
                        ]
                    ],
                    "12,3": [
                        "Prologue",
                        [
                            12,
                            3
                        ]
                    ],
                    "17,5": [
                        "Prologue",
                        [
                            17,
                            5
                        ]
                    ],
                    "13,2": [
                        "Prologue",
                        [
                            13,
                            2
                        ]
                    ],
                    "19,6": [
                        "Prologue",
                        [
                            19,
                            6
                        ]
                    ],
                    "18,2": [
                        "Prologue",
                        [
                            18,
                            2
                        ]
                    ],
                    "15,3": [
                        "Prologue",
                        [
                            15,
                            3
                        ]
                    ],
                    "1,4": [
                        "Prologue",
                        [
                            1,
                            4
                        ]
                    ],
                    "3,9": [
                        "Prologue",
                        [
                            3,
                            9
                        ]
                    ],
                    "2,3": [
                        "Prologue",
                        [
                            2,
                            3
                        ]
                    ],
                    "1,9": [
                        "Prologue",
                        [
                            1,
                            9
                        ]
                    ],
                    "8,7": [
                        "Prologue",
                        [
                            8,
                            7
                        ]
                    ],
                    "4,2": [
                        "Prologue",
                        [
                            4,
                            2
                        ]
                    ],
                    "9,6": [
                        "Prologue",
                        [
                            9,
                            6
                        ]
                    ],
                    "6,5": [
                        "Prologue",
                        [
                            6,
                            5
                        ]
                    ],
                    "5,3": [
                        "Prologue",
                        [
                            5,
                            3
                        ]
                    ],
                    "11,7": [
                        "Prologue",
                        [
                            11,
                            7
                        ]
                    ],
                    "10,5": [
                        "Prologue",
                        [
                            10,
                            5
                        ]
                    ],
                    "7,0": [
                        "Prologue",
                        [
                            7,
                            0
                        ]
                    ],
                    "6,8": [
                        "Prologue",
                        [
                            6,
                            8
                        ]
                    ],
                    "16,5": [
                        "Prologue",
                        [
                            16,
                            5
                        ]
                    ],
                    "12,0": [
                        "Prologue",
                        [
                            12,
                            0
                        ]
                    ],
                    "11,8": [
                        "Prologue",
                        [
                            11,
                            8
                        ]
                    ],
                    "17,0": [
                        "Prologue",
                        [
                            17,
                            0
                        ]
                    ],
                    "16,8": [
                        "Prologue",
                        [
                            16,
                            8
                        ]
                    ],
                    "14,7": [
                        "Prologue",
                        [
                            14,
                            7
                        ]
                    ],
                    "13,5": [
                        "Prologue",
                        [
                            13,
                            5
                        ]
                    ],
                    "19,5": [
                        "Prologue",
                        [
                            19,
                            5
                        ]
                    ],
                    "18,7": [
                        "Prologue",
                        [
                            18,
                            7
                        ]
                    ],
                    "0,6": [
                        "Prologue",
                        [
                            0,
                            6
                        ]
                    ],
                    "15,6": [
                        "Prologue",
                        [
                            15,
                            6
                        ]
                    ],
                    "1,7": [
                        "Prologue",
                        [
                            1,
                            7
                        ]
                    ],
                    "0,9": [
                        "Prologue",
                        [
                            0,
                            9
                        ]
                    ],
                    "3,4": [
                        "Prologue",
                        [
                            3,
                            4
                        ]
                    ],
                    "2,4": [
                        "Prologue",
                        [
                            2,
                            4
                        ]
                    ],
                    "8,4": [
                        "Prologue",
                        [
                            8,
                            4
                        ]
                    ],
                    "5,9": [
                        "Prologue",
                        [
                            5,
                            9
                        ]
                    ],
                    "4,7": [
                        "Prologue",
                        [
                            4,
                            7
                        ]
                    ],
                    "9,1": [
                        "Prologue",
                        [
                            9,
                            1
                        ]
                    ],
                    "6,6": [
                        "Prologue",
                        [
                            6,
                            6
                        ]
                    ],
                    "5,6": [
                        "Prologue",
                        [
                            5,
                            6
                        ]
                    ],
                    "11,2": [
                        "Prologue",
                        [
                            11,
                            2
                        ]
                    ],
                    "10,6": [
                        "Prologue",
                        [
                            10,
                            6
                        ]
                    ],
                    "7,7": [
                        "Prologue",
                        [
                            7,
                            7
                        ]
                    ],
                    "16,2": [
                        "Prologue",
                        [
                            16,
                            2
                        ]
                    ],
                    "12,5": [
                        "Prologue",
                        [
                            12,
                            5
                        ]
                    ],
                    "17,3": [
                        "Prologue",
                        [
                            17,
                            3
                        ]
                    ],
                    "15,8": [
                        "Prologue",
                        [
                            15,
                            8
                        ]
                    ],
                    "14,0": [
                        "Prologue",
                        [
                            14,
                            0
                        ]
                    ],
                    "13,8": [
                        "Prologue",
                        [
                            13,
                            8
                        ]
                    ],
                    "19,0": [
                        "Prologue",
                        [
                            19,
                            0
                        ]
                    ],
                    "18,8": [
                        "Prologue",
                        [
                            18,
                            8
                        ]
                    ],
                    "0,3": [
                        "Prologue",
                        [
                            0,
                            3
                        ]
                    ],
                    "15,5": [
                        "Prologue",
                        [
                            15,
                            5
                        ]
                    ],
                    "1,2": [
                        "Prologue",
                        [
                            1,
                            2
                        ]
                    ],
                    "4,9": [
                        "Prologue",
                        [
                            4,
                            9
                        ]
                    ],
                    "3,3": [
                        "Prologue",
                        [
                            3,
                            3
                        ]
                    ],
                    "2,9": [
                        "Prologue",
                        [
                            2,
                            9
                        ]
                    ],
                    "8,1": [
                        "Prologue",
                        [
                            8,
                            1
                        ]
                    ],
                    "4,4": [
                        "Prologue",
                        [
                            4,
                            4
                        ]
                    ],
                    "6,3": [
                        "Prologue",
                        [
                            6,
                            3
                        ]
                    ],
                    "11,1": [
                        "Prologue",
                        [
                            11,
                            1
                        ]
                    ],
                    "0,0": [
                        "Prologue",
                        [
                            0,
                            0
                        ]
                    ],
                    "10,1": [
                        "Prologue",
                        [
                            10,
                            1
                        ]
                    ],
                    "17,4": [
                        "Prologue",
                        [
                            17,
                            4
                        ]
                    ],
                    "7,9": [
                        "Prologue",
                        [
                            7,
                            9
                        ]
                    ],
                    "13,1": [
                        "Prologue",
                        [
                            13,
                            1
                        ]
                    ],
                    "19,9": [
                        "Prologue",
                        [
                            19,
                            9
                        ]
                    ],
                    "18,3": [
                        "Prologue",
                        [
                            18,
                            3
                        ]
                    ],
                    "17,9": [
                        "Prologue",
                        [
                            17,
                            9
                        ]
                    ],
                    "15,2": [
                        "Prologue",
                        [
                            15,
                            2
                        ]
                    ],
                    "3,8": [
                        "Prologue",
                        [
                            3,
                            8
                        ]
                    ],
                    "2,0": [
                        "Prologue",
                        [
                            2,
                            0
                        ]
                    ],
                    "1,8": [
                        "Prologue",
                        [
                            1,
                            8
                        ]
                    ],
                    "8,8": [
                        "Prologue",
                        [
                            8,
                            8
                        ]
                    ],
                    "4,3": [
                        "Prologue",
                        [
                            4,
                            3
                        ]
                    ],
                    "9,5": [
                        "Prologue",
                        [
                            9,
                            5
                        ]
                    ],
                    "5,2": [
                        "Prologue",
                        [
                            5,
                            2
                        ]
                    ],
                    "11,6": [
                        "Prologue",
                        [
                            11,
                            6
                        ]
                    ],
                    "10,2": [
                        "Prologue",
                        [
                            10,
                            2
                        ]
                    ]
                }
            }
        ],
        "tilesets": [
            "Prologue"
        ]
    }
]