[
    {
        "name": "DeathVincent",
        "trigger": "unit_death",
        "level_nid": null,
        "condition": "unit.nid == 'Vincent'",
        "commands": [],
        "only_once": false,
        "priority": 20,
        "_source": [
            "add_portrait;Vincent;FarLeft",
            "speak;Vincent;Oh damn...|I'm in big fucking trouble here...",
            "remove_portrait;Vincent"
        ]
    }
]