[
    {
        "name": "DeathBoaz",
        "trigger": "unit_death",
        "level_nid": null,
        "condition": "unit.nid == 'Boaz'",
        "commands": [],
        "only_once": false,
        "priority": 20,
        "_source": [
            "add_portrait;Boaz;FarLeft",
            "speak;Boaz;Hah! The hunter becomes the hunted!|You were a worthy opponent! Well done!",
            "remove_portrait;Boaz",
            "remove_unit;Boaz;warp"
        ]
    }
]