[
    {
        "name": "PartyLose",
        "trigger": "combat_end",
        "level_nid": "5",
        "condition": "len(game.get_units_in_party()) < 5",
        "commands": [],
        "only_once": false,
        "priority": 15,
        "_source": [
            "# Lose game when party size falls below three",
            "alert;You have lost too many members of your party.",
            "if;game.game_vars.get('_current_turnwheel_uses', 0) > 0",
            "activate_turnwheel",
            "else",
            "lose_game",
            "end"
        ]
    }
]