[
    {
        "name": "Midnight Rendezvous",
        "trigger": "on_base_convo",
        "level_nid": "8",
        "condition": "unit == 'Midnight Rendezvous'",
        "commands": [],
        "only_once": false,
        "priority": 20,
        "_source": [
            "# Coyote and Sam discuss passage into Rajas",
            "music;Toorimichi",
            "transition;Close",
            "change_background;TacticsRoom",
            "transition;Open",
            "multi_add_portrait;Sam;Right;Coyote;Left",
            "speak;Sam;... Coyote?|Uh... what a... um... pleasant surprise.{w}{clear}You do know it's two in the morning?",
            "speak;Coyote;I am aware.",
            "speak;Sam;Okay then...",
            "speak;Coyote;Rumor has it you're planning to assault Rajas.",
            "speak;Sam;Hmmm... It's a complicated problem.|Ulver has at least five hundred men stationed--{w}{clear}Wait. Back up. How'd did you find out?",
            "speak;Coyote;It doesn't matter.{w}{clear}Are you aware of the Order of the Templars?",
            "speak;Sam;Of course I'm aware.|What do you take me for?|I've looked into them myself, but they're a myth, nothing more.",
            "speak;Coyote;They're no myth.",
            "speak;Sam;You've met them?",
            "speak;Coyote;I have.",
            "speak;Sam;Pah...|The Templars were said to be the Solarch's most loyal protectors.|They were to defend the throne with their lives.|To snuff out dissent, they could appear anywhere in Rajas, at any time...|...|Are you suggesting--",
            "speak;Coyote;Tunnels. Under the city.",
            "speak;Sam;You expect me to believe--",
            "speak;Coyote;It's the only way in.",
            "speak;Sam;...*sigh*|If we can find one of these tunnels...",
            "move_portrait;Coyote;FarLeft",
            "speak;Coyote;I was never here. Got that?",
            "speak;Sam;Wait, what?",
            "speak;Coyote;I was never here.",
            "remove_portrait;Coyote",
            "speak;Sam;...There is something very wrong with that man...",
            "move_portrait;Sam;MidRight",
            "speak;Sam;What's this?",
            "give_item;Sam;Fortune;no_choice",
            "remove_portrait;Sam",
            "ignore_base_convo;Midnight Rendezvous",
            "transition;Close",
            "change_background",
            "transition;Open"
        ]
    }
]