[
    {
        "name": "Vendor",
        "trigger": "Vendor",
        "level_nid": "2",
        "condition": "True",
        "commands": [],
        "only_once": false,
        "priority": 20,
        "_source": [
            "transition;Close",
            "music;All Aboard to Rogueport",
            "shop;{unit};Glimmer,Heal,Fire,Vulnerary;vendor",
            "transition;Open"
        ]
    }
]