[
    {
        "nid": "Canto",
        "name": "Canto",
        "desc": "Can move again after certain actions.",
        "icon_nid": "Skills",
        "icon_index": [
            3,
            1
        ],
        "components": [
            [
                "class_skill",
                null
            ],
            [
                "canto",
                null
            ]
        ]
    }
]