[
    {
        "name": "Turn14",
        "trigger": "turn_change",
        "level_nid": "9",
        "condition": "game.turncount == 14",
        "commands": [],
        "only_once": false,
        "priority": 20,
        "_source": [
            "set_position;Rein",
            "move_cursor;{position}",
            "add_unit;p51;{position};warp;closest",
            "wait;500",
            "set_position;Rein",
            "move_cursor;{position}",
            "add_unit;p52;{position};warp;closest",
            "wait;500",
            "set_position;Rein",
            "move_cursor;{position}",
            "add_unit;p53;{position};warp;closest",
            "wait;500",
            "set_position;Rein",
            "move_cursor;{position}",
            "add_unit;p54;{position};warp;closest",
            "wait;500",
            "set_position;Rein",
            "move_cursor;{position}",
            "add_unit;p55;{position};warp;closest",
            "wait;500",
            "set_position;Rein",
            "move_cursor;{position}",
            "add_unit;p56;{position};warp;closest",
            "wait;500",
            "set_position;Rein",
            "move_cursor;{position}",
            "add_unit;p57;{position};warp;closest",
            "wait;500",
            "set_position;Rein",
            "move_cursor;{position}",
            "add_unit;p58;{position};warp;closest",
            "wait;500"
        ]
    }
]