[
    {
        "nid": "Brigham",
        "name": "Brigham",
        "desc": "Tasked with hunting down the Empire's fugitives.",
        "variant": null,
        "level": 6,
        "klass": "Shaman",
        "tags": [
            "Boss"
        ],
        "bases": {
            "HP": 19,
            "STR": 1,
            "MAG": 7,
            "SKL": 5,
            "SPD": 4,
            "LCK": 5,
            "DEF": 3,
            "RES": 6,
            "CON": 5,
            "MOV": 4
        },
        "growths": {
            "HP": 100,
            "STR": 0,
            "MAG": 100,
            "SKL": 50,
            "SPD": 50,
            "LCK": 50,
            "DEF": 0,
            "RES": 50,
            "CON": 0,
            "MOV": 0
        },
        "stat_cap_modifiers": {},
        "starting_items": [
            [
                "Flux",
                false
            ],
            [
                "Angelic Robe",
                true
            ]
        ],
        "learned_skills": [],
        "unit_notes": [],
        "wexp_gain": {
            "Sword": [
                false,
                0,
                null
            ],
            "Lance": [
                false,
                0,
                null
            ],
            "Axe": [
                false,
                0,
                null
            ],
            "Bow": [
                false,
                0,
                null
            ],
            "Light": [
                false,
                0,
                null
            ],
            "Anima": [
                false,
                0,
                null
            ],
            "Dark": [
                true,
                16,
                null
            ],
            "Default": [
                false,
                0,
                null
            ]
        },
        "alternate_classes": [],
        "portrait_nid": "Brigham",
        "affinity": null,
        "fields": []
    }
]