[
    {
        "nid": "fResistance +2",
        "name": "Resistance +2",
        "desc": "Grants RES +2.",
        "icon_nid": "Skills",
        "icon_index": [
            0,
            6
        ],
        "components": [
            [
                "feat",
                null
            ],
            [
                "stat_change",
                [
                    [
                        "RES",
                        2
                    ]
                ]
            ],
            [
                "class_skill",
                null
            ]
        ]
    }
]