[
    {
        "name": "Intro",
        "trigger": "level_start",
        "level_nid": "7",
        "condition": "True",
        "commands": [],
        "only_once": false,
        "priority": 20,
        "_source": [
            "add_weather;Light",
            "remove_unit;Marduk;immediate",
            "game_var;_max_turnwheel_uses;7",
            "game_var;_current_turnwheel_uses;7",
            "add_market_item;Spiritbane",
            "add_market_item;Barkskin",
            "if;game.check_alive('Coyote')",
            "add_base_convo;Training",
            "end",
            "if;game.check_alive('Theo') and game.game_vars['noir'] >= 3",
            "add_base_convo;Theo Sphinx, Pt. IV",
            "end",
            "# Show room",
            "change_tilemap;TacticsRoom",
            "add_unit;Sam;7,2;immediate",
            "add_unit;Ophie;12,6;immediate",
            "add_unit;Prim;10,6;immediate",
            "add_unit;Theo;10,9;immediate",
            "add_unit;Renae;2,9;immediate",
            "add_unit;Drake;5,6;immediate",
            "add_unit;Joel;9,7;immediate",
            "add_unit;Althea;3,6;immediate",
            "add_unit;Nia;13,9;immediate",
            "add_unit;Eliza;5,9;immediate",
            "add_unit;Kayla;2,4;immediate",
            "add_unit;Coyote;1,8;immediate",
            "transition;Open",
            "wait;500",
            "flicker_cursor;Sam",
            "transition;Close",
            "change_background;TacticsRoomDay",
            "change_tilemap;Chapter 7;reload",
            "transition;Open",
            "add_portrait;Sam;Right",
            "speak;Sam;Ahem. Gather round everyone...",
            "multi_add_portrait;Joel;MidLeft;Kayla;FarLeft",
            "if;game.game_vars['Civ_Escape'] >= 3",
            "speak;Sam;We've received some spoils from our last mission.",
            "give_item;Convoy;Yew Bow",
            "give_item;Convoy;Barkskin",
            "if;game.game_vars['Civ_Escape'] >= 5",
            "give_item;Convoy;Ruby",
            "end",
            "end",
            "speak;Sam;So then...|Our last few missions have been quite... challenging.",
            "speak;Joel;You're tellin' me...",
            "speak;Sam;Hopefully this next one will be easier.",
            "if;game.check_alive('Coyote') and game.check_alive('Kayla')",
            "speak;Sam;Especially with Coyote and Kayla in our roster.",
            "end",
            "speak;Sam;My sources--",
            "remove_portrait;Joel",
            "add_portrait;Ophie;MidLeft",
            "speak;Ophie;We know who your sources are, Sam.|She's standing right here.",
            "speak;Kayla;Tsk tsk. No need to ruin Sam's fun, Ophie.|You know playing at spymaster is the only thing he has left--",
            "speak;Sam;Ahem.|As I was saying, my sources, that is, the Confederacy,|determined the location of Duke Ulver's upcoming military plans.|Details of Imperial logistics would be an invaluable asset.",
            "speak;Ophie;Why can't the Confederacy do their own work for once?|We didn't ask to be at their beck and call.",
            "speak;Sam;Well, this information has value for both parties.{w}{clear}Plus, the Confederacy has been so far unsuccessful using stealth.|So... we're going to capture the plans by force!",
            "speak;Ophie;Of course...",
            "speak;Sam;We believe they are currently at Fort Bekal, which is nearby.|We'll leave after breakfast.|Hopefully the plans will be in hand by lunch.",
            "remove_portrait;Kayla",
            "add_portrait;Joel;FarLeft",
            "speak;Joel;Now that's my kind of mission!",
            "multi_remove_portrait;Joel;Sam;Ophie",
            "transition;Close",
            "# Base",
            "base;MainBase;The Journey to the West",
            "# Narration",
            "chapter_title",
            "# Intro",
            "music;Ambient Forest",
            "move_cursor;0,0;immediate",
            "change_background;Clearing",
            "transition;Open",
            "multi_add_portrait;Sam;Left;Kayla;Right",
            "speak;Sam;Hmmm.... There's a lot of them.|Duke Ulver has this place locked down.",
            "speak;Kayla;And look who's leading them!",
            "speak;Sam;Huh?",
            "speak;Kayla;See that black banner flying above the fort?",
            "speak;Sam;I don't recognize it...",
            "speak;Kayla;Tsk Tsk.|It's the flag of the elite Imperial tacticians.|This wasn't in the report. We'd better be on our guard.",
            "speak;Sam;Strange to see someone of that caliber posted to simple guard duty.",
            "speak;Kayla;All the more reason to get that information.",
            "speak;Sam;I just hope its worth the effort.",
            "speak;Kayla;Oh, it will be. Trust me.",
            "multi_remove_portrait;Kayla;Sam",
            "music;Mount Briggs",
            "transition;Close",
            "change_background",
            "transition;Open",
            "flicker_cursor;2,21",
            "transition;Close",
            "change_background;Bank",
            "transition;Open",
            "multi_add_portrait;Marduk;Left;Vagnius;Right",
            "speak;Vagnius;I can trust you then?",
            "speak;Marduk;Of course, milord. My plans have never failed!|Once the Resistance attacks, well, they're surely going to regret it!",
            "speak;Vagnius;Good, good. I want them wiped out.|No captives. No survivors.",
            "speak;Marduk;It's all been factored into the plan.|Which is flawless, by the way.|As long as they show up, of course.",
            "speak;Vagnius;Oh, they'll show alright.|We have a mole in the Confederacy.|We fed them false information that this fort was basically unguarded.",
            "speak;Marduk;Ah, but of course, it's not poorly guarded at all!|Genius, milord. I couldn't have come up with a better plan myself.",
            "speak;Vagnius;Perhaps that is why they kicked you out here to the colonies.",
            "speak;Marduk;Milord?",
            "speak;Vagnius;Nothing, nothing.|I'll trust you to see this through.",
            "remove_portrait;Vagnius",
            "speak;Marduk;Good day, milord.",
            "remove_portrait;Marduk",
            "add_portrait;Marduk;Right",
            "speak;Marduk;How dare he, insult my genius...|I'll show him.|I'll kill two Resistances!|See how he likes that!|Yeah...",
            "remove_portrait;Marduk",
            "transition;Close",
            "change_background",
            "transition;Open",
            "# Vagnius leaves",
            "add_unit;Vagnius;2,21",
            "wait;500",
            "move_unit;Vagnius;0,22",
            "remove_unit;Vagnius",
            "wait;500",
            "add_unit;Marduk;2,21",
            "# Vagnius leaves",
            "arrange_formation",
            "music;Airship Thunderchild",
            "wait;500",
            "move_cursor;27,0",
            "add_portrait;Sam;Left",
            "speak;Sam;Okay everyone, we need to hit this fort hard and fast.|We can't give their tactician any time to react and formulate a plan.",
            "add_portrait;Ophie;Right",
            "speak;Ophie;Right!",
            "multi_remove_portrait;Ophie;Sam",
            "prep;f;Preparing for Battle"
        ]
    }
]