[
    {
        "nid": "Sidney",
        "name": "Sidney",
        "desc": "A cruel Imperial lieutenant.",
        "variant": null,
        "level": 4,
        "klass": "Fighter",
        "tags": [],
        "bases": {
            "HP": 17,
            "STR": 5,
            "MAG": 0,
            "SKL": 3,
            "SPD": 3,
            "LCK": 0,
            "DEF": 3,
            "RES": 0,
            "CON": 8,
            "MOV": 5
        },
        "growths": {
            "HP": 100,
            "STR": 50,
            "MAG": 0,
            "SKL": 50,
            "SPD": 0,
            "LCK": 0,
            "DEF": 0,
            "RES": 0,
            "CON": 0,
            "MOV": 0
        },
        "stat_cap_modifiers": {},
        "starting_items": [
            [
                "Hand Axe",
                false
            ],
            [
                "Iron Axe",
                false
            ]
        ],
        "learned_skills": [],
        "unit_notes": [],
        "wexp_gain": {
            "Sword": [
                false,
                0,
                null
            ],
            "Lance": [
                false,
                0,
                null
            ],
            "Axe": [
                true,
                1,
                null
            ],
            "Bow": [
                false,
                0,
                null
            ],
            "Light": [
                false,
                0,
                null
            ],
            "Anima": [
                false,
                0,
                null
            ],
            "Dark": [
                false,
                0,
                null
            ],
            "Default": [
                false,
                0,
                null
            ]
        },
        "alternate_classes": [],
        "portrait_nid": "Sidney",
        "affinity": null,
        "fields": []
    }
]