[
    {
        "nid": "TLT_Lancebreaker",
        "name": "Lancebreaker",
        "desc": "Grants Hit/Avoid +30 against enemies wielding Lances.",
        "icon_nid": "Skills",
        "icon_index": [
            6,
            7
        ],
        "components": [
            [
                "dynamic_avoid",
                "30 if target.get_weapon() and item_system.weapon_type(target, target.get_weapon()) == 'Lance' else 0"
            ],
            [
                "dynamic_accuracy",
                "30 if target.get_weapon() and item_system.weapon_type(target, target.get_weapon()) == 'Lance' else 0"
            ]
        ]
    }
]