[
    {
        "nid": "0",
        "name": "Prologue",
        "tilemap": "Prologue",
        "bg_tilemap": null,
        "party": "Resistance",
        "music": {
            "player_phase": "Flight over Venice",
            "enemy_phase": "Brave Story 12",
            "other_phase": "Brave Story 12",
            "enemy2_phase": null,
            "player_battle": null,
            "enemy_battle": null,
            "other_battle": null,
            "enemy2_battle": null
        },
        "objective": {
            "simple": "Escape!",
            "win": "Escape the monastery",
            "loss": "Ophie dies,Prim dies"
        },
        "roam": false,
        "roam_unit": "Ophie",
        "go_to_overworld": false,
        "should_record": true,
        "units": [
            {
                "nid": "Ophie",
                "team": "player",
                "ai": "None",
                "roam_ai": null,
                "ai_group": null,
                "starting_position": [
                    9,
                    9
                ],
                "starting_traveler": null,
                "generic": false
            },
            {
                "nid": "Prim",
                "team": "player",
                "ai": "None",
                "roam_ai": null,
                "ai_group": null,
                "starting_position": [
                    10,
                    9
                ],
                "starting_traveler": null,
                "generic": false
            },
            {
                "nid": "Yohn",
                "team": "player",
                "ai": "None",
                "roam_ai": null,
                "ai_group": null,
                "starting_position": [
                    8,
                    9
                ],
                "starting_traveler": null,
                "generic": false
            },
            {
                "nid": "Vagnius",
                "team": "enemy",
                "ai": "None",
                "roam_ai": null,
                "ai_group": null,
                "starting_position": [
                    19,
                    5
                ],
                "starting_traveler": null,
                "generic": false
            },
            {
                "nid": "Sidney",
                "team": "enemy",
                "ai": "None",
                "roam_ai": null,
                "ai_group": null,
                "starting_position": [
                    18,
                    4
                ],
                "starting_traveler": null,
                "generic": false
            },
            {
                "nid": "S1",
                "variant": null,
                "level": 7,
                "klass": "Soldier",
                "faction": "Soldier",
                "starting_items": [
                    [
                        "Iron Lance",
                        false
                    ]
                ],
                "starting_skills": [],
                "team": "enemy",
                "ai": "Defend",
                "roam_ai": null,
                "ai_group": null,
                "starting_position": [
                    18,
                    5
                ],
                "starting_traveler": null,
                "generic": true
            },
            {
                "nid": "S2",
                "variant": null,
                "level": 7,
                "klass": "Soldier",
                "faction": "Soldier",
                "starting_items": [
                    [
                        "Iron Lance",
                        false
                    ]
                ],
                "starting_skills": [],
                "team": "enemy",
                "ai": "Defend",
                "roam_ai": null,
                "ai_group": null,
                "starting_position": [
                    19,
                    4
                ],
                "starting_traveler": null,
                "generic": true
            },
            {
                "nid": "S3",
                "variant": null,
                "level": 7,
                "klass": "Soldier",
                "faction": "Soldier",
                "starting_items": [
                    [
                        "Iron Lance",
                        false
                    ]
                ],
                "starting_skills": [],
                "team": "enemy",
                "ai": "Defend",
                "roam_ai": null,
                "ai_group": null,
                "starting_position": [
                    19,
                    6
                ],
                "starting_traveler": null,
                "generic": true
            },
            {
                "nid": "F1",
                "variant": null,
                "level": 1,
                "klass": "Fighter",
                "faction": "Soldier",
                "starting_items": [
                    [
                        "Hatchet",
                        false
                    ]
                ],
                "starting_skills": [],
                "team": "enemy",
                "ai": "Defend",
                "roam_ai": null,
                "ai_group": null,
                "starting_position": [
                    19,
                    3
                ],
                "starting_traveler": null,
                "generic": true
            },
            {
                "nid": "F2",
                "variant": null,
                "level": 1,
                "klass": "Fighter",
                "faction": "Soldier",
                "starting_items": [
                    [
                        "Hatchet",
                        false
                    ]
                ],
                "starting_skills": [],
                "team": "enemy",
                "ai": "Defend",
                "roam_ai": null,
                "ai_group": null,
                "starting_position": [
                    18,
                    3
                ],
                "starting_traveler": null,
                "generic": true
            },
            {
                "nid": "E1",
                "variant": null,
                "level": 1,
                "klass": "Fighter",
                "faction": "Soldier",
                "starting_items": [
                    [
                        "Iron Axe",
                        false
                    ]
                ],
                "starting_skills": [],
                "team": "enemy",
                "ai": "Pursue",
                "roam_ai": null,
                "ai_group": null,
                "starting_position": null,
                "starting_traveler": null,
                "generic": true
            },
            {
                "nid": "E2",
                "variant": null,
                "level": 1,
                "klass": "Soldier",
                "faction": "Soldier",
                "starting_items": [
                    [
                        "Slim Lance",
                        false
                    ]
                ],
                "starting_skills": [],
                "team": "enemy",
                "ai": "Pursue",
                "roam_ai": null,
                "ai_group": null,
                "starting_position": null,
                "starting_traveler": null,
                "generic": true
            },
            {
                "nid": "104",
                "variant": null,
                "level": 1,
                "klass": "Citizen",
                "faction": "Monk",
                "starting_items": [],
                "starting_skills": [],
                "team": "other",
                "ai": "None",
                "roam_ai": null,
                "ai_group": null,
                "starting_position": [
                    13,
                    4
                ],
                "starting_traveler": null,
                "generic": true
            },
            {
                "nid": "105",
                "variant": null,
                "level": 1,
                "klass": "Citizen",
                "faction": "Monk",
                "starting_items": [],
                "starting_skills": [],
                "team": "other",
                "ai": "None",
                "roam_ai": null,
                "ai_group": null,
                "starting_position": [
                    15,
                    5
                ],
                "starting_traveler": null,
                "generic": true
            },
            {
                "nid": "106",
                "variant": null,
                "level": 1,
                "klass": "Citizen",
                "faction": "Monk",
                "starting_items": [],
                "starting_skills": [],
                "team": "other",
                "ai": "None",
                "roam_ai": null,
                "ai_group": null,
                "starting_position": [
                    15,
                    3
                ],
                "starting_traveler": null,
                "generic": true
            },
            {
                "nid": "107",
                "variant": "Female",
                "level": 1,
                "klass": "Citizen",
                "faction": "Monk",
                "starting_items": [],
                "starting_skills": [],
                "team": "other",
                "ai": "None",
                "roam_ai": null,
                "ai_group": null,
                "starting_position": [
                    12,
                    5
                ],
                "starting_traveler": null,
                "generic": true
            },
            {
                "nid": "108",
                "variant": "Female",
                "level": 1,
                "klass": "Citizen",
                "faction": "Monk",
                "starting_items": [],
                "starting_skills": [],
                "team": "other",
                "ai": "None",
                "roam_ai": null,
                "ai_group": null,
                "starting_position": [
                    13,
                    3
                ],
                "starting_traveler": null,
                "generic": true
            },
            {
                "nid": "109",
                "variant": "Female",
                "level": 1,
                "klass": "Citizen",
                "faction": "Monk",
                "starting_items": [],
                "starting_skills": [],
                "team": "other",
                "ai": "None",
                "roam_ai": null,
                "ai_group": null,
                "starting_position": [
                    14,
                    4
                ],
                "starting_traveler": null,
                "generic": true
            }
        ],
        "regions": [
            {
                "nid": "Escape",
                "region_type": "event",
                "position": [
                    0,
                    0
                ],
                "size": [
                    1,
                    1
                ],
                "sub_nid": "Escape",
                "condition": "unit.team == 'player'",
                "time_left": null,
                "only_once": false,
                "interrupt_move": false
            }
        ],
        "unit_groups": [
            {
                "nid": "Citizen1",
                "units": [
                    "105",
                    "108",
                    "109"
                ],
                "positions": {}
            },
            {
                "nid": "Citizen2",
                "units": [
                    "104",
                    "106",
                    "107"
                ],
                "positions": {}
            }
        ],
        "ai_groups": []
    }
]