[
    {
        "name": "ChestSouth",
        "trigger": "Chest",
        "level_nid": "3",
        "condition": "region.nid == 'ChestSouth'",
        "commands": [],
        "only_once": true,
        "priority": 20,
        "_source": [
            "show_layer;ChestSouth",
            "unlock;{unit}",
            "give_money;2000",
            "has_attacked;{unit}"
        ]
    }
]