[
    {
        "nid": "Kiley",
        "name": "Kiley",
        "desc": "Jovial leader by acclamation of the Tyrana prisoners.",
        "variant": null,
        "level": 2,
        "klass": "Berserker",
        "tags": [],
        "bases": {
            "HP": 27,
            "STR": 12,
            "MAG": 1,
            "SKL": 9,
            "SPD": 8,
            "LCK": 6,
            "DEF": 5,
            "RES": 3,
            "CON": 10,
            "MOV": 6
        },
        "growths": {
            "HP": 0,
            "STR": 0,
            "MAG": 0,
            "SKL": 0,
            "SPD": 0,
            "LCK": 0,
            "DEF": 0,
            "RES": 0,
            "CON": 0,
            "MOV": 0
        },
        "stat_cap_modifiers": {},
        "starting_items": [
            [
                "Rusted Axe",
                false
            ]
        ],
        "learned_skills": [],
        "unit_notes": [],
        "wexp_gain": {
            "Sword": [
                false,
                0,
                null
            ],
            "Lance": [
                false,
                0,
                null
            ],
            "Axe": [
                true,
                71,
                null
            ],
            "Bow": [
                false,
                0,
                null
            ],
            "Light": [
                false,
                0,
                null
            ],
            "Anima": [
                false,
                0,
                null
            ],
            "Dark": [
                false,
                0,
                null
            ],
            "Default": [
                false,
                0,
                null
            ]
        },
        "alternate_classes": [],
        "portrait_nid": "Kiley",
        "affinity": null,
        "fields": []
    }
]