[
    {
        "name": "Ophie meets Renae",
        "trigger": "on_base_convo",
        "level_nid": "3",
        "condition": "unit == 'Ophie meets Renae'",
        "commands": [],
        "only_once": true,
        "priority": 20,
        "_source": [
            "music;Brave Story - Hare",
            "transition;Close",
            "change_background;MainBase",
            "transition;Open",
            "add_portrait;Renae;Left;;Smile",
            "speak;Renae;Hey Joel! Come on over!",
            "add_portrait;Joel;FarRight",
            "speak;Renae;Sit down!|Try some of this goulash! It's fantastic!",
            "add_portrait;Ophie;MidRight",
            "speak;Renae;And you brought a friend!",
            "speak;Joel;Renae, I cooked that goulash... for myself.",
            "speak;Renae;I know and it is delicious!|Now stop interrupting me.|Try some!",
            "speak;Ophie;Huh?",
            "speak;Renae;Eat it, its good for you.|...Probably.",
            "speak;Ophie;Uh okay.",
            "speak;Renae;What's your name, kid?",
            "speak;Ophie;Mrghghg...",
            "speak;Renae;Huh? You shouldn't talk with your mouth full, y'know.",
            "speak;Joel;Slow down, Renae.|Give the lad some time to compose himself, eh?",
            "speak;Ophie;--Gulp|Ophie.",
            "speak;Renae;Ophie! Nice to meet ya. I'm Renae!|I'm this group's, uh, subterfuge specialist!",
            "speak;Joel;Our thief.",
            "speak;Renae;Joel! I didn't want this kid to get the wrong idea!",
            "speak;Ophie;No, I understand.|You guys steal from the Empire, and give back to the common folk, right?",
            "speak;Renae;Uh... right!|Well, when we can.|Sam hasn't had us doing too much of that lately though.|Anyway, you're a swordsman, I take it?",
            "speak;Ophie;I was trained by the Rusonoon Monks, the best in Kerala.",
            "speak;Renae;Well then... Hiyaah!",
            "bop_portrait;Ophie",
            "speak;Ophie;Ah!|What the hell was that for?",
            "speak;Renae;Don't act so grouchy...|Just testing your reflexes.",
            "speak;Ophie;With a sword?!",
            "speak;Renae;Yeah! Luckily, you passed.|Here take this.",
            "give_item;Ophie;Rapier;no_choice",
            "speak;Ophie;The sword?",
            "speak;Renae;Hey! This is no ordinary sword!|This baby'll cut through the toughest armor like its butter!|It'll come in handy.",
            "speak;Ophie;Thanks, I think?",
            "speak;Renae;Well, now, off you go!|Let me finish my goulash in peace!",
            "speak;Ophie;Uh... right...",
            "multi_remove_portrait;Renae;Joel;Ophie",
            "ignore_base_convo;Ophie meets Renae",
            "transition;Close",
            "change_background",
            "transition;Open"
        ]
    }
]