[
    {
        "nid": "TLT_Slow",
        "name": "Slow",
        "desc": "Slow enemies struck by your weapons.",
        "icon_nid": "Skills",
        "icon_index": [
            2,
            10
        ],
        "components": [
            [
                "class_skill",
                null
            ],
            [
                "give_status_after_attack",
                "TLT_Slowed"
            ]
        ]
    }
]