[
    {
        "name": "Ruin1",
        "trigger": "Search",
        "level_nid": "4",
        "condition": "region.nid == 'Ruin1'",
        "commands": [],
        "only_once": true,
        "priority": 20,
        "_source": [
            "give_item;{unit};Wyrmsfire",
            "has_attacked;{unit}"
        ]
    }
]