[
    {
        "nid": "Wind",
        "name": "Wind Ward",
        "desc": "Grants wielder SPD +2.",
        "icon_nid": "Anima",
        "icon_index": [
            0,
            0
        ],
        "components": [
            [
                "weapon",
                null
            ],
            [
                "target_enemy",
                null
            ],
            [
                "level_exp",
                null
            ],
            [
                "damage",
                2
            ],
            [
                "hit",
                95
            ],
            [
                "weapon_type",
                "Anima"
            ],
            [
                "weapon_rank",
                "D"
            ],
            [
                "magic",
                null
            ],
            [
                "uses",
                30
            ],
            [
                "uses_options",
                {
                    "lose_uses_on_miss": false,
                    "one_loss_per_combat": false
                }
            ],
            [
                "status_on_equip",
                "Speed +2"
            ],
            [
                "value",
                720
            ],
            [
                "min_range",
                1
            ],
            [
                "max_range",
                2
            ]
        ]
    }
]