[
    {
        "nid": "Vincent",
        "name": "Vincent",
        "desc": "Boss of the Ghat mountain bandits",
        "variant": null,
        "level": 10,
        "klass": "Brigand",
        "tags": [
            "Boss"
        ],
        "bases": {
            "HP": 29,
            "STR": 11,
            "MAG": 0,
            "SKL": 7,
            "SPD": 7,
            "LCK": 1,
            "DEF": 7,
            "RES": 5,
            "CON": 9,
            "MOV": 5
        },
        "growths": {
            "HP": 0,
            "STR": 0,
            "MAG": 0,
            "SKL": 0,
            "SPD": 0,
            "LCK": 0,
            "DEF": 0,
            "RES": 0,
            "CON": 0,
            "MOV": 0
        },
        "stat_cap_modifiers": {},
        "starting_items": [
            [
                "Adamant Axe",
                false
            ],
            [
                "Short Axe",
                false
            ],
            [
                "Energy Ring",
                false
            ]
        ],
        "learned_skills": [],
        "unit_notes": [],
        "wexp_gain": {
            "Sword": [
                false,
                0,
                null
            ],
            "Lance": [
                false,
                0,
                null
            ],
            "Axe": [
                true,
                39,
                null
            ],
            "Bow": [
                false,
                0,
                null
            ],
            "Light": [
                false,
                0,
                null
            ],
            "Anima": [
                false,
                0,
                null
            ],
            "Dark": [
                false,
                0,
                null
            ],
            "Default": [
                false,
                0,
                null
            ]
        },
        "alternate_classes": [],
        "portrait_nid": "Vincent",
        "affinity": null,
        "fields": []
    }
]