[
    {
        "nid": "Wyrmsfire",
        "name": "Wyrmsfire",
        "desc": "Affects medium sized area.",
        "icon_nid": "Anima",
        "icon_index": [
            0,
            5
        ],
        "components": [
            [
                "spell",
                null
            ],
            [
                "weapon_type",
                "Anima"
            ],
            [
                "weapon_rank",
                "C"
            ],
            [
                "magic",
                null
            ],
            [
                "uses",
                10
            ],
            [
                "uses_options",
                {
                    "lose_uses_on_miss": false,
                    "one_loss_per_combat": false
                }
            ],
            [
                "blast_aoe",
                1
            ],
            [
                "hit",
                65
            ],
            [
                "damage",
                5
            ],
            [
                "map_cast_anim",
                "AOE_Wyrmsfire"
            ],
            [
                "value",
                2000
            ],
            [
                "min_range",
                2
            ],
            [
                "max_range",
                2
            ],
            [
                "target_tile",
                null
            ],
            [
                "level_exp",
                null
            ],
            [
                "map_hit_add_blend",
                [
                    224,
                    96,
                    0
                ]
            ]
        ]
    }
]