[
    {
        "name": "Turn5",
        "trigger": "turn_change",
        "level_nid": "10",
        "condition": "game.turncount == 5",
        "commands": [],
        "only_once": false,
        "priority": 20,
        "_source": [
            "change_ai;Ulver;Pursue",
            "# Attack nearby units and move toward allies",
            "change_ai;Adjutant;Heal",
            "flicker_cursor;Ulver",
            "add_portrait;Ulver;Left",
            "speak;Ulver;Hmmph.|I grow tired of this game. Let's finish this then.",
            "remove_portrait;Ulver",
            "wait;200",
            "move_unit;Ulver;12,22;warp;push",
            "center_cursor;12,22",
            "move_unit;Adjutant;12,15;warp;push",
            "wait;400",
            "add_group;bottom;;warp;push",
            "wait;1000",
            "# Dialogue",
            "add_portrait;Ulver;Left",
            "speak;Ulver;You have my attention.|Come and fight. May the strongest triumph!",
            "remove_portrait;Ulver",
            "add_portrait;Sam;Right",
            "speak;Sam;Everyone.|This is it. This is our chance.|Everyone outside is counting on us.|Kiley's army, the people of Podoma, and Kerala itself.|One last push. Give it your all.",
            "remove_portrait;Sam",
            "choice;battle_save;Would you like to save?;Yes,No;;h",
            "if;game.game_vars['battle_save'] == 'Yes'",
            "battle_save",
            "end"
        ]
    }
]