[
    {
        "name": "Infinite",
        "trigger": "turn_change",
        "level_nid": "5",
        "condition": "game.turncount == 14 or game.turncount == 16 or game.turncount >= 18",
        "commands": [],
        "only_once": false,
        "priority": 20,
        "_source": [
            "move_cursor;0,0",
            "# Summon three bandits from the topleft",
            "make_generic;;Brigand;{e:game.turncount - 4};enemy;Pursue;Bandit;;Steel Axe,Hand Axe",
            "give_skill;{created_unit};Void_Curse;no_banner",
            "add_unit;{created_unit};0,0;;closest",
            "make_generic;;Brigand;{e:game.turncount - 4};enemy;Pursue;Bandit;;Steel Axe,Hand Axe",
            "give_skill;{created_unit};Void_Curse;no_banner",
            "add_unit;{created_unit};0,0;;closest",
            "make_generic;;Brigand;{e:game.turncount - 4};enemy;Pursue;Bandit;;Steel Axe,Hand Axe",
            "give_skill;{created_unit};Void_Curse;no_banner",
            "add_unit;{created_unit};0,0;;closest",
            "wait;500",
            "#",
            "# Summon three bandits from the bottom",
            "center_cursor;15,16",
            "make_generic;;Brigand;{e:game.turncount - 4};enemy;Pursue;Bandit;;Steel Axe,Hand Axe",
            "give_skill;{created_unit};Void_Curse;no_banner",
            "add_unit;{created_unit};14,16;;closest",
            "make_generic;;Brigand;{e:game.turncount - 4};enemy;Pursue;Bandit;;Steel Axe,Hand Axe",
            "give_skill;{created_unit};Void_Curse;no_banner",
            "add_unit;{created_unit};15,16;;closest",
            "make_generic;;Brigand;{e:game.turncount - 4};enemy;Pursue;Bandit;;Steel Axe,Hand Axe",
            "give_skill;{created_unit};Void_Curse;no_banner",
            "add_unit;{created_unit};16,16;;closest",
            "wait;500"
        ]
    }
]