[
    {
        "nid": "Warlock",
        "name": "Warlock",
        "desc": "War shaman capable of incredible feats of magic.",
        "tier": 2,
        "movement_group": "Mages",
        "promotes_from": "Shaman",
        "turns_into": [],
        "tags": [],
        "max_level": 10,
        "bases": {
            "HP": 15,
            "STR": 1,
            "MAG": 4,
            "SKL": 3,
            "SPD": 4,
            "LCK": 0,
            "DEF": 3,
            "RES": 5,
            "CON": 6,
            "MOV": 5
        },
        "growths": {
            "HP": 65,
            "STR": 20,
            "MAG": 65,
            "SKL": 45,
            "SPD": 40,
            "LCK": 25,
            "DEF": 25,
            "RES": 55,
            "CON": 0,
            "MOV": 0
        },
        "growth_bonus": {
            "HP": 0,
            "STR": 0,
            "MAG": 0,
            "SKL": 0,
            "SPD": 0,
            "LCK": 0,
            "DEF": 0,
            "RES": 0,
            "CON": 0,
            "MOV": 0
        },
        "promotion": {
            "HP": 4,
            "STR": 0,
            "MAG": 2,
            "SKL": 2,
            "SPD": 3,
            "LCK": 0,
            "DEF": 2,
            "RES": 2,
            "CON": 1,
            "MOV": 1
        },
        "max_stats": {
            "HP": 40,
            "STR": 15,
            "MAG": 19,
            "SKL": 17,
            "SPD": 17,
            "LCK": 20,
            "DEF": 15,
            "RES": 19,
            "CON": 20,
            "MOV": 30
        },
        "learned_skills": [
            [
                3,
                "Feat"
            ],
            [
                5,
                "TLT_Metamagic"
            ],
            [
                8,
                "Feat"
            ]
        ],
        "wexp_gain": {
            "Sword": [
                false,
                0,
                null
            ],
            "Lance": [
                false,
                0,
                null
            ],
            "Axe": [
                false,
                0,
                null
            ],
            "Bow": [
                false,
                0,
                null
            ],
            "Light": [
                false,
                0,
                null
            ],
            "Anima": [
                false,
                0,
                null
            ],
            "Dark": [
                true,
                10,
                null
            ],
            "Default": [
                false,
                0,
                null
            ]
        },
        "icon_nid": "Generic_Portrait_Warlock",
        "icon_index": [
            0,
            0
        ],
        "map_sprite_nid": "Warlock",
        "combat_anim_nid": "Warlock",
        "fields": []
    }
]