[
    {
        "name": "FightAdjutant",
        "trigger": "combat_start",
        "level_nid": "10",
        "condition": "check_default('Adjutant', [])",
        "commands": [],
        "only_once": true,
        "priority": 20,
        "_source": [
            "add_portrait;Adjutant;Left",
            "speak;Adjutant;Insolent pests!|You should be grateful the Empire ever graced your backwoods province.",
            "remove_portrait;Adjutant"
        ]
    }
]