[
    {
        "name": "Turn5",
        "trigger": "turn_change",
        "level_nid": "4",
        "condition": "game.turncount == 5",
        "commands": [],
        "only_once": false,
        "priority": 20,
        "_source": [
            "music;Combat Theme 4",
            "move_cursor;0,0",
            "add_group;Pack7;Pack7;;closest",
            "wait;500",
            "move_cursor;0,16",
            "add_group;Pack8;Pack8;;closest",
            "wait;200",
            "flicker_cursor;Midas",
            "multi_add_portrait;Midas;FarRight;Anders;FarLeft",
            "speak;Midas;This isn't working!|You, soldier, attend me!",
            "add_portrait;SoldierRed;MidLeft;low_priority",
            "speak;SoldierRed;Aye, sir?;low_priority",
            "speak;Midas;We have to retreat. Order everyone back.",
            "speak;SoldierRed;Right away, sir.;low_priority",
            "remove_portrait;SoldierRed",
            "speak;Anders;Soldier! Belay that!",
            "add_portrait;SoldierRed;MidRight;low_priority",
            "speak;Midas;W-What!?",
            "speak;Anders;Shut yer mouth, you swaddled pig.|I will not disappoint the Duke.|We will lay down our lives in his name!",
            "speak;Midas;T-There has to be another way!",
            "if;game.game_vars.get('dead_wagons', 0) > 1",
            "speak;Midas;They've already struck down some of my best wagons!",
            "end",
            "speak;Anders;You sniveling craven.|Out of my way!",
            "multi_remove_portrait;Midas;Anders;SoldierRed"
        ]
    }
]