[
    {
        "nid": "HP",
        "name": "HP",
        "maximum": 40,
        "desc": "Hit points. The unit is removed from the battle if HP reaches 0.",
        "position": "hidden",
        "growth_colors": false
    },
    {
        "nid": "STR",
        "name": "Str",
        "maximum": 20,
        "desc": "Strength. The higher the number, the more damage you inflict.",
        "position": "left",
        "growth_colors": false
    },
    {
        "nid": "MAG",
        "name": "Mag",
        "maximum": 20,
        "desc": "Magical power. Increases spell and staff effectiveness.",
        "position": "left",
        "growth_colors": false
    },
    {
        "nid": "SKL",
        "name": "Skill",
        "maximum": 20,
        "desc": "Fighting skill. A higher number improves accuracy.",
        "position": "left",
        "growth_colors": false
    },
    {
        "nid": "SPD",
        "name": "Spd",
        "maximum": 20,
        "desc": "This affects both evasion and attack speed.",
        "position": "left",
        "growth_colors": false
    },
    {
        "nid": "LCK",
        "name": "Luck",
        "maximum": 20,
        "desc": "Luck affects many things.",
        "position": "right",
        "growth_colors": false
    },
    {
        "nid": "DEF",
        "name": "Def",
        "maximum": 20,
        "desc": "Reduces damage from weapons.",
        "position": "left",
        "growth_colors": false
    },
    {
        "nid": "RES",
        "name": "Res",
        "maximum": 20,
        "desc": "Reduces damage from magic.",
        "position": "left",
        "growth_colors": false
    },
    {
        "nid": "CON",
        "name": "Con",
        "maximum": 15,
        "desc": "Constitution. Affects how well the unit can wield heavier weapons.",
        "position": "right",
        "growth_colors": false
    },
    {
        "nid": "MOV",
        "name": "Move",
        "maximum": 15,
        "desc": "The distance you can move in one turn.",
        "position": "right",
        "growth_colors": false
    }
]