[
    {
        "name": "FightUlver",
        "trigger": "combat_start",
        "level_nid": "10",
        "condition": "check_default('Ulver', [])",
        "commands": [],
        "only_once": true,
        "priority": 20,
        "_source": [
            "add_portrait;Ulver;Left",
            "speak;Ulver;Come then. Test yourself against my strength!",
            "remove_portrait;Ulver"
        ]
    }
]