[
    {
        "nid": "Halberdier",
        "name": "Halberdier",
        "desc": "Veteran frontliners with inerring accuracy.",
        "tier": 2,
        "movement_group": "Armors",
        "promotes_from": "Soldier",
        "turns_into": [],
        "tags": [],
        "max_level": 10,
        "bases": {
            "HP": 17,
            "STR": 3,
            "MAG": 1,
            "SKL": 6,
            "SPD": 2,
            "LCK": 0,
            "DEF": 5,
            "RES": 2,
            "CON": 9,
            "MOV": 6
        },
        "growths": {
            "HP": 105,
            "STR": 65,
            "MAG": 15,
            "SKL": 70,
            "SPD": 60,
            "LCK": 35,
            "DEF": 40,
            "RES": 20,
            "CON": 0,
            "MOV": 0
        },
        "growth_bonus": {
            "HP": 0,
            "STR": 0,
            "MAG": 0,
            "SKL": 0,
            "SPD": 0,
            "LCK": 0,
            "DEF": 0,
            "RES": 0,
            "CON": 0,
            "MOV": 0
        },
        "promotion": {
            "HP": 4,
            "STR": 1,
            "MAG": 1,
            "SKL": 2,
            "SPD": 3,
            "LCK": 0,
            "DEF": 4,
            "RES": 2,
            "CON": 2,
            "MOV": 1
        },
        "max_stats": {
            "HP": 40,
            "STR": 18,
            "MAG": 15,
            "SKL": 20,
            "SPD": 17,
            "LCK": 20,
            "DEF": 19,
            "RES": 17,
            "CON": 20,
            "MOV": 30
        },
        "learned_skills": [
            [
                3,
                "Feat"
            ],
            [
                5,
                "TLT_Luna"
            ],
            [
                8,
                "Feat"
            ]
        ],
        "wexp_gain": {
            "Sword": [
                false,
                0,
                null
            ],
            "Lance": [
                true,
                10,
                null
            ],
            "Axe": [
                false,
                0,
                null
            ],
            "Bow": [
                false,
                0,
                null
            ],
            "Light": [
                false,
                0,
                null
            ],
            "Anima": [
                false,
                0,
                null
            ],
            "Dark": [
                false,
                0,
                null
            ],
            "Default": [
                false,
                0,
                null
            ]
        },
        "icon_nid": "Generic_Portrait_Halberdier",
        "icon_index": [
            0,
            0
        ],
        "map_sprite_nid": "Halberdier",
        "combat_anim_nid": "Halberdier",
        "fields": []
    }
]