[
    {
        "nid": "7",
        "name": "Chapter VII",
        "tilemap": "Chapter 7",
        "bg_tilemap": null,
        "party": "Resistance",
        "music": {
            "player_phase": "Airship Thunderchild",
            "enemy_phase": "The High Seas",
            "other_phase": null,
            "enemy2_phase": null,
            "player_battle": null,
            "enemy_battle": null,
            "other_battle": null,
            "enemy2_battle": null
        },
        "objective": {
            "simple": "Seize Fort",
            "win": "Seize the fort",
            "loss": "Ophie dies OR Sam dies,Party size falls below 5. Currently {eval:len(game.get_units_in_party())}"
        },
        "roam": false,
        "roam_unit": null,
        "go_to_overworld": false,
        "should_record": true,
        "units": [
            {
                "nid": "Marduk",
                "team": "enemy",
                "ai": "Guard",
                "roam_ai": null,
                "ai_group": null,
                "starting_position": [
                    2,
                    21
                ],
                "starting_traveler": null,
                "generic": false
            },
            {
                "nid": "Vagnius",
                "team": "enemy",
                "ai": "None",
                "roam_ai": null,
                "ai_group": null,
                "starting_position": null,
                "starting_traveler": null,
                "generic": false
            },
            {
                "nid": "101",
                "variant": null,
                "level": 1,
                "klass": "Warlock",
                "faction": "Claw",
                "starting_items": [
                    [
                        "Stun",
                        false
                    ]
                ],
                "starting_skills": [],
                "team": "enemy",
                "ai": "Guard",
                "roam_ai": null,
                "ai_group": null,
                "starting_position": [
                    7,
                    22
                ],
                "starting_traveler": null,
                "generic": true
            },
            {
                "nid": "102",
                "variant": null,
                "level": 1,
                "klass": "Warlock",
                "faction": "Claw",
                "starting_items": [
                    [
                        "Stun",
                        false
                    ]
                ],
                "starting_skills": [],
                "team": "enemy",
                "ai": "Guard",
                "roam_ai": null,
                "ai_group": null,
                "starting_position": [
                    3,
                    17
                ],
                "starting_traveler": null,
                "generic": true
            },
            {
                "nid": "103",
                "variant": null,
                "level": 10,
                "klass": "Mercenary",
                "faction": "Claw",
                "starting_items": [
                    [
                        "Iron Sword",
                        false
                    ]
                ],
                "starting_skills": [],
                "team": "enemy",
                "ai": "Attack",
                "roam_ai": null,
                "ai_group": "1",
                "starting_position": [
                    13,
                    4
                ],
                "starting_traveler": null,
                "generic": true
            },
            {
                "nid": "104",
                "variant": null,
                "level": 10,
                "klass": "Mercenary",
                "faction": "Claw",
                "starting_items": [
                    [
                        "Iron Sword",
                        false
                    ]
                ],
                "starting_skills": [],
                "team": "enemy",
                "ai": "Attack",
                "roam_ai": null,
                "ai_group": null,
                "starting_position": [
                    11,
                    7
                ],
                "starting_traveler": null,
                "generic": true
            },
            {
                "nid": "105",
                "variant": null,
                "level": 10,
                "klass": "Mercenary",
                "faction": "Claw",
                "starting_items": [
                    [
                        "Iron Sword",
                        false
                    ]
                ],
                "starting_skills": [],
                "team": "enemy",
                "ai": "Attack",
                "roam_ai": null,
                "ai_group": "1",
                "starting_position": [
                    17,
                    4
                ],
                "starting_traveler": null,
                "generic": true
            },
            {
                "nid": "106",
                "variant": null,
                "level": 10,
                "klass": "Mercenary",
                "faction": "Claw",
                "starting_items": [
                    [
                        "Iron Sword",
                        false
                    ]
                ],
                "starting_skills": [],
                "team": "enemy",
                "ai": "Attack",
                "roam_ai": null,
                "ai_group": "1",
                "starting_position": [
                    16,
                    3
                ],
                "starting_traveler": null,
                "generic": true
            },
            {
                "nid": "107",
                "variant": null,
                "level": 10,
                "klass": "Raider",
                "faction": "Claw",
                "starting_items": [
                    [
                        "Hand Axe",
                        false
                    ]
                ],
                "starting_skills": [],
                "team": "enemy",
                "ai": "Attack",
                "roam_ai": null,
                "ai_group": "1",
                "starting_position": [
                    14,
                    1
                ],
                "starting_traveler": null,
                "generic": true
            },
            {
                "nid": "108",
                "variant": null,
                "level": 10,
                "klass": "Raider",
                "faction": "Claw",
                "starting_items": [
                    [
                        "Hand Axe",
                        false
                    ]
                ],
                "starting_skills": [],
                "team": "enemy",
                "ai": "Defend",
                "roam_ai": null,
                "ai_group": "8",
                "starting_position": [
                    8,
                    5
                ],
                "starting_traveler": null,
                "generic": true
            },
            {
                "nid": "109",
                "variant": null,
                "level": 10,
                "klass": "Raider",
                "faction": "Claw",
                "starting_items": [
                    [
                        "Steel Axe",
                        false
                    ]
                ],
                "starting_skills": [],
                "team": "enemy",
                "ai": "Defend",
                "roam_ai": null,
                "ai_group": "8",
                "starting_position": [
                    9,
                    7
                ],
                "starting_traveler": null,
                "generic": true
            },
            {
                "nid": "110",
                "variant": null,
                "level": 10,
                "klass": "Raider",
                "faction": "Claw",
                "starting_items": [
                    [
                        "Steel Axe",
                        false
                    ]
                ],
                "starting_skills": [],
                "team": "enemy",
                "ai": "Attack",
                "roam_ai": null,
                "ai_group": "1",
                "starting_position": [
                    15,
                    6
                ],
                "starting_traveler": null,
                "generic": true
            },
            {
                "nid": "111",
                "variant": null,
                "level": 2,
                "klass": "Vanguard",
                "faction": "Claw",
                "starting_items": [
                    [
                        "Mithril Sword",
                        true
                    ]
                ],
                "starting_skills": [],
                "team": "enemy",
                "ai": "Attack",
                "roam_ai": null,
                "ai_group": "1",
                "starting_position": [
                    12,
                    5
                ],
                "starting_traveler": null,
                "generic": true
            },
            {
                "nid": "112",
                "variant": null,
                "level": 10,
                "klass": "Skirmisher",
                "faction": "Claw",
                "starting_items": [
                    [
                        "Iron Lance",
                        false
                    ]
                ],
                "starting_skills": [],
                "team": "enemy",
                "ai": "Attack",
                "roam_ai": null,
                "ai_group": "2",
                "starting_position": [
                    23,
                    10
                ],
                "starting_traveler": null,
                "generic": true
            },
            {
                "nid": "113",
                "variant": null,
                "level": 10,
                "klass": "Skirmisher",
                "faction": "Claw",
                "starting_items": [
                    [
                        "Iron Lance",
                        false
                    ]
                ],
                "starting_skills": [],
                "team": "enemy",
                "ai": "Attack",
                "roam_ai": null,
                "ai_group": "2",
                "starting_position": [
                    25,
                    11
                ],
                "starting_traveler": null,
                "generic": true
            },
            {
                "nid": "114",
                "variant": null,
                "level": 10,
                "klass": "Skirmisher",
                "faction": "Claw",
                "starting_items": [
                    [
                        "Iron Lance",
                        false
                    ]
                ],
                "starting_skills": [],
                "team": "enemy",
                "ai": "Attack",
                "roam_ai": null,
                "ai_group": "2",
                "starting_position": [
                    19,
                    12
                ],
                "starting_traveler": null,
                "generic": true
            },
            {
                "nid": "115",
                "variant": null,
                "level": 10,
                "klass": "Skirmisher",
                "faction": "Claw",
                "starting_items": [
                    [
                        "Iron Lance",
                        false
                    ]
                ],
                "starting_skills": [],
                "team": "enemy",
                "ai": "Attack",
                "roam_ai": null,
                "ai_group": "2",
                "starting_position": [
                    25,
                    13
                ],
                "starting_traveler": null,
                "generic": true
            },
            {
                "nid": "116",
                "variant": null,
                "level": 2,
                "klass": "Dragoon",
                "faction": "Claw",
                "starting_items": [
                    [
                        "Adamant Lance",
                        true
                    ]
                ],
                "starting_skills": [],
                "team": "enemy",
                "ai": "Attack",
                "roam_ai": null,
                "ai_group": "2",
                "starting_position": [
                    24,
                    11
                ],
                "starting_traveler": null,
                "generic": true
            },
            {
                "nid": "117",
                "variant": null,
                "level": 10,
                "klass": "Archer",
                "faction": "Claw",
                "starting_items": [
                    [
                        "Willow Bow",
                        false
                    ],
                    [
                        "Ruby",
                        true
                    ]
                ],
                "starting_skills": [],
                "team": "enemy",
                "ai": "Defend",
                "roam_ai": null,
                "ai_group": "",
                "starting_position": [
                    4,
                    13
                ],
                "starting_traveler": null,
                "generic": true
            },
            {
                "nid": "118",
                "variant": null,
                "level": 10,
                "klass": "Raider",
                "faction": "Claw",
                "starting_items": [
                    [
                        "Iron Axe",
                        false
                    ]
                ],
                "starting_skills": [],
                "team": "enemy",
                "ai": "Defend",
                "roam_ai": null,
                "ai_group": "7",
                "starting_position": [
                    8,
                    12
                ],
                "starting_traveler": null,
                "generic": true
            },
            {
                "nid": "120",
                "variant": null,
                "level": 10,
                "klass": "Skirmisher",
                "faction": "Claw",
                "starting_items": [
                    [
                        "Iron Lance",
                        false
                    ]
                ],
                "starting_skills": [],
                "team": "enemy",
                "ai": "Attack",
                "roam_ai": null,
                "ai_group": "8",
                "starting_position": [
                    9,
                    9
                ],
                "starting_traveler": null,
                "generic": true
            },
            {
                "nid": "121",
                "variant": null,
                "level": 10,
                "klass": "Skirmisher",
                "faction": "Claw",
                "starting_items": [
                    [
                        "Iron Lance",
                        false
                    ]
                ],
                "starting_skills": [],
                "team": "enemy",
                "ai": "Attack",
                "roam_ai": null,
                "ai_group": "8",
                "starting_position": [
                    7,
                    8
                ],
                "starting_traveler": null,
                "generic": true
            },
            {
                "nid": "122",
                "variant": null,
                "level": 2,
                "klass": "Dragoon",
                "faction": "Claw",
                "starting_items": [
                    [
                        "Steel Lance",
                        false
                    ]
                ],
                "starting_skills": [],
                "team": "enemy",
                "ai": "Defend",
                "roam_ai": null,
                "ai_group": "6",
                "starting_position": [
                    3,
                    16
                ],
                "starting_traveler": null,
                "generic": true
            },
            {
                "nid": "123",
                "variant": null,
                "level": 10,
                "klass": "Mercenary",
                "faction": "Claw",
                "starting_items": [
                    [
                        "Steel Sword",
                        false
                    ]
                ],
                "starting_skills": [],
                "team": "enemy",
                "ai": "Attack",
                "roam_ai": null,
                "ai_group": "4",
                "starting_position": [
                    16,
                    18
                ],
                "starting_traveler": null,
                "generic": true
            },
            {
                "nid": "124",
                "variant": null,
                "level": 10,
                "klass": "Mercenary",
                "faction": "Claw",
                "starting_items": [
                    [
                        "Steel Sword",
                        false
                    ]
                ],
                "starting_skills": [],
                "team": "enemy",
                "ai": "Attack",
                "roam_ai": null,
                "ai_group": "4",
                "starting_position": [
                    18,
                    18
                ],
                "starting_traveler": null,
                "generic": true
            },
            {
                "nid": "125",
                "variant": null,
                "level": 10,
                "klass": "Mercenary",
                "faction": "Claw",
                "starting_items": [
                    [
                        "Steel Sword",
                        false
                    ]
                ],
                "starting_skills": [],
                "team": "enemy",
                "ai": "Attack",
                "roam_ai": null,
                "ai_group": "4",
                "starting_position": [
                    17,
                    17
                ],
                "starting_traveler": null,
                "generic": true
            },
            {
                "nid": "126",
                "variant": null,
                "level": 10,
                "klass": "Mercenary",
                "faction": "Claw",
                "starting_items": [
                    [
                        "Steel Sword",
                        false
                    ]
                ],
                "starting_skills": [],
                "team": "enemy",
                "ai": "Attack",
                "roam_ai": null,
                "ai_group": "4",
                "starting_position": [
                    17,
                    19
                ],
                "starting_traveler": null,
                "generic": true
            },
            {
                "nid": "127",
                "variant": null,
                "level": 2,
                "klass": "Vanguard",
                "faction": "Claw",
                "starting_items": [
                    [
                        "Steel Sword",
                        false
                    ],
                    [
                        "Elixir",
                        true
                    ]
                ],
                "starting_skills": [],
                "team": "enemy",
                "ai": "Attack",
                "roam_ai": null,
                "ai_group": "4",
                "starting_position": [
                    17,
                    18
                ],
                "starting_traveler": null,
                "generic": true
            },
            {
                "nid": "128",
                "variant": null,
                "level": 10,
                "klass": "Raider",
                "faction": "Claw",
                "starting_items": [
                    [
                        "Steel Axe",
                        false
                    ]
                ],
                "starting_skills": [],
                "team": "enemy",
                "ai": "Attack",
                "roam_ai": null,
                "ai_group": "4",
                "starting_position": [
                    18,
                    15
                ],
                "starting_traveler": null,
                "generic": true
            },
            {
                "nid": "129",
                "variant": null,
                "level": 10,
                "klass": "Raider",
                "faction": "Claw",
                "starting_items": [
                    [
                        "Adamant Axe",
                        true
                    ]
                ],
                "starting_skills": [],
                "team": "enemy",
                "ai": "Defend",
                "roam_ai": null,
                "ai_group": "5",
                "starting_position": [
                    11,
                    19
                ],
                "starting_traveler": null,
                "generic": true
            },
            {
                "nid": "130",
                "variant": null,
                "level": 10,
                "klass": "Raider",
                "faction": "Claw",
                "starting_items": [
                    [
                        "Steel Axe",
                        false
                    ]
                ],
                "starting_skills": [],
                "team": "enemy",
                "ai": "Attack",
                "roam_ai": null,
                "ai_group": "4",
                "starting_position": [
                    21,
                    18
                ],
                "starting_traveler": null,
                "generic": true
            },
            {
                "nid": "131",
                "variant": null,
                "level": 10,
                "klass": "Archer",
                "faction": "Claw",
                "starting_items": [
                    [
                        "Willow Bow",
                        false
                    ],
                    [
                        "Ruby",
                        true
                    ]
                ],
                "starting_skills": [],
                "team": "enemy",
                "ai": "Defend",
                "roam_ai": null,
                "ai_group": "",
                "starting_position": [
                    15,
                    22
                ],
                "starting_traveler": null,
                "generic": true
            },
            {
                "nid": "132",
                "variant": null,
                "level": 10,
                "klass": "Mercenary",
                "faction": "Claw",
                "starting_items": [
                    [
                        "Steel Sword",
                        false
                    ]
                ],
                "starting_skills": [],
                "team": "enemy",
                "ai": "Defend",
                "roam_ai": null,
                "ai_group": "6",
                "starting_position": [
                    2,
                    16
                ],
                "starting_traveler": null,
                "generic": true
            },
            {
                "nid": "133",
                "variant": null,
                "level": 10,
                "klass": "Mercenary",
                "faction": "Claw",
                "starting_items": [
                    [
                        "Steel Sword",
                        false
                    ]
                ],
                "starting_skills": [],
                "team": "enemy",
                "ai": "Defend",
                "roam_ai": null,
                "ai_group": "6",
                "starting_position": [
                    4,
                    17
                ],
                "starting_traveler": null,
                "generic": true
            },
            {
                "nid": "134",
                "variant": null,
                "level": 10,
                "klass": "Mercenary",
                "faction": "Claw",
                "starting_items": [
                    [
                        "Steel Sword",
                        false
                    ]
                ],
                "starting_skills": [],
                "team": "enemy",
                "ai": "Defend",
                "roam_ai": null,
                "ai_group": "5",
                "starting_position": [
                    8,
                    21
                ],
                "starting_traveler": null,
                "generic": true
            },
            {
                "nid": "135",
                "variant": null,
                "level": 10,
                "klass": "Mercenary",
                "faction": "Claw",
                "starting_items": [
                    [
                        "Steel Sword",
                        false
                    ]
                ],
                "starting_skills": [],
                "team": "enemy",
                "ai": "Defend",
                "roam_ai": null,
                "ai_group": "5",
                "starting_position": [
                    8,
                    23
                ],
                "starting_traveler": null,
                "generic": true
            },
            {
                "nid": "136",
                "variant": null,
                "level": 2,
                "klass": "Vanguard",
                "faction": "Claw",
                "starting_items": [
                    [
                        "Steel Sword",
                        false
                    ],
                    [
                        "Hand Axe",
                        false
                    ]
                ],
                "starting_skills": [],
                "team": "enemy",
                "ai": "Defend",
                "roam_ai": null,
                "ai_group": "6",
                "starting_position": [
                    1,
                    22
                ],
                "starting_traveler": null,
                "generic": true
            },
            {
                "nid": "137",
                "variant": null,
                "level": 2,
                "klass": "Dragoon",
                "faction": "Claw",
                "starting_items": [
                    [
                        "Steel Lance",
                        false
                    ],
                    [
                        "Javelin",
                        false
                    ]
                ],
                "starting_skills": [],
                "team": "enemy",
                "ai": "Defend",
                "roam_ai": null,
                "ai_group": "5",
                "starting_position": [
                    3,
                    22
                ],
                "starting_traveler": null,
                "generic": true
            },
            {
                "nid": "138",
                "variant": null,
                "level": 10,
                "klass": "Brigand",
                "faction": "Bandit",
                "starting_items": [
                    [
                        "Iron Axe",
                        false
                    ]
                ],
                "starting_skills": [],
                "team": "enemy",
                "ai": "Pursue",
                "roam_ai": null,
                "ai_group": null,
                "starting_position": null,
                "starting_traveler": null,
                "generic": true
            },
            {
                "nid": "139",
                "variant": null,
                "level": 10,
                "klass": "Brigand",
                "faction": "Bandit",
                "starting_items": [
                    [
                        "Steel Axe",
                        false
                    ]
                ],
                "starting_skills": [],
                "team": "enemy",
                "ai": "Pursue",
                "roam_ai": null,
                "ai_group": null,
                "starting_position": null,
                "starting_traveler": null,
                "generic": true
            },
            {
                "nid": "140",
                "variant": null,
                "level": 10,
                "klass": "Brigand",
                "faction": "Bandit",
                "starting_items": [
                    [
                        "Steel Axe",
                        false
                    ]
                ],
                "starting_skills": [],
                "team": "enemy",
                "ai": "Pursue",
                "roam_ai": null,
                "ai_group": null,
                "starting_position": null,
                "starting_traveler": null,
                "generic": true
            },
            {
                "nid": "141",
                "variant": null,
                "level": 10,
                "klass": "Brigand",
                "faction": "Bandit",
                "starting_items": [
                    [
                        "Short Axe",
                        true
                    ]
                ],
                "starting_skills": [],
                "team": "enemy",
                "ai": "Pursue",
                "roam_ai": null,
                "ai_group": null,
                "starting_position": null,
                "starting_traveler": null,
                "generic": true
            },
            {
                "nid": "142",
                "variant": null,
                "level": 10,
                "klass": "Brigand",
                "faction": "Bandit",
                "starting_items": [
                    [
                        "Iron Axe",
                        false
                    ]
                ],
                "starting_skills": [],
                "team": "enemy",
                "ai": "Pursue",
                "roam_ai": null,
                "ai_group": null,
                "starting_position": null,
                "starting_traveler": null,
                "generic": true
            },
            {
                "nid": "143",
                "variant": null,
                "level": 10,
                "klass": "Brigand",
                "faction": "Bandit",
                "starting_items": [
                    [
                        "Steel Axe",
                        false
                    ]
                ],
                "starting_skills": [],
                "team": "enemy",
                "ai": "Pursue",
                "roam_ai": null,
                "ai_group": null,
                "starting_position": null,
                "starting_traveler": null,
                "generic": true
            },
            {
                "nid": "144",
                "variant": null,
                "level": 10,
                "klass": "Brigand",
                "faction": "Bandit",
                "starting_items": [
                    [
                        "Steel Axe",
                        false
                    ]
                ],
                "starting_skills": [],
                "team": "enemy",
                "ai": "Pursue",
                "roam_ai": null,
                "ai_group": null,
                "starting_position": null,
                "starting_traveler": null,
                "generic": true
            },
            {
                "nid": "145",
                "variant": null,
                "level": 10,
                "klass": "Brigand",
                "faction": "Bandit",
                "starting_items": [
                    [
                        "Mithril Axe",
                        true
                    ]
                ],
                "starting_skills": [],
                "team": "enemy",
                "ai": "Pursue",
                "roam_ai": null,
                "ai_group": null,
                "starting_position": null,
                "starting_traveler": null,
                "generic": true
            },
            {
                "nid": "146",
                "variant": null,
                "level": 10,
                "klass": "Dracoknight",
                "faction": "Claw",
                "starting_items": [
                    [
                        "Steel Lance",
                        false
                    ]
                ],
                "starting_skills": [],
                "team": "enemy",
                "ai": "Pursue",
                "roam_ai": null,
                "ai_group": null,
                "starting_position": null,
                "starting_traveler": null,
                "generic": true
            },
            {
                "nid": "147",
                "variant": null,
                "level": 10,
                "klass": "Dracoknight",
                "faction": "Claw",
                "starting_items": [
                    [
                        "Iron Lance",
                        false
                    ]
                ],
                "starting_skills": [],
                "team": "enemy",
                "ai": "Pursue",
                "roam_ai": null,
                "ai_group": null,
                "starting_position": null,
                "starting_traveler": null,
                "generic": true
            },
            {
                "nid": "148",
                "variant": null,
                "level": 10,
                "klass": "Dracoknight",
                "faction": "Claw",
                "starting_items": [
                    [
                        "Javelin",
                        false
                    ]
                ],
                "starting_skills": [],
                "team": "enemy",
                "ai": "Pursue",
                "roam_ai": null,
                "ai_group": null,
                "starting_position": null,
                "starting_traveler": null,
                "generic": true
            },
            {
                "nid": "149",
                "variant": null,
                "level": 10,
                "klass": "Dracoknight",
                "faction": "Claw",
                "starting_items": [
                    [
                        "Iron Lance",
                        false
                    ]
                ],
                "starting_skills": [],
                "team": "enemy",
                "ai": "Pursue",
                "roam_ai": null,
                "ai_group": null,
                "starting_position": null,
                "starting_traveler": null,
                "generic": true
            },
            {
                "nid": "150",
                "variant": null,
                "level": 10,
                "klass": "Dracoknight",
                "faction": "Claw",
                "starting_items": [
                    [
                        "Steel Lance",
                        false
                    ]
                ],
                "starting_skills": [],
                "team": "enemy",
                "ai": "Pursue",
                "roam_ai": null,
                "ai_group": null,
                "starting_position": null,
                "starting_traveler": null,
                "generic": true
            },
            {
                "nid": "151",
                "variant": null,
                "level": 10,
                "klass": "Dracoknight",
                "faction": "Claw",
                "starting_items": [
                    [
                        "Iron Lance",
                        false
                    ]
                ],
                "starting_skills": [],
                "team": "enemy",
                "ai": "Pursue",
                "roam_ai": null,
                "ai_group": null,
                "starting_position": null,
                "starting_traveler": null,
                "generic": true
            },
            {
                "nid": "152",
                "variant": null,
                "level": 10,
                "klass": "Dracoknight",
                "faction": "Claw",
                "starting_items": [
                    [
                        "Javelin",
                        false
                    ]
                ],
                "starting_skills": [],
                "team": "enemy",
                "ai": "Pursue",
                "roam_ai": null,
                "ai_group": null,
                "starting_position": null,
                "starting_traveler": null,
                "generic": true
            },
            {
                "nid": "153",
                "variant": null,
                "level": 10,
                "klass": "Dracoknight",
                "faction": "Claw",
                "starting_items": [
                    [
                        "Iron Lance",
                        false
                    ]
                ],
                "starting_skills": [],
                "team": "enemy",
                "ai": "Pursue",
                "roam_ai": null,
                "ai_group": null,
                "starting_position": null,
                "starting_traveler": null,
                "generic": true
            },
            {
                "nid": "154",
                "variant": null,
                "level": 10,
                "klass": "Dracoknight",
                "faction": "Claw",
                "starting_items": [
                    [
                        "Steel Lance",
                        false
                    ]
                ],
                "starting_skills": [],
                "team": "enemy",
                "ai": "Pursue",
                "roam_ai": null,
                "ai_group": null,
                "starting_position": null,
                "starting_traveler": null,
                "generic": true
            },
            {
                "nid": "155",
                "variant": null,
                "level": 10,
                "klass": "Dracoknight",
                "faction": "Claw",
                "starting_items": [
                    [
                        "Iron Lance",
                        false
                    ]
                ],
                "starting_skills": [],
                "team": "enemy",
                "ai": "Pursue",
                "roam_ai": null,
                "ai_group": null,
                "starting_position": null,
                "starting_traveler": null,
                "generic": true
            },
            {
                "nid": "156",
                "variant": null,
                "level": 10,
                "klass": "Dracoknight",
                "faction": "Claw",
                "starting_items": [
                    [
                        "Javelin",
                        false
                    ]
                ],
                "starting_skills": [],
                "team": "enemy",
                "ai": "Pursue",
                "roam_ai": null,
                "ai_group": null,
                "starting_position": null,
                "starting_traveler": null,
                "generic": true
            },
            {
                "nid": "157",
                "variant": null,
                "level": 10,
                "klass": "Dracoknight",
                "faction": "Claw",
                "starting_items": [
                    [
                        "Iron Lance",
                        false
                    ]
                ],
                "starting_skills": [],
                "team": "enemy",
                "ai": "Pursue",
                "roam_ai": null,
                "ai_group": null,
                "starting_position": null,
                "starting_traveler": null,
                "generic": true
            },
            {
                "nid": "158",
                "variant": null,
                "level": 1,
                "klass": "Sage",
                "faction": "Claw",
                "starting_items": [
                    [
                        "Wind",
                        false
                    ]
                ],
                "starting_skills": [],
                "team": "enemy",
                "ai": "Defend",
                "roam_ai": null,
                "ai_group": "5",
                "starting_position": [
                    8,
                    22
                ],
                "starting_traveler": null,
                "generic": true
            }
        ],
        "regions": [
            {
                "nid": "Seize",
                "region_type": "event",
                "position": [
                    2,
                    21
                ],
                "size": [
                    1,
                    1
                ],
                "sub_nid": "Seize",
                "condition": "True",
                "time_left": null,
                "only_once": false,
                "interrupt_move": false
            },
            {
                "nid": "Armory",
                "region_type": "event",
                "position": [
                    21,
                    1
                ],
                "size": [
                    1,
                    1
                ],
                "sub_nid": "Armory",
                "condition": "True",
                "time_left": null,
                "only_once": false,
                "interrupt_move": false
            },
            {
                "nid": "Vendor",
                "region_type": "event",
                "position": [
                    23,
                    6
                ],
                "size": [
                    1,
                    1
                ],
                "sub_nid": "Vendor",
                "condition": "True",
                "time_left": null,
                "only_once": false,
                "interrupt_move": false
            },
            {
                "nid": "RuinWest",
                "region_type": "event",
                "position": [
                    3,
                    6
                ],
                "size": [
                    1,
                    1
                ],
                "sub_nid": "Search",
                "condition": "True",
                "time_left": null,
                "only_once": true,
                "interrupt_move": false
            },
            {
                "nid": "RuinEast",
                "region_type": "event",
                "position": [
                    27,
                    14
                ],
                "size": [
                    1,
                    1
                ],
                "sub_nid": "Search",
                "condition": "True",
                "time_left": null,
                "only_once": true,
                "interrupt_move": false
            },
            {
                "nid": "RuinSouth",
                "region_type": "event",
                "position": [
                    23,
                    21
                ],
                "size": [
                    1,
                    1
                ],
                "sub_nid": "Search",
                "condition": "True",
                "time_left": null,
                "only_once": true,
                "interrupt_move": false
            },
            {
                "nid": "Formation1",
                "region_type": "formation",
                "position": [
                    26,
                    0
                ],
                "size": [
                    2,
                    1
                ],
                "sub_nid": "",
                "condition": "True",
                "time_left": null,
                "only_once": false,
                "interrupt_move": false
            },
            {
                "nid": "Formation2",
                "region_type": "formation",
                "position": [
                    24,
                    1
                ],
                "size": [
                    2,
                    1
                ],
                "sub_nid": null,
                "condition": "True",
                "time_left": null,
                "only_once": false,
                "interrupt_move": false
            },
            {
                "nid": "Formation3",
                "region_type": "formation",
                "position": [
                    25,
                    2
                ],
                "size": [
                    2,
                    1
                ],
                "sub_nid": null,
                "condition": "True",
                "time_left": null,
                "only_once": false,
                "interrupt_move": false
            },
            {
                "nid": "Formation4",
                "region_type": "formation",
                "position": [
                    27,
                    3
                ],
                "size": [
                    1,
                    1
                ],
                "sub_nid": null,
                "condition": "True",
                "time_left": null,
                "only_once": false,
                "interrupt_move": false
            },
            {
                "nid": "Formation5",
                "region_type": "formation",
                "position": [
                    27,
                    1
                ],
                "size": [
                    1,
                    1
                ],
                "sub_nid": null,
                "condition": "True",
                "time_left": null,
                "only_once": false,
                "interrupt_move": false
            },
            {
                "nid": "Formation6",
                "region_type": "formation",
                "position": [
                    23,
                    0
                ],
                "size": [
                    1,
                    1
                ],
                "sub_nid": null,
                "condition": "True",
                "time_left": null,
                "only_once": false,
                "interrupt_move": false
            },
            {
                "nid": "Formation7",
                "region_type": "formation",
                "position": [
                    23,
                    2
                ],
                "size": [
                    1,
                    1
                ],
                "sub_nid": null,
                "condition": "True",
                "time_left": null,
                "only_once": false,
                "interrupt_move": false
            },
            {
                "nid": "Formation8",
                "region_type": "formation",
                "position": [
                    25,
                    3
                ],
                "size": [
                    1,
                    1
                ],
                "sub_nid": "",
                "condition": "True",
                "time_left": null,
                "only_once": false,
                "interrupt_move": false
            },
            {
                "nid": "Formation9",
                "region_type": "formation",
                "position": [
                    26,
                    4
                ],
                "size": [
                    1,
                    1
                ],
                "sub_nid": null,
                "condition": "True",
                "time_left": null,
                "only_once": false,
                "interrupt_move": false
            },
            {
                "nid": "RexAegis",
                "region_type": "status",
                "position": [
                    2,
                    21
                ],
                "size": [
                    1,
                    1
                ],
                "sub_nid": "TLT_Rex_Aegis",
                "condition": "True",
                "time_left": null,
                "only_once": false,
                "interrupt_move": false
            }
        ],
        "unit_groups": [
            {
                "nid": "BanditWest",
                "units": [
                    "138",
                    "139",
                    "140",
                    "141"
                ],
                "positions": {
                    "138": [
                        1,
                        0
                    ],
                    "139": [
                        2,
                        0
                    ],
                    "140": [
                        0,
                        1
                    ],
                    "141": [
                        0,
                        2
                    ]
                }
            },
            {
                "nid": "BanditEast",
                "units": [
                    "142",
                    "143",
                    "144",
                    "145"
                ],
                "positions": {
                    "142": [
                        27,
                        22
                    ],
                    "143": [
                        27,
                        21
                    ],
                    "144": [
                        26,
                        23
                    ],
                    "145": [
                        25,
                        23
                    ]
                }
            },
            {
                "nid": "WyvernWest",
                "units": [
                    "146",
                    "147",
                    "148",
                    "149"
                ],
                "positions": {
                    "146": [
                        1,
                        0
                    ],
                    "147": [
                        2,
                        0
                    ],
                    "148": [
                        0,
                        1
                    ],
                    "149": [
                        0,
                        2
                    ]
                }
            },
            {
                "nid": "WyvernSouth",
                "units": [
                    "150",
                    "151",
                    "152",
                    "153"
                ],
                "positions": {
                    "150": [
                        1,
                        23
                    ],
                    "151": [
                        2,
                        23
                    ],
                    "152": [
                        0,
                        22
                    ],
                    "153": [
                        0,
                        21
                    ]
                }
            },
            {
                "nid": "WyvernEast",
                "units": [
                    "154",
                    "155",
                    "156",
                    "157"
                ],
                "positions": {
                    "157": [
                        25,
                        23
                    ],
                    "156": [
                        26,
                        23
                    ],
                    "155": [
                        27,
                        22
                    ],
                    "154": [
                        27,
                        21
                    ]
                }
            }
        ],
        "ai_groups": [
            {
                "nid": "5",
                "trigger_threshold": 1
            },
            {
                "nid": "4",
                "trigger_threshold": 1
            },
            {
                "nid": "7",
                "trigger_threshold": 1
            },
            {
                "nid": "2",
                "trigger_threshold": 1
            },
            {
                "nid": "1",
                "trigger_threshold": 1
            },
            {
                "nid": "8",
                "trigger_threshold": 1
            },
            {
                "nid": "6",
                "trigger_threshold": 1
            }
        ]
    }
]