[
    {
        "nid": "Myrmidon",
        "name": "Myrmidon",
        "desc": "Swordfighters with superior speed and skill.",
        "tier": 1,
        "movement_group": "Light Foot",
        "promotes_from": null,
        "turns_into": [
            "Swordmaster"
        ],
        "tags": [],
        "max_level": 10,
        "bases": {
            "HP": 11,
            "STR": 3,
            "MAG": 1,
            "SKL": 6,
            "SPD": 7,
            "LCK": 0,
            "DEF": 1,
            "RES": 1,
            "CON": 5,
            "MOV": 5
        },
        "growths": {
            "HP": 95,
            "STR": 45,
            "MAG": 35,
            "SKL": 65,
            "SPD": 60,
            "LCK": 60,
            "DEF": 20,
            "RES": 35,
            "CON": 0,
            "MOV": 0
        },
        "growth_bonus": {
            "HP": 0,
            "STR": 0,
            "MAG": 0,
            "SKL": 0,
            "SPD": 0,
            "LCK": 0,
            "DEF": 0,
            "RES": 0,
            "CON": 0,
            "MOV": 0
        },
        "promotion": {
            "HP": 0,
            "STR": 0,
            "MAG": 0,
            "SKL": 0,
            "SPD": 0,
            "LCK": 0,
            "DEF": 0,
            "RES": 0,
            "CON": 0,
            "MOV": 0
        },
        "max_stats": {
            "HP": 40,
            "STR": 15,
            "MAG": 15,
            "SKL": 15,
            "SPD": 15,
            "LCK": 20,
            "DEF": 15,
            "RES": 15,
            "CON": 20,
            "MOV": 30
        },
        "learned_skills": [
            [
                1,
                "TLT_Riposte"
            ],
            [
                5,
                "TLT_Vantage"
            ],
            [
                8,
                "Feat"
            ]
        ],
        "wexp_gain": {
            "Sword": [
                true,
                1,
                null
            ],
            "Lance": [
                false,
                0,
                null
            ],
            "Axe": [
                false,
                0,
                null
            ],
            "Bow": [
                false,
                0,
                null
            ],
            "Light": [
                false,
                0,
                null
            ],
            "Anima": [
                false,
                0,
                null
            ],
            "Dark": [
                false,
                0,
                null
            ],
            "Default": [
                false,
                0,
                null
            ]
        },
        "icon_nid": "Generic_Portrait_Myrmidon",
        "icon_index": [
            0,
            0
        ],
        "map_sprite_nid": "Myrmidon",
        "combat_anim_nid": "Myrmidon",
        "fields": []
    }
]