[
    {
        "nid": "Mage",
        "name": "Mage",
        "desc": "Curious practioners of anima magic.",
        "tier": 1,
        "movement_group": "Mages",
        "promotes_from": null,
        "turns_into": [
            "Sage"
        ],
        "tags": [],
        "max_level": 10,
        "bases": {
            "HP": 11,
            "STR": 0,
            "MAG": 1,
            "SKL": 1,
            "SPD": 2,
            "LCK": 0,
            "DEF": 1,
            "RES": 2,
            "CON": 4,
            "MOV": 5
        },
        "growths": {
            "HP": 75,
            "STR": 15,
            "MAG": 75,
            "SKL": 45,
            "SPD": 65,
            "LCK": 40,
            "DEF": 20,
            "RES": 45,
            "CON": 0,
            "MOV": 0
        },
        "growth_bonus": {
            "HP": 0,
            "STR": 0,
            "MAG": 0,
            "SKL": 0,
            "SPD": 0,
            "LCK": 0,
            "DEF": 0,
            "RES": 0,
            "CON": 0,
            "MOV": 0
        },
        "promotion": {
            "HP": 0,
            "STR": 0,
            "MAG": 0,
            "SKL": 0,
            "SPD": 0,
            "LCK": 0,
            "DEF": 0,
            "RES": 0,
            "CON": 0,
            "MOV": 0
        },
        "max_stats": {
            "HP": 40,
            "STR": 15,
            "MAG": 15,
            "SKL": 15,
            "SPD": 15,
            "LCK": 20,
            "DEF": 15,
            "RES": 15,
            "CON": 20,
            "MOV": 30
        },
        "learned_skills": [
            [
                1,
                "TLT_Focus"
            ],
            [
                5,
                "TLT_Conductance"
            ],
            [
                8,
                "Feat"
            ]
        ],
        "wexp_gain": {
            "Sword": [
                false,
                0,
                null
            ],
            "Lance": [
                false,
                0,
                null
            ],
            "Axe": [
                false,
                0,
                null
            ],
            "Bow": [
                false,
                0,
                null
            ],
            "Light": [
                false,
                0,
                null
            ],
            "Anima": [
                true,
                1,
                null
            ],
            "Dark": [
                false,
                0,
                null
            ],
            "Default": [
                false,
                0,
                null
            ]
        },
        "icon_nid": "Generic_Portrait_Mage (1)",
        "icon_index": [
            0,
            0
        ],
        "map_sprite_nid": "Mage",
        "combat_anim_nid": "Mage",
        "fields": []
    }
]