[
    {
        "name": "Intro",
        "trigger": "level_start",
        "level_nid": "DEBUG",
        "condition": "True",
        "commands": [],
        "only_once": false,
        "priority": 20,
        "_source": [
            "level_var;_fog_of_war;1",
            "level_var;_fog_of_war_radius;5",
            "#base;",
            "#add_portrait;Ophie;Left",
            "#speak;Ophie;Wow!",
            "#remove_portrait;Ophie"
        ]
    }
]