[
    {
        "name": "DeathVagnius",
        "trigger": "unit_death",
        "level_nid": null,
        "condition": "unit.nid == 'Vagnius'",
        "commands": [],
        "only_once": false,
        "priority": 20,
        "_source": [
            "add_portrait;Vagnius;FarLeft",
            "speak;Vagnius;Is this... truly the extent of my ambition...?|Urgh...",
            "remove_portrait;Vagnius"
        ]
    }
]