[
    {
        "name": "DoorSouth",
        "trigger": "Door",
        "level_nid": "6",
        "condition": "region.nid == 'DoorSouth'",
        "commands": [],
        "only_once": false,
        "priority": 20,
        "_source": [
            "show_layer;DoorSouth",
            "unlock;{unit}",
            "change_ai;Kiley;AttackEscape",
            "change_ai;Coyote;Pursue",
            "transition;Close",
            "change_background;Prison",
            "transition;Open",
            "multi_add_portrait;Kiley;MidLeft;Coyote;FarLeft",
            "speak;Kiley;Heh! Looks like you were right, mate.",
            "speak;Coyote;...",
            "remove_portrait;Coyote",
            "remove_portrait;Kiley",
            "add_portrait;Kiley;MidLeft;mirror",
            "speak;Kiley;Hey, Coyote!{w} Boy!|Where are you going?|Don't you want to escape?",
            "wait;200",
            "speak;Kiley;...Shiver me timbers, that boy's got something biting him.",
            "remove_portrait;Kiley",
            "transition;Close",
            "change_background",
            "transition;Open",
            "has_attacked;{unit}",
            "move_unit;Coyote;12,32;;closest",
            "reset;Coyote"
        ]
    }
]