[
    {
        "nid": "Luna_proc",
        "name": "Luna",
        "desc": "Adds target's resist to damage",
        "icon_nid": "Skills",
        "icon_index": [
            4,
            3
        ],
        "components": [
            [
                "hidden",
                null
            ],
            [
                "dynamic_damage",
                "combat_calcs.defense(unit, target, None, item)"
            ],
            [
                "unit_flickering_tint",
                [
                    0,
                    128,
                    248
                ]
            ]
        ]
    }
]