[
    {
        "nid": "Restore",
        "name": "Restore",
        "desc": "Removes all temporary statuses.",
        "icon_nid": "Light",
        "icon_index": [
            0,
            9
        ],
        "components": [
            [
                "spell",
                null
            ],
            [
                "target_ally",
                null
            ],
            [
                "weapon_type",
                "Light"
            ],
            [
                "weapon_rank",
                "B"
            ],
            [
                "magic",
                null
            ],
            [
                "uses",
                5
            ],
            [
                "uses_options",
                {
                    "lose_uses_on_miss": false,
                    "one_loss_per_combat": false
                }
            ],
            [
                "value",
                1000
            ],
            [
                "min_range",
                0
            ],
            [
                "max_range",
                5
            ],
            [
                "restore",
                null
            ],
            [
                "map_hit_add_blend",
                [
                    96,
                    144,
                    232
                ]
            ]
        ]
    }
]