[
    {
        "nid": "Brigand",
        "name": "Brigand",
        "desc": "Ruffians with a strong offense but poor defense.",
        "tier": 1,
        "movement_group": "Fleet",
        "promotes_from": null,
        "turns_into": [],
        "tags": [],
        "max_level": 10,
        "bases": {
            "HP": 13,
            "STR": 3,
            "MAG": 0,
            "SKL": 1,
            "SPD": 3,
            "LCK": 0,
            "DEF": 2,
            "RES": 0,
            "CON": 9,
            "MOV": 5
        },
        "growths": {
            "HP": 110,
            "STR": 65,
            "MAG": 0,
            "SKL": 40,
            "SPD": 25,
            "LCK": 20,
            "DEF": 15,
            "RES": 15,
            "CON": 0,
            "MOV": 0
        },
        "growth_bonus": {
            "HP": 0,
            "STR": 0,
            "MAG": 0,
            "SKL": 0,
            "SPD": 0,
            "LCK": 0,
            "DEF": 0,
            "RES": 0,
            "CON": 0,
            "MOV": 0
        },
        "promotion": {
            "HP": 0,
            "STR": 0,
            "MAG": 0,
            "SKL": 0,
            "SPD": 0,
            "LCK": 0,
            "DEF": 0,
            "RES": 0,
            "CON": 0,
            "MOV": 0
        },
        "max_stats": {
            "HP": 40,
            "STR": 15,
            "MAG": 15,
            "SKL": 15,
            "SPD": 15,
            "LCK": 20,
            "DEF": 15,
            "RES": 15,
            "CON": 20,
            "MOV": 30
        },
        "learned_skills": [
            [
                1,
                "TLT_Fleet_of_Foot"
            ],
            [
                5,
                "Shove"
            ],
            [
                8,
                "Feat"
            ]
        ],
        "wexp_gain": {
            "Sword": [
                false,
                0,
                null
            ],
            "Lance": [
                false,
                0,
                null
            ],
            "Axe": [
                true,
                1,
                null
            ],
            "Bow": [
                false,
                0,
                null
            ],
            "Light": [
                false,
                0,
                null
            ],
            "Anima": [
                false,
                0,
                null
            ],
            "Dark": [
                false,
                0,
                null
            ],
            "Default": [
                false,
                0,
                null
            ]
        },
        "icon_nid": "Generic_Portrait_Brigand",
        "icon_index": [
            0,
            0
        ],
        "map_sprite_nid": "Brigand",
        "combat_anim_nid": "Brigand",
        "fields": []
    }
]