[
    {
        "name": "LineCross2",
        "trigger": "turn_change",
        "level_nid": "6",
        "condition": "game.turncount == game.level_vars['line_cross'] + 1 and game.turncount > 2",
        "commands": [],
        "only_once": true,
        "priority": 20,
        "_source": [
            "center_cursor;6,0",
            "wait;200",
            "add_unit;l81;5,0",
            "add_unit;l82;7,0",
            "wait;1000",
            "center_cursor;18,0",
            "wait;200",
            "add_unit;r81;17,0",
            "add_unit;r82;19,0",
            "wait;1000"
        ]
    }
]