[
    {
        "name": "Escape",
        "trigger": "Escape",
        "level_nid": null,
        "condition": "True",
        "commands": [],
        "only_once": false,
        "priority": 20,
        "_source": [
            "remove_unit;{unit}",
            "wait;400",
            "if;not any(unit.team == \"player\" for unit in game.units if unit.position)",
            "win_game",
            "end"
        ]
    }
]