[
    {
        "nid": "Raider",
        "name": "Raider",
        "desc": "Untrained but fanatical combatant.",
        "tier": 1,
        "movement_group": "Pirates",
        "promotes_from": null,
        "turns_into": [
            "Berserker"
        ],
        "tags": [],
        "max_level": 10,
        "bases": {
            "HP": 15,
            "STR": 3,
            "MAG": 0,
            "SKL": 1,
            "SPD": 4,
            "LCK": 0,
            "DEF": 2,
            "RES": 0,
            "CON": 7,
            "MOV": 5
        },
        "growths": {
            "HP": 100,
            "STR": 65,
            "MAG": 5,
            "SKL": 35,
            "SPD": 45,
            "LCK": 20,
            "DEF": 15,
            "RES": 15,
            "CON": 0,
            "MOV": 0
        },
        "growth_bonus": {
            "HP": 0,
            "STR": 0,
            "MAG": 0,
            "SKL": 0,
            "SPD": 0,
            "LCK": 0,
            "DEF": 0,
            "RES": 0,
            "CON": 0,
            "MOV": 0
        },
        "promotion": {
            "HP": 0,
            "STR": 0,
            "MAG": 0,
            "SKL": 0,
            "SPD": 0,
            "LCK": 0,
            "DEF": 0,
            "RES": 0,
            "CON": 0,
            "MOV": 0
        },
        "max_stats": {
            "HP": 40,
            "STR": 15,
            "MAG": 15,
            "SKL": 15,
            "SPD": 15,
            "LCK": 20,
            "DEF": 15,
            "RES": 15,
            "CON": 20,
            "MOV": 30
        },
        "learned_skills": [
            [
                1,
                "TLT_Prescience"
            ],
            [
                5,
                "Shove"
            ],
            [
                8,
                "Feat"
            ]
        ],
        "wexp_gain": {
            "Sword": [
                false,
                0,
                null
            ],
            "Lance": [
                false,
                0,
                null
            ],
            "Axe": [
                true,
                1,
                null
            ],
            "Bow": [
                false,
                0,
                null
            ],
            "Light": [
                false,
                0,
                null
            ],
            "Anima": [
                false,
                0,
                null
            ],
            "Dark": [
                false,
                0,
                null
            ],
            "Default": [
                false,
                0,
                null
            ]
        },
        "icon_nid": "Generic_Portrait_Pirate",
        "icon_index": [
            0,
            0
        ],
        "map_sprite_nid": "Pirate",
        "combat_anim_nid": "Raider",
        "fields": []
    }
]