[
    {
        "nid": "TLT_Defense_Aura",
        "name": "Defense Aura",
        "desc": "Aura. Grants allies DEF +2.",
        "icon_nid": "Skills",
        "icon_index": [
            7,
            4
        ],
        "components": [
            [
                "aura",
                "Aura_Defense_Child"
            ],
            [
                "class_skill",
                null
            ],
            [
                "aura_range",
                3
            ],
            [
                "aura_target",
                "ally"
            ]
        ]
    }
]