[
    {
        "name": "FightPrimVagnius",
        "trigger": "combat_start",
        "level_nid": "8",
        "condition": "check_pair('Prim', 'Vagnius')",
        "commands": [],
        "only_once": true,
        "priority": 20,
        "_source": [
            "multi_add_portrait;Vagnius;Left;Prim;Right",
            "speak;Prim;How could you do this... These people are innocent!",
            "speak;Vagnius;Innocence?|Hah. The morals of a child.|I care not for your innocence.|Power. That is all I seek.",
            "speak;Prim;But...",
            "speak;Vagnius;Spare me your bleatings and die!",
            "multi_remove_portrait;Prim;Vagnius"
        ]
    }
]