[
    {
        "name": "Turn1",
        "trigger": "turn_change",
        "level_nid": "10",
        "condition": "game.turncount == 1",
        "commands": [],
        "only_once": false,
        "priority": 20,
        "_source": [
            "music;Dragon Boy",
            "center_cursor;12,22",
            "add_portrait;Ophie;Right",
            "speak;Ophie;Now where is he!",
            "# Adjutant appears",
            "move_unit;Adjutant;12,18;warp",
            "wait;1000",
            "add_portrait;Adjutant;Left",
            "move_portrait;Ophie;FarRight",
            "speak;Ophie;!",
            "speak;Adjutant;Duke Ulver sends his regards.|He regrets to inform you that he is occupied at the moment.",
            "add_portrait;Sam;MidRight",
            "speak;Sam;He knew we were coming?",
            "speak;Adjutant;Duke Ulver is well aware of your plans.",
            "speak;Ophie;But--",
            "speak;Adjutant;My boy, do not fret.|The Duke has graciously decided to provide you with...|alternative entertainment.",
            "multi_remove_portrait;Adjutant;Ophie;Sam",
            "center_cursor;12,8",
            "show_layer;BlockTop",
            "wait;1000",
            "center_cursor;12,36",
            "show_layer;BlockBottom",
            "wait;1000",
            "center_cursor;17,27",
            "add_group;bottomright;;warp;push",
            "wait;1000",
            "center_cursor;7,17",
            "add_group;topleft;;warp;push",
            "wait;1000",
            "multi_add_portrait;Sam;FarRight;Adjutant;Left;Ophie;MidRight",
            "speak;Sam;It's a trap!",
            "speak;Adjutant;How astute.|With that kind of acumen, it's no wonder you've come so far.{w}{clear}Well, I'm off to more important matters.|The Duke will see you in a bit...|If you can survive that long.",
            "multi_remove_portrait;Sam;Adjutant;Ophie",
            "move_unit;Adjutant;11,3;warp",
            "wait;1000",
            "multi_add_portrait;Sam;Right;Ophie;Left",
            "speak;Sam;Oh... I've blundered.|To think we could take on the Duke.|It was a pipe dream all along.",
            "speak;Ophie;Sam, I doubted you once.|But no longer.|We couldn't have made it this far without your leadership.|But that means you can't give up now.|Together, we'll finish this.",
            "remove_portrait;Sam",
            "# Now it cycles through remaining characters final quotes",
            "if;game.check_alive('Prim')",
            "add_portrait;Prim;Right",
            "speak;Prim;I'll not give up hope.",
            "remove_portrait;Prim",
            "end",
            "if;game.check_alive('Joel')",
            "add_portrait;Joel;Right",
            "speak;Joel;I ain't usually one for waxin' sentimental,|but it's not everyday you take on the might of the Empire.|Bein' in the Resistance ain't easy,|but I wouldn't trade it for anythin'.",
            "remove_portrait;Joel",
            "end",
            "if;game.check_alive('Nia')",
            "add_portrait;Nia;Right",
            "speak;Nia;Mmm...",
            "remove_portrait;Nia",
            "end",
            "if;game.check_alive('Althea')",
            "add_portrait;Althea;Right",
            "speak;Althea;I can never thank you all enough.|I will try my best!",
            "remove_portrait;Althea",
            "end",
            "if;game.check_alive('Drake')",
            "add_portrait;Drake;Right",
            "speak;Drake;To restore Althea to the throne...|My life is nothing in comparison to such a glorious goal.",
            "remove_portrait;Drake",
            "end",
            "if;game.check_alive('Renae')",
            "add_portrait;Renae;Right",
            "speak;Renae;They don't stand a chance with me on your side.",
            "remove_portrait;Renae",
            "end",
            "if;game.check_alive('Theo')",
            "add_portrait;Theo;Right",
            "speak;Theo;To be a part of history.|I never imagined such an end.",
            "remove_portrait;Theo",
            "end",
            "if;game.check_alive('Eliza')",
            "add_portrait;Eliza;Right",
            "speak;Eliza;You're all idiots.|But you're my idiots!|I won't let you down.",
            "remove_portrait;Eliza",
            "end",
            "if;game.check_alive('Kayla')",
            "add_portrait;Kayla;Right",
            "speak;Kayla;Tsk tsk. We'll pull through.|I guarantee it.",
            "remove_portrait;Kayla",
            "end",
            "if;game.check_alive('Coyote')",
            "add_portrait;Coyote;Right",
            "speak;Coyote;...I will repay my debts.",
            "remove_portrait;Coyote",
            "end",
            "speak;Ophie;If we give it our all...|Well, by the light, what are we waiting for!|Let's go!",
            "remove_portrait;Ophie"
        ]
    }
]