[
    {
        "name": "WinGame",
        "trigger": "combat_end",
        "level_nid": "1",
        "condition": "game.check_dead('Sidney')",
        "commands": [],
        "only_once": false,
        "priority": 20,
        "_source": [
            "# Win game on Sidney's death",
            "win_game"
        ]
    }
]