[
    {
        "nid": "TLT_Slowed",
        "name": "Slowed",
        "desc": "Inflicts MOV -3.",
        "icon_nid": "Skills",
        "icon_index": [
            3,
            0
        ],
        "components": [
            [
                "stat_change",
                [
                    [
                        "MOV",
                        -3
                    ]
                ]
            ],
            [
                "unit_anim",
                "MapStatDecrease"
            ],
            [
                "negative",
                null
            ],
            [
                "time",
                2
            ]
        ]
    }
]