[
    {
        "name": "FightOphieVagnius",
        "trigger": "combat_start",
        "level_nid": "0",
        "condition": "check_pair('Ophie', 'Vagnius')",
        "commands": [],
        "only_once": true,
        "priority": 20,
        "_source": [
            "music;Durchriss",
            "multi_add_portrait;Vagnius;Left;Ophie;Right",
            "speak;Vagnius;Hmmph! You're not the one I seek!|Out of my way!",
            "multi_remove_portrait;Ophie;Vagnius"
        ]
    }
]