[
    {
        "nid": "Althea's Charm",
        "name": "Althea's Charm",
        "desc": "Grants LCK +10.",
        "icon_nid": "Boosters",
        "icon_index": [
            0,
            11
        ],
        "components": [
            [
                "status_on_hold",
                "Luck +10"
            ],
            [
                "value",
                4000
            ]
        ]
    }
]