[
    {
        "nid": "Midas",
        "name": "Midas",
        "desc": "A greedy Imperial merchant.",
        "variant": null,
        "level": 5,
        "klass": "Wagon",
        "tags": [
            "Boss"
        ],
        "bases": {
            "HP": 17,
            "STR": 0,
            "MAG": 0,
            "SKL": 3,
            "SPD": 5,
            "LCK": 0,
            "DEF": 3,
            "RES": 2,
            "CON": 5,
            "MOV": 6
        },
        "growths": {
            "HP": 0,
            "STR": 0,
            "MAG": 0,
            "SKL": 0,
            "SPD": 0,
            "LCK": 0,
            "DEF": 0,
            "RES": 0,
            "CON": 0,
            "MOV": 0
        },
        "stat_cap_modifiers": {},
        "starting_items": [
            [
                "Sapphire",
                true
            ]
        ],
        "learned_skills": [],
        "unit_notes": [],
        "wexp_gain": {
            "Sword": [
                false,
                0,
                null
            ],
            "Lance": [
                false,
                0,
                null
            ],
            "Axe": [
                false,
                0,
                null
            ],
            "Bow": [
                false,
                0,
                null
            ],
            "Light": [
                false,
                0,
                null
            ],
            "Anima": [
                false,
                0,
                null
            ],
            "Dark": [
                false,
                0,
                null
            ],
            "Default": [
                false,
                0,
                null
            ]
        },
        "alternate_classes": [],
        "portrait_nid": "Midas",
        "affinity": null,
        "fields": []
    }
]