[
    {
        "nid": "Aura_Skill_Child",
        "name": "Skill +3",
        "desc": "Grants SKL +3.",
        "icon_nid": "Skills",
        "icon_index": [
            0,
            3
        ],
        "components": [
            [
                "stat_change",
                [
                    [
                        "SKL",
                        3
                    ]
                ]
            ]
        ]
    }
]