[
    {
        "name": "Turn6",
        "trigger": "turn_change",
        "level_nid": "8",
        "condition": "game.turncount == 6",
        "commands": [],
        "only_once": false,
        "priority": 20,
        "_source": [
            "center_cursor;30,19",
            "add_group;Shaman1;;;closest",
            "wait;500"
        ]
    }
]