[
    {
        "nid": "Gustblade",
        "name": "Gustblade",
        "desc": "Uses MAG to determine damage. Grants wielder SPD +2.",
        "icon_nid": "Sword",
        "icon_index": [
            0,
            16
        ],
        "components": [
            [
                "weapon",
                null
            ],
            [
                "target_enemy",
                null
            ],
            [
                "level_exp",
                null
            ],
            [
                "damage",
                2
            ],
            [
                "hit",
                95
            ],
            [
                "weapon_type",
                "Sword"
            ],
            [
                "weapon_rank",
                "D"
            ],
            [
                "uses",
                25
            ],
            [
                "uses_options",
                {
                    "lose_uses_on_miss": false,
                    "one_loss_per_combat": false
                }
            ],
            [
                "weight",
                6
            ],
            [
                "magic",
                null
            ],
            [
                "status_on_equip",
                "Speed +2"
            ],
            [
                "value",
                1500
            ],
            [
                "min_range",
                1
            ],
            [
                "max_range",
                2
            ]
        ]
    }
]