[
    {
        "nid": "General",
        "name": "General",
        "desc": "Defensive stalwarts able to take a hit.",
        "tier": 2,
        "movement_group": "Armors",
        "promotes_from": "Knight",
        "turns_into": [],
        "tags": [],
        "max_level": 10,
        "bases": {
            "HP": 17,
            "STR": 6,
            "MAG": 0,
            "SKL": 4,
            "SPD": 4,
            "LCK": 0,
            "DEF": 8,
            "RES": 4,
            "CON": 10,
            "MOV": 5
        },
        "growths": {
            "HP": 105,
            "STR": 55,
            "MAG": 15,
            "SKL": 40,
            "SPD": 20,
            "LCK": 35,
            "DEF": 55,
            "RES": 35,
            "CON": 0,
            "MOV": 0
        },
        "growth_bonus": {
            "HP": 0,
            "STR": 0,
            "MAG": 0,
            "SKL": 0,
            "SPD": 0,
            "LCK": 0,
            "DEF": 0,
            "RES": 0,
            "CON": 0,
            "MOV": 0
        },
        "promotion": {
            "HP": 6,
            "STR": 3,
            "MAG": 0,
            "SKL": 2,
            "SPD": 3,
            "LCK": 0,
            "DEF": 2,
            "RES": 3,
            "CON": 1,
            "MOV": 1
        },
        "max_stats": {
            "HP": 40,
            "STR": 19,
            "MAG": 15,
            "SKL": 18,
            "SPD": 15,
            "LCK": 20,
            "DEF": 20,
            "RES": 17,
            "CON": 20,
            "MOV": 30
        },
        "learned_skills": [
            [
                3,
                "Feat"
            ],
            [
                5,
                "TLT_Slow"
            ],
            [
                8,
                "Feat"
            ]
        ],
        "wexp_gain": {
            "Sword": [
                true,
                16,
                null
            ],
            "Lance": [
                true,
                1,
                null
            ],
            "Axe": [
                true,
                16,
                null
            ],
            "Bow": [
                false,
                0,
                null
            ],
            "Light": [
                false,
                0,
                null
            ],
            "Anima": [
                false,
                0,
                null
            ],
            "Dark": [
                false,
                0,
                null
            ],
            "Default": [
                false,
                0,
                null
            ]
        },
        "icon_nid": "Generic_Portrait_General",
        "icon_index": [
            0,
            0
        ],
        "map_sprite_nid": "General",
        "combat_anim_nid": "General",
        "fields": []
    }
]