[
    {
        "name": "Intro",
        "trigger": "level_start",
        "level_nid": "4",
        "condition": "True",
        "commands": [],
        "only_once": false,
        "priority": 20,
        "_source": [
            "add_weather;Light",
            "game_var;_max_turnwheel_uses;4",
            "game_var;_current_turnwheel_uses;4",
            "# prebaseScript",
            "music;The Task at Hand",
            "add_market_item;Slim Lance",
            "add_market_item;Hatchet",
            "add_market_item;Wind",
            "if;game.check_alive('Prim')",
            "add_base_convo;Strength",
            "end",
            "add_base_convo;An Uneasy Trust",
            "if;game.check_alive('Theo')",
            "add_base_convo;Theo Sphinx, Pt. I",
            "end",
            "# Show room",
            "change_tilemap;TacticsRoom",
            "add_unit;fakeSam;7,2;immediate",
            "add_unit;Ophie;12,6;immediate",
            "add_unit;Prim;10,6;immediate",
            "add_unit;Theo;10,9;immediate",
            "add_unit;Renae;2,9;immediate",
            "add_unit;Drake;5,6;immediate",
            "add_unit;Joel;9,7;immediate",
            "add_unit;Althea;3,6;immediate",
            "add_unit;Nia;13,9;immediate",
            "add_unit;Eliza;5,9;immediate",
            "transition;Open",
            "wait;500",
            "flicker_cursor;fakeSam",
            "transition;Close",
            "change_tilemap;Chapter 4;reload",
            "add_weather;Light",
            "# So Eliza doesn't show up in the base menu",
            "change_team;Eliza;other",
            "change_background;TacticsRoomDay",
            "transition;Open",
            "add_portrait;Sam;FarRight",
            "if;game.game_vars['switches'] >= 2",
            "speak;Sam;Well done everyone.|Thanks to your valiant efforts, we have the funds we need to keep our struggle alive.|But we can't stop now.",
            "else",
            "speak;Sam;I know the last mission did not go as well as we had hoped.",
            "add_portrait;Renae;Left",
            "speak;Renae;You're telling me!",
            "speak;Sam;...There is good news, though.",
            "end",
            "speak;Sam;According to my sources, a weapon shipment is due to reach the Imperials.|We cannot allow those weapons to reach Duke Ulver.",
            "remove_portrait;Renae",
            "add_portrait;Prim;Left",
            "speak;Prim;Won't the caravans be guarded?",
            "speak;Sam;Yes, but it should only be a token force.|The Empire is keeping these shipments on the down-low.{w}{clear}Capturing these weapons will not only strike a blow against the Empire,|but will also aid the Resistance in our future endeavors.|This mission is of paramount importance!",
            "speak;Prim;Oh...",
            "speak;Sam;If no one else has any comments...",
            "music;Midna's Theme",
            "move_portrait;Prim;FarLeft",
            "add_portrait;Eliza;MidLeft",
            "speak;Sam;Eliza?",
            "speak;Eliza;Can you let me join this fight?",
            "speak;Sam;What? Out of the question, Eliza.|You are not ready.",
            "bop_portrait;Eliza",
            "speak;Eliza;I am ready!|I can do it. I know I can.",
            "speak;Sam;We've been over this...",
            "speak;Eliza;Please, Sam. I've been training...|I'm stronger than I was then. I won't get hurt.",
            "speak;Sam;No. And that's final.",
            "speak;Eliza;You really don't trust me anymore, do you!",
            "# Eliza runs off",
            "remove_portrait;Eliza",
            "speak;Sam;...",
            "add_portrait;Althea;MidLeft",
            "speak;Althea;Well, um,|this has been an eventful meeting, but,{w} uh...|if we're going to catch those caravans, we'd better get ready, right?",
            "multi_remove_portrait;Althea;Sam;Prim",
            "# Prim and Ophie conversation",
            "if;game.check_alive('Prim')",
            "transition;Close",
            "change_background;MainBase",
            "transition;Open",
            "multi_add_portrait;Ophie;Right;Prim;Left",
            "speak;Ophie;Prim?",
            "speak;Prim;Cover for me. I'll catch up with you guys in a little.",
            "speak;Ophie;Uh...",
            "speak;Prim;Thanks!",
            "remove_portrait;Prim",
            "speak;Ophie;What could she be up to?;;;thought_bubble",
            "remove_portrait;Ophie",
            "end",
            "transition;Close",
            "# Base!",
            "base;MainBase;The Journey to the West",
            "# Intro",
            "change_team;Eliza;player",
            "music;Awakening - Easy Now",
            "arrange_formation",
            "# Center",
            "center_cursor;12,9;immediate",
            "# Eliza Shows up",
            "change_background;Clearing",
            "transition;Open",
            "multi_add_portrait;Joel;Left;Eliza;MidRight",
            "speak;Joel;How'd ya convince Sam to let you off the leash, lass?",
            "speak;Eliza;Oh... well...",
            "speak;Joel;I'd have bet that Sam would never relent.",
            "speak;Eliza;Well, you see...",
            "speak;Joel;What'd you say to him, anyway?|He's usually so protective...",
            "speak;Eliza;... Um...|...I didn't...",
            "speak;Joel;Huh? Speak up, lass.",
            "speak;Eliza;I never spoke to Sam.",
            "speak;Joel;Eh? You sayin' you're not supposed to be here?",
            "speak;Eliza;Please, Joel. Let me stay.|I really want to fight!",
            "speak;Joel;Ahahaha! You reckon' I'd send you back?|Nah, if you say you're ready...|Welcome back to the team, lass.",
            "speak;Eliza;Phew... Thanks...",
            "speak;Joel;Though, when Sam hears about this, he'll be furious.",
            "speak;Eliza;You'd tell him?",
            "speak;Joel;You supposin' I should lie?",
            "speak;Eliza;Yes?",
            "add_portrait;Prim;FarRight",
            "speak;Prim;Don't worry, Eliza.|Once we succeed here, how could Sam claim you're not strong enough?",
            "speak;Eliza;I guess.|I don't want him mad at me, though.",
            "speak;Prim;You've trained for this.|You'll do great!",
            "speak;Eliza;...",
            "move_portrait;Joel;MidLeft",
            "add_portrait;Drake;FarLeft",
            "speak;Drake;Enough chatter.|To your positions! The caravan approaches!",
            "multi_remove_portrait;Joel;Drake;Eliza;Prim",
            "move_cursor;Ophie;immediate",
            "transition;Close",
            "change_background",
            "transition;Open",
            "prep;f;Preparing for Battle"
        ]
    }
]