[
    {
        "name": "DeathSidney",
        "trigger": "unit_death",
        "level_nid": null,
        "condition": "unit.nid == 'Sidney'",
        "commands": [],
        "only_once": false,
        "priority": 20,
        "_source": [
            "add_portrait;Sidney;FarLeft",
            "speak;Sidney;Huh?! This was supposed to be... easy...",
            "remove_portrait;Sidney"
        ]
    }
]