[
    {
        "nid": "Regeneration",
        "name": "Regeneration",
        "desc": "Regenerate HP every turn.",
        "icon_nid": "Skills",
        "icon_index": [
            1,
            2
        ],
        "components": [
            [
                "regeneration",
                0.3
            ],
            [
                "class_skill",
                null
            ]
        ]
    }
]