[
    {
        "nid": "so_Shove",
        "name": "Shove",
        "desc": "I done broked something.",
        "icon_nid": "Skills",
        "icon_index": [
            4,
            4
        ],
        "components": [
            [
                "min_range",
                1
            ],
            [
                "max_range",
                1
            ],
            [
                "target_unit",
                null
            ],
            [
                "shove_target_restrict",
                1
            ],
            [
                "shove",
                1
            ]
        ]
    }
]