[
    {
        "nid": "Vanguard",
        "name": "Vanguard",
        "desc": "Veteran warriors expert in all fields of combat.",
        "tier": 2,
        "movement_group": "Regular",
        "promotes_from": "Mercenary",
        "turns_into": [],
        "tags": [],
        "max_level": 10,
        "bases": {
            "HP": 18,
            "STR": 4,
            "MAG": 0,
            "SKL": 7,
            "SPD": 7,
            "LCK": 0,
            "DEF": 5,
            "RES": 2,
            "CON": 8,
            "MOV": 6
        },
        "growths": {
            "HP": 105,
            "STR": 60,
            "MAG": 15,
            "SKL": 55,
            "SPD": 45,
            "LCK": 40,
            "DEF": 25,
            "RES": 15,
            "CON": 0,
            "MOV": 0
        },
        "growth_bonus": {
            "HP": 0,
            "STR": 0,
            "MAG": 0,
            "SKL": 0,
            "SPD": 0,
            "LCK": 0,
            "DEF": 0,
            "RES": 0,
            "CON": 0,
            "MOV": 0
        },
        "promotion": {
            "HP": 4,
            "STR": 1,
            "MAG": 0,
            "SKL": 2,
            "SPD": 2,
            "LCK": 0,
            "DEF": 2,
            "RES": 2,
            "CON": 2,
            "MOV": 1
        },
        "max_stats": {
            "HP": 40,
            "STR": 17,
            "MAG": 15,
            "SKL": 19,
            "SPD": 17,
            "LCK": 20,
            "DEF": 17,
            "RES": 15,
            "CON": 20,
            "MOV": 30
        },
        "learned_skills": [
            [
                3,
                "Feat"
            ],
            [
                5,
                "TLT_Sol"
            ],
            [
                8,
                "Feat"
            ]
        ],
        "wexp_gain": {
            "Sword": [
                true,
                10,
                null
            ],
            "Lance": [
                false,
                0,
                null
            ],
            "Axe": [
                true,
                16,
                null
            ],
            "Bow": [
                false,
                0,
                null
            ],
            "Light": [
                false,
                0,
                null
            ],
            "Anima": [
                false,
                0,
                null
            ],
            "Dark": [
                false,
                0,
                null
            ],
            "Default": [
                false,
                0,
                null
            ]
        },
        "icon_nid": "Generic_Portrait_Vanguard",
        "icon_index": [
            0,
            0
        ],
        "map_sprite_nid": "Hero",
        "combat_anim_nid": "Vanguard",
        "fields": []
    }
]