[
    {
        "name": "Armory",
        "trigger": "Armory",
        "level_nid": "2",
        "condition": "True",
        "commands": [],
        "only_once": false,
        "priority": 20,
        "_source": [
            "transition;Close",
            "music;All Aboard to Rogueport",
            "shop;{unit};Iron Sword,Iron Lance,Slim Lance,Iron Axe,Hatchet,Willow Bow",
            "transition;Open"
        ]
    }
]