[
    {
        "name": "Battle Save",
        "trigger": "turn_change",
        "level_nid": "6",
        "condition": "game.level_vars['switch'] >= 2",
        "commands": [],
        "only_once": true,
        "priority": 10,
        "_source": [
            "choice;battle_save;Would you like to save?;Yes,No;;h",
            "if;game.game_vars['battle_save'] == 'Yes'",
            "battle_save",
            "end"
        ]
    }
]