[
    {
        "name": "SamCoyoteTalk",
        "trigger": "on_talk",
        "level_nid": "6",
        "condition": "unit.nid == 'Sam' and unit2.nid == 'Coyote'",
        "commands": [],
        "only_once": true,
        "priority": 20,
        "_source": [
            "multi_add_portrait;Coyote;Left;Sam;Right",
            "speak;Sam;Coyote, right?",
            "speak;Coyote;...",
            "speak;Sam;I'll take that as a yes...|Uh... We could use your help, since you know the place.",
            "speak;Coyote;Way ahead of you. Wait here.|I'll handle the warden myself.",
            "speak;Sam;I'm not sure that's such a good idea.|Why don't we come up with a plan, instead of going in guns blazing?",
            "speak;Coyote;Look, I get it. You're new at this.|Trust me. I'm a professional.",
            "speak;Sam;No actually, I'm not new, I've been doing this for a while--",
            "remove_portrait;Coyote",
            "speak;Sam;Hey, wait!",
            "remove_portrait;Sam",
            "remove_talk;Sam;Coyote",
            "change_team;Coyote;player"
        ]
    }
]