[
    {
        "name": "FightVincent",
        "trigger": "combat_start",
        "level_nid": "5",
        "condition": "check_default('Vincent', [])",
        "commands": [],
        "only_once": true,
        "priority": 20,
        "_source": [
            "add_portrait;Vincent;Left",
            "if;game.check_dead('Jules')",
            "speak;Vincent;You dun' killed Jules!|You killed my b-brother! ARGH!!!",
            "else",
            "speak;Vincent;Ah shit, man...",
            "end",
            "remove_portrait;Vincent"
        ]
    }
]