[
    {
        "nid": "Kayla",
        "name": "Kayla",
        "desc": "A scheming diplomat from the Confederacy.",
        "variant": "Female",
        "level": 8,
        "klass": "Shaman",
        "tags": [],
        "bases": {
            "HP": 19,
            "STR": 1,
            "MAG": 9,
            "SKL": 8,
            "SPD": 5,
            "LCK": 6,
            "DEF": 5,
            "RES": 7,
            "CON": 5,
            "MOV": 4
        },
        "growths": {
            "HP": 55,
            "STR": 5,
            "MAG": 65,
            "SKL": 55,
            "SPD": 45,
            "LCK": 35,
            "DEF": 40,
            "RES": 55,
            "CON": 0,
            "MOV": 0
        },
        "stat_cap_modifiers": {},
        "starting_items": [
            [
                "Flux",
                false
            ],
            [
                "Scathe",
                false
            ],
            [
                "Spiritbane",
                false
            ]
        ],
        "learned_skills": [],
        "unit_notes": [],
        "wexp_gain": {
            "Sword": [
                false,
                0,
                null
            ],
            "Lance": [
                false,
                0,
                null
            ],
            "Axe": [
                false,
                0,
                null
            ],
            "Bow": [
                false,
                0,
                null
            ],
            "Light": [
                false,
                0,
                null
            ],
            "Anima": [
                false,
                0,
                null
            ],
            "Dark": [
                true,
                36,
                null
            ],
            "Default": [
                false,
                0,
                null
            ]
        },
        "alternate_classes": [],
        "portrait_nid": "Kayla",
        "affinity": null,
        "fields": []
    }
]