[
    {
        "nid": "Superior Edge",
        "name": "Master Edge",
        "desc": "Grants Hit/Avoid +30 against enemies wielding Swords.",
        "icon_nid": "Sword",
        "icon_index": [
            0,
            18
        ],
        "components": [
            [
                "weapon",
                null
            ],
            [
                "target_enemy",
                null
            ],
            [
                "level_exp",
                null
            ],
            [
                "damage",
                7
            ],
            [
                "hit",
                80
            ],
            [
                "weapon_type",
                "Sword"
            ],
            [
                "weapon_rank",
                "B"
            ],
            [
                "uses",
                10
            ],
            [
                "uses_options",
                {
                    "lose_uses_on_miss": false,
                    "one_loss_per_combat": false
                }
            ],
            [
                "weight",
                7
            ],
            [
                "status_on_equip",
                "TLT_Swordbreaker"
            ],
            [
                "value",
                2000
            ],
            [
                "min_range",
                1
            ],
            [
                "max_range",
                1
            ],
            [
                "eval_warning",
                "target.get_weapon() and item_system.weapon_type(target, target.get_weapon()) == 'Sword'"
            ]
        ]
    }
]