[
    {
        "nid": "Cavalier",
        "name": "Cavalier",
        "desc": "Mounted knights with superior movement.",
        "tier": 1,
        "movement_group": "Heavy Cav",
        "promotes_from": null,
        "turns_into": [
            "Paladin"
        ],
        "tags": [
            "Mounted"
        ],
        "max_level": 10,
        "bases": {
            "HP": 12,
            "STR": 3,
            "MAG": 0,
            "SKL": 2,
            "SPD": 3,
            "LCK": 0,
            "DEF": 4,
            "RES": 0,
            "CON": 7,
            "MOV": 7
        },
        "growths": {
            "HP": 100,
            "STR": 45,
            "MAG": 5,
            "SKL": 55,
            "SPD": 35,
            "LCK": 40,
            "DEF": 20,
            "RES": 30,
            "CON": 0,
            "MOV": 0
        },
        "growth_bonus": {
            "HP": 0,
            "STR": 0,
            "MAG": 0,
            "SKL": 0,
            "SPD": 0,
            "LCK": 0,
            "DEF": 0,
            "RES": 0,
            "CON": 0,
            "MOV": 0
        },
        "promotion": {
            "HP": 0,
            "STR": 0,
            "MAG": 0,
            "SKL": 0,
            "SPD": 0,
            "LCK": 0,
            "DEF": 0,
            "RES": 0,
            "CON": 0,
            "MOV": 0
        },
        "max_stats": {
            "HP": 40,
            "STR": 15,
            "MAG": 15,
            "SKL": 15,
            "SPD": 15,
            "LCK": 20,
            "DEF": 15,
            "RES": 15,
            "CON": 20,
            "MOV": 30
        },
        "learned_skills": [
            [
                1,
                "Canto"
            ],
            [
                5,
                "Savior"
            ],
            [
                8,
                "Feat"
            ]
        ],
        "wexp_gain": {
            "Sword": [
                true,
                1,
                null
            ],
            "Lance": [
                true,
                1,
                null
            ],
            "Axe": [
                false,
                0,
                null
            ],
            "Bow": [
                false,
                0,
                null
            ],
            "Light": [
                false,
                0,
                null
            ],
            "Anima": [
                false,
                0,
                null
            ],
            "Dark": [
                false,
                0,
                null
            ],
            "Default": [
                false,
                0,
                null
            ]
        },
        "icon_nid": "Generic_Portrait_Cavalier",
        "icon_index": [
            0,
            0
        ],
        "map_sprite_nid": "Cavalier",
        "combat_anim_nid": "Cavalier",
        "fields": []
    }
]