[
    {
        "name": "Turn8",
        "trigger": "turn_change",
        "level_nid": "8",
        "condition": "game.turncount == 8",
        "commands": [],
        "only_once": false,
        "priority": 20,
        "_source": [
            "center_cursor;30,19",
            "add_group;Shaman2;;;closest",
            "wait;500",
            "center_cursor;14,0",
            "add_group;Paladin2;;;closest",
            "wait;500",
            "choice;battle_save;Would you like to save?;Yes,No;;h",
            "if;game.game_vars['battle_save'] == 'Yes'",
            "battle_save",
            "end"
        ]
    }
]