[
    {
        "name": "House2",
        "trigger": "Visit",
        "level_nid": "2",
        "condition": "region.nid == 'House2'",
        "commands": [],
        "only_once": true,
        "priority": 20,
        "_source": [
            "transition;Close",
            "change_background;House",
            "transition;Open",
            "multi_add_portrait;OldLady1;Left;{unit};Right",
            "speak;OldLady1;Oh is that you, Billy?|Its been ages since I last saw you. How are ya doing, Billy?{w}{clear}You know me, I've been doing well -- keeping to myself.|Trying to keep the house clean, y'know.|Have you heard about the weather recently? I've heard it might rain soon...{w}{clear}Oh but do you hear me go on! How are you and the missus?{w}{clear}Are you taking good care of Sally? She's such a darling grandniece.{w}{clear}Well don't let me keep ya. Here take this for the road.",
            "multi_remove_portrait;OldLady1;{unit}",
            "show_layer;House2",
            "transition;Close",
            "change_background",
            "transition;Open",
            "give_item;{unit};Potion",
            "has_attacked;{unit}"
        ]
    }
]