[
    {
        "name": "Outro",
        "trigger": "level_end",
        "level_nid": "4",
        "condition": "True",
        "commands": [],
        "only_once": false,
        "priority": 20,
        "_source": [
            "# From this point on, all enemies are at +1 level",
            "if;game.mode.nid == 'Lunatic'",
            "set_mode_autolevels;1",
            "end",
            "victory_screen",
            "transition;Close",
            "music;Fire Treasure",
            "change_background;Clearing",
            "transition;Open",
            "multi_add_portrait;Ophie;Left;Joel;Right",
            "speak;Ophie;Wow! Look at all this loot!",
            "speak;Joel;With this many weapons, the Resistance should be set for quite a while.",
            "if;game.check_alive('Nia')",
            "remove_portrait;Ophie",
            "add_portrait;Nia;Left",
            "speak;Joel;So Nia, anything catching your eye?",
            "speak;Nia;Hmmm...",
            "remove_portrait;Nia",
            "wait;200",
            "add_portrait;Nia;Left",
            "# Give Nia a new bow Oak Bow",
            "give_item;Nia;Oak Bow;no_choice",
            "speak;Nia;Pretty...",
            "remove_portrait;Nia",
            "end",
            "if;game.check_alive('Drake')",
            "multi_remove_portrait;Joel;Ophie",
            "multi_add_portrait;Althea;Left;Drake;Right",
            "speak;Althea;Drake, look at this!",
            "speak;Drake;Althea, don't touch that! These are Imperial weapons...|They could be dangerous!",
            "speak;Althea;Always a worrier.|Come on Drake, live a little.",
            "speak;Drake;Well, if you insist.",
            "# Give Drake an adamant lance",
            "give_item;Drake;Adamant Lance;no_choice",
            "multi_remove_portrait;Althea;Drake",
            "end",
            "if;game.check_alive('Nia') or game.check_alive('Drake')",
            "add_portrait;Ophie;Left",
            "end",
            "if;game.check_alive('Drake')",
            "add_portrait;Joel;Right",
            "end",
            "speak;Ophie;Joel, you ever seen a sword like this before?|It was wrapped up by itself in the back.",
            "speak;Joel;Well, lad, it's certainly ornate.|How does it feel?",
            "speak;Ophie;Hmmm... Powerful.",
            "move_portrait;Joel;FarRight",
            "add_portrait;Prim;MidRight",
            "speak;Prim;I don't like the look of it.",
            "speak;Ophie;What?|Wait... are you jealous, Prim?",
            "speak;Prim;No... I just have a bad feeling.",
            "move_portrait;Ophie;FarLeft",
            "add_portrait;Althea;MidLeft",
            "speak;Althea;So do I...",
            "speak;Joel;I reckon' I've heard of this blade before.|This is ancient magic.|Lad, what you hold in your hands is a Magebane Sword.",
            "speak;Ophie;A Magebane Sword?",
            "speak;Joel;A blade that devours magic.|That must be why Althea and Prim feel sick.",
            "speak;Prim;Please, Ophie, now that we know what it is, can you put it back?|I feel like I'm going to throw up.",
            "speak;Ophie;Oh, sorry...",
            "speak;Joel;Don't throw it away though, lad.|A sword like that could come in handy.",
            "give_item;Ophie;Magebane Sword;no_choice",
            "remove_portrait;Prim",
            "add_portrait;Drake;MidRight",
            "speak;Drake;Alright, everyone. Let's get a move on.|The wagon's fully loaded.",
            "multi_remove_portrait;Ophie;Drake;Joel;Althea",
            "transition;Close"
        ]
    }
]