[
    {
        "name": "SearchRuin",
        "trigger": "Search",
        "level_nid": "5",
        "condition": "True",
        "commands": [],
        "only_once": true,
        "priority": 20,
        "_source": [
            "center_cursor;22,7",
            "show_layer;road",
            "wait;500"
        ]
    }
]