[
    {
        "name": "DeathJules",
        "trigger": "unit_death",
        "level_nid": null,
        "condition": "unit.nid == 'Jules'",
        "commands": [],
        "only_once": false,
        "priority": 20,
        "_source": [
            "add_portrait;Jules;FarLeft",
            "speak;Jules;...'Tis only a scratch, nothing more...|Urgh...",
            "remove_portrait;Jules"
        ]
    }
]