[
    {
        "name": "Turn2",
        "trigger": "turn_change",
        "level_nid": "0",
        "condition": "game.turncount == 2",
        "commands": [],
        "only_once": false,
        "priority": 20,
        "_source": [
            "music;Meet the Sage",
            "move_cursor;Yohn",
            "move_cursor;13,5",
            "move_unit;Yohn;13,5",
            "move_cursor;S1",
            "move_unit;S1;14,5",
            "# Swordmaster dude approaches enemies!",
            "add_portrait;SoldierBlue;Right",
            "add_portrait;Yohn;Left",
            "speak;SoldierBlue;Hah! You think you're tough enough to take us on, old man?",
            "speak;Yohn;You are filled with rage, my child. Allow me to release your anger!",
            "multi_remove_portrait;SoldierBlue;Yohn",
            "# Combat",
            "interact_unit;Yohn;S1;hit1,hit2,hit1,end",
            "add_portrait;Yohn;Left",
            "speak;Yohn;My blade sings once again.|It is a pity one so young had to suffer for it.",
            "remove_portrait;Yohn",
            "# Pan to Ophie and Prim",
            "move_cursor;0,0",
            "add_unit;E1;0,4;immediate",
            "move_unit;E1;4,5",
            "flicker_cursor;E1",
            "# An enemy cuts off their escape",
            "multi_add_portrait;Bandit1;Left;Ophie;MidRight;Prim;FarRight",
            "speak;Bandit1;Heh! Caught ya!",
            "speak;Ophie;Behind me, Prim.|This one's mine!",
            "multi_remove_portrait;Bandit1;Ophie;Prim"
        ]
    }
]