[
    {
        "nid": "Energy Ring",
        "name": "Energy Ring",
        "desc": "Permanently increases its user's strength by 2.",
        "icon_nid": "Boosters",
        "icon_index": [
            0,
            1
        ],
        "components": [
            [
                "usable",
                null
            ],
            [
                "target_ally",
                null
            ],
            [
                "uses",
                1
            ],
            [
                "uses_options",
                {
                    "lose_uses_on_miss": false,
                    "one_loss_per_combat": false
                }
            ],
            [
                "permanent_stat_change",
                [
                    [
                        "STR",
                        2
                    ]
                ]
            ],
            [
                "usable_in_base",
                null
            ],
            [
                "value",
                4000
            ],
            [
                "no_ai",
                null
            ]
        ]
    }
]