[
    {
        "name": "DeathRazia",
        "trigger": "unit_death",
        "level_nid": null,
        "condition": "unit.nid == 'Razia'",
        "commands": [],
        "only_once": false,
        "priority": 20,
        "_source": [
            "add_portrait;Razia;FarLeft",
            "speak;Razia;Hmmph! You've fought well, Keralan...|Not many have... tested my blade and lived...",
            "remove_portrait;Razia"
        ]
    }
]