[
    {
        "name": "Turn1",
        "trigger": "turn_change",
        "level_nid": "0",
        "condition": "game.turncount == 1",
        "commands": [],
        "only_once": false,
        "priority": 20,
        "_source": [
            "multi_add_portrait;Prim;Right;Ophie;Left",
            "speak;Prim;Ophie, let's go! We need to run!",
            "speak;Ophie;Right.",
            "multi_remove_portrait;Prim;Ophie",
            "flicker_cursor;0,0",
            "move_cursor;Ophie"
        ]
    }
]