[
    {
        "name": "Outro",
        "trigger": "level_end",
        "level_nid": "7",
        "condition": "True",
        "commands": [],
        "only_once": false,
        "priority": 20,
        "_source": [
            "# outro script 7",
            "victory_screen",
            "transition;Close",
            "music;Awakening - Easy Now",
            "change_background;OutsideFort",
            "transition;Open",
            "multi_add_portrait;Sam;Left;Drake;Right",
            "speak;Drake;I sure hope this information is worth the effort, Sam.",
            "speak;Sam;I guess we'll find out.|I'll head inside the fort and see what I can find.|Take a breather. You've earned it.",
            "multi_remove_portrait;Sam;Drake",
            "transition;Close",
            "change_background;BlackBackground",
            "transition;Open",
            "speak;Narrator;30 minutes later...;;;narration",
            "transition;Close",
            "change_background;OutsideFort",
            "transition;Open",
            "multi_add_portrait;Prim;Left;Theo;Right",
            "speak;Theo;Everything alright, Prim?",
            "speak;Prim;...Theo?",
            "speak;Theo;Yes...?",
            "speak;Prim;You know a lot about the Empire.",
            "speak;Theo;Uh... well... I don't know if that's true.|There's always more to learn.",
            "speak;Prim;Well, do you know who that man was?",
            "speak;Theo;He definitely didn't seem like one of the Duke's normal lieutenants.|That ward he used signified that much.|I would guess he was sent here on the Empress's orders.|Whatever's in this information must be important...",
            "speak;Prim;Hmmm...",
            "multi_remove_portrait;Theo;Prim",
            "add_portrait;Sam;OffscreenLeft;immediate",
            "move_portrait;Sam;Left",
            "add_portrait;Joel;Right",
            "speak;Joel;Captain!|Took you long enough.",
            "speak;Sam;It wasn't as easy to find as I'd been led to believe.|Anyway, we've got what we came for. Let's go.",
            "multi_remove_portrait;Joel;Sam",
            "transition;Close;1000",
            "end_skip",
            "change_background;Palace_Door",
            "music;Mount Briggs",
            "transition;Open;1000",
            "add_portrait;Vagnius;Left",
            "speak;Vagnius;Keeping ME waiting... He will pay for this insult.;;;thought_bubble",
            "wait;500",
            "add_portrait;Adjutant;OffscreenRight;immediate",
            "move_portrait;Adjutant;Right",
            "speak;Adjutant;The Duke will see you now. Follow me.",
            "speak;Vagnius;Finally.",
            "multi_remove_portrait;Adjutant;Vagnius",
            "transition;Close",
            "change_background;Palace",
            "transition;Open",
            "multi_add_portrait;Vagnius;Left;Ulver;Right",
            "speak;Vagnius;Milord.",
            "speak;Ulver;Vagnius.",
            "speak;Vagnius;How noble of you to grace me with your--",
            "speak;Ulver;Vagnius.|Spare me your ingratiations.|What of the Resistance?",
            "speak;Vagnius;Marduk... has failed, milord.|The Resistance lives.",
            "speak;Ulver;Hmmph!",
            "speak;Vagnius;But we were close this time, milord. So very, very close!|Give me one more chance.",
            "speak;Ulver;Hmmm... Second chances are not the Imperial way.|Nor a taste for failure.",
            "speak;Vagnius;Milord?",
            "speak;Ulver;...|What is your plan this time?",
            "speak;Vagnius;The village of Podoma, milord.|The Resistance will not ignore the feverish pleas of their own countrymen.|I can draw them into the open and eliminate them once and for all.",
            "speak;Ulver;How... ignoble.",
            "speak;Vagnius;Milord?",
            "speak;Ulver;Proceed with your plan, Vagnius.|This is your last chance.",
            "speak;Vagnius;Thank you, milord.|Your magninimony is overwhelming--",
            "speak;Ulver;Vagnius, you are dismissed.",
            "speak;Vagnius;...",
            "remove_portrait;Vagnius",
            "add_portrait;Adjutant;Left",
            "speak;Adjutant;Milord, is it wise to let him depart?|He covets your position.",
            "speak;Ulver;Ha! Let the weasel plot.|He has not the strength nor fortitude to challenge me.|But, if he were to succeed, then it must be so.",
            "speak;Adjutant;Milord?",
            "speak;Ulver;''To the strongest.''|Is this not the way of the Empire, Adjutant?",
            "speak;Adjutant;Of course, milord.",
            "speak;Ulver;Then we have nothing to worry about.",
            "multi_remove_portrait;Adjutant;Ulver",
            "transition;Close"
        ]
    }
]