[
    {
        "nid": "Duke",
        "name": "Duke",
        "desc": "One of the twelve Imperial Dukes, demons of combat.",
        "tier": 3,
        "movement_group": "Armors",
        "promotes_from": "General",
        "turns_into": [],
        "tags": [
            "ArenaIgnore"
        ],
        "max_level": 10,
        "bases": {
            "HP": 15,
            "STR": 5,
            "MAG": 0,
            "SKL": 4,
            "SPD": 4,
            "LCK": 0,
            "DEF": 8,
            "RES": 4,
            "CON": 11,
            "MOV": 6
        },
        "growths": {
            "HP": 105,
            "STR": 55,
            "MAG": 15,
            "SKL": 40,
            "SPD": 20,
            "LCK": 35,
            "DEF": 55,
            "RES": 35,
            "CON": 0,
            "MOV": 0
        },
        "growth_bonus": {
            "HP": 0,
            "STR": 0,
            "MAG": 0,
            "SKL": 0,
            "SPD": 0,
            "LCK": 0,
            "DEF": 0,
            "RES": 0,
            "CON": 0,
            "MOV": 0
        },
        "promotion": {
            "HP": 0,
            "STR": 0,
            "MAG": 0,
            "SKL": 0,
            "SPD": 0,
            "LCK": 0,
            "DEF": 0,
            "RES": 0,
            "CON": 0,
            "MOV": 1
        },
        "max_stats": {
            "HP": 80,
            "STR": 20,
            "MAG": 20,
            "SKL": 20,
            "SPD": 20,
            "LCK": 20,
            "DEF": 20,
            "RES": 20,
            "CON": 20,
            "MOV": 30
        },
        "learned_skills": [
            [
                1,
                "Resist_Status"
            ],
            [
                5,
                "Reflect"
            ]
        ],
        "wexp_gain": {
            "Sword": [
                true,
                1,
                null
            ],
            "Lance": [
                true,
                1,
                null
            ],
            "Axe": [
                true,
                1,
                null
            ],
            "Bow": [
                false,
                0,
                null
            ],
            "Light": [
                false,
                0,
                null
            ],
            "Anima": [
                false,
                0,
                null
            ],
            "Dark": [
                false,
                0,
                null
            ],
            "Default": [
                false,
                0,
                null
            ]
        },
        "icon_nid": "Generic_Portrait_Citizen",
        "icon_index": [
            0,
            0
        ],
        "map_sprite_nid": "Duke",
        "combat_anim_nid": "Duke",
        "fields": []
    }
]