[
    {
        "name": "Turn4",
        "trigger": "turn_change",
        "level_nid": "8",
        "condition": "game.turncount == 4",
        "commands": [],
        "only_once": false,
        "priority": 20,
        "_source": [
            "flicker_cursor;Vagnius",
            "multi_add_portrait;Vagnius;Right;SoldierRed;Left",
            "speak;Vagnius;Bah! What is taking so long? Put them down!",
            "speak;SoldierRed;The reinforcements are on their way, milord.",
            "speak;Vagnius;I want them here, now!|The Resistance will not slip away from me, on the eve of my victory",
            "speak;SoldierRed;Of course, milord.",
            "multi_remove_portrait;SoldierRed;Vagnius",
            "center_cursor;14,0",
            "add_group;Paladin1;;;push",
            "wait;500"
        ]
    }
]