[
    {
        "name": "Outro",
        "trigger": "level_end",
        "level_nid": "6",
        "condition": "True",
        "commands": [],
        "only_once": false,
        "priority": 20,
        "_source": [
            "# OutroScript",
            "# Main Prison Leader is Kiley. Speaks like a pirate",
            "# Coyote is recruited if not already",
            "victory_screen",
            "transition;Close",
            "music;Wild Arms Town",
            "if;game.check_alive('Coyote')",
            "change_team;Coyote;player",
            "end",
            "change_background;Wastes",
            "transition;Open",
            "multi_add_portrait;Sam;FarLeft;Kayla;MidLeft;Kiley;Right",
            "speak;Sam;Thanks for agreeing to meet with us.",
            "speak;Kiley;Heh! Your crew certainly got the warden good.|Least I could do is show my proper 'preciation.",
            "speak;Kayla;Could've stuck around for the fight...",
            "speak;Sam;Kayla...",
            "speak;Kiley;But now that you've me and my boys, what would you have us do?",
            "speak;Sam;How many do you number?",
            "speak;Kiley;I ain't normally one for 'rithmetic, but if I had to take a gander...|Maybe four or five hundred.",
            "speak;Sam;So, I would guess you don't harbor any love for the Empire?",
            "speak;Kiley;You pulling my leg?",
            "speak;Sam;Uh... Well we can't induct all of your...{w}crew into the Resistance.|You're too many.",
            "speak;Kayla;But with this many at our back,|the Resistance could finally fight toe to toe with Duke Ulver's army.",
            "speak;Kiley;Hmmph! Me and my boys ain't exactly subtle, y'know.",
            "speak;Kayla;Well, the Confederacy has prepared a hiding place for such an eventuality.|We can keep your crew hidden.|You'll be a reserve for when the Resistance needs the firepower.",
            "speak;Sam;Kiley, if you agree,|you'll be in charge of the Revolutionary Army of Kerala.|A force to fight the Empire when and where it is needed most.",
            "speak;Kiley;Aye...|Commander of an army....|Sounds like a lot of responsibilities...{w}{clear}But, if me country needs me, what can I say?|Plus me boys wouldn't know what to do without me.|Joinin' the military might do 'em some good.",
            "speak;Sam;Great!",
            "move_portrait;Kiley;FarRight",
            "add_portrait;Coyote;MidRight",
            "speak;Kayla;Coyote, you'll be coming with us.",
            "speak;Kiley;Eh?|Coyote's me first mate!",
            "speak;Kayla;Awww. I didn't know you two were so close!|But seriously, Coyote is a special agent for the Confederacy.",
            "speak;Kiley;Coyote, you never told me yer were a spook.",
            "speak;Coyote;Orders are orders.",
            "speak;Kayla;Don't worry, you'll see him soon.|He'll be our liason.",
            "speak;Kiley;Aye. Well, if everythings all figured out, it's as cold as a witch's tit up here.|Where's this hiding spot of yours, girly?",
            "multi_remove_portrait;Kiley;Kayla;Coyote;Sam",
            "transition;Close"
        ]
    }
]