[
    {
        "nid": "Provoke_Child",
        "name": "Provoked",
        "desc": "Hit -30 and Damage -2 when attacking units other than the one provoking it.",
        "icon_nid": "Skills",
        "icon_index": [
            4,
            5
        ],
        "components": [
            [
                "dynamic_damage",
                "-2 if (target.nid != skill.initiator_nid and mode == 'attack') else 0"
            ],
            [
                "dynamic_accuracy",
                "-30 if (target.nid != skill.initiator_nid and mode == 'attack') else 0"
            ],
            [
                "negative",
                null
            ],
            [
                "unit_anim",
                "MapProvoke"
            ],
            [
                "lost_on_end_chapter",
                null
            ]
        ]
    }
]