[
    {
        "nid": "TLT_Resistant",
        "name": "Resistant",
        "desc": "Grants increased magical resistance.",
        "icon_nid": "Skills",
        "icon_index": [
            5,
            5
        ],
        "components": [
            [
                "stat_change",
                [
                    [
                        "RES",
                        5
                    ]
                ]
            ],
            [
                "upkeep_stat_change",
                [
                    [
                        "RES",
                        -1
                    ]
                ]
            ],
            [
                "time",
                5
            ]
        ]
    }
]