[
    {
        "name": "Turn3",
        "trigger": "turn_change",
        "level_nid": "6",
        "condition": "game.turncount == 3",
        "commands": [],
        "only_once": false,
        "priority": 20,
        "_source": [
            "center_cursor;0,26",
            "wait;200",
            "add_unit;l31;0,26",
            "add_unit;l32;0,27",
            "wait;1000",
            "center_cursor;24,26",
            "wait;200",
            "add_unit;r31;24,26",
            "add_unit;r32;24,27",
            "wait;1000"
        ]
    }
]