[
    {
        "nid": "Assassin",
        "name": "Assassin",
        "desc": "Killers at home in the shadows.",
        "tier": 2,
        "movement_group": "Light Foot",
        "promotes_from": "Thief",
        "turns_into": [],
        "tags": [],
        "max_level": 10,
        "bases": {
            "HP": 14,
            "STR": 4,
            "MAG": 2,
            "SKL": 5,
            "SPD": 8,
            "LCK": 0,
            "DEF": 3,
            "RES": 3,
            "CON": 5,
            "MOV": 7
        },
        "growths": {
            "HP": 65,
            "STR": 40,
            "MAG": 35,
            "SKL": 60,
            "SPD": 65,
            "LCK": 55,
            "DEF": 5,
            "RES": 35,
            "CON": 0,
            "MOV": 0
        },
        "growth_bonus": {
            "HP": 0,
            "STR": 0,
            "MAG": 0,
            "SKL": 0,
            "SPD": 0,
            "LCK": 0,
            "DEF": 0,
            "RES": 0,
            "CON": 0,
            "MOV": 0
        },
        "promotion": {
            "HP": 3,
            "STR": 2,
            "MAG": 1,
            "SKL": 3,
            "SPD": 2,
            "LCK": 0,
            "DEF": 2,
            "RES": 2,
            "CON": 1,
            "MOV": 1
        },
        "max_stats": {
            "HP": 40,
            "STR": 15,
            "MAG": 15,
            "SKL": 20,
            "SPD": 20,
            "LCK": 20,
            "DEF": 15,
            "RES": 15,
            "CON": 20,
            "MOV": 30
        },
        "learned_skills": [
            [
                3,
                "Feat"
            ],
            [
                5,
                "Pass"
            ],
            [
                8,
                "Feat"
            ]
        ],
        "wexp_gain": {
            "Sword": [
                true,
                1,
                null
            ],
            "Lance": [
                false,
                0,
                null
            ],
            "Axe": [
                false,
                0,
                null
            ],
            "Bow": [
                true,
                16,
                null
            ],
            "Light": [
                false,
                0,
                null
            ],
            "Anima": [
                false,
                0,
                null
            ],
            "Dark": [
                false,
                0,
                null
            ],
            "Default": [
                false,
                0,
                null
            ]
        },
        "icon_nid": "Generic_Portrait_Assassin",
        "icon_index": [
            0,
            0
        ],
        "map_sprite_nid": "Assassin",
        "combat_anim_nid": "Assassin",
        "fields": []
    }
]