[
    {
        "nid": "Speed -2",
        "name": "Speed -2",
        "desc": "Inflicts SPD -2.",
        "icon_nid": "Skills",
        "icon_index": [
            9,
            4
        ],
        "components": [
            [
                "stat_change",
                [
                    [
                        "SPD",
                        -2
                    ]
                ]
            ]
        ]
    }
]