[
    {
        "nid": "Blizzard",
        "name": "Blizzard",
        "desc": "Damages huge area. Inflicts SPD debuff.",
        "icon_nid": "Anima",
        "icon_index": [
            0,
            10
        ],
        "components": [
            [
                "spell",
                null
            ],
            [
                "weapon_type",
                "Anima"
            ],
            [
                "weapon_rank",
                "B"
            ],
            [
                "magic",
                null
            ],
            [
                "uses",
                5
            ],
            [
                "uses_options",
                {
                    "lose_uses_on_miss": false,
                    "one_loss_per_combat": false
                }
            ],
            [
                "blast_aoe",
                3
            ],
            [
                "hit",
                80
            ],
            [
                "damage",
                3
            ],
            [
                "status_on_hit",
                "TLT_Frostbite"
            ],
            [
                "map_cast_anim",
                "AOE_Blizzard"
            ],
            [
                "value",
                2000
            ],
            [
                "min_range",
                4
            ],
            [
                "max_range",
                4
            ],
            [
                "target_tile",
                null
            ],
            [
                "level_exp",
                null
            ]
        ]
    }
]