[
    {
        "name": "DeathAdjutant",
        "trigger": "unit_death",
        "level_nid": null,
        "condition": "unit.nid == 'Adjutant'",
        "commands": [],
        "only_once": false,
        "priority": 20,
        "_source": [
            "add_portrait;Adjutant;FarLeft",
            "speak;Adjutant;Oh... A pity...",
            "remove_portrait;Adjutant"
        ]
    }
]