[
    {
        "nid": "Speed +2",
        "name": "Speed +2",
        "desc": "Grants SPD +2.",
        "icon_nid": "Skills",
        "icon_index": [
            0,
            4
        ],
        "components": [
            [
                "stat_change",
                [
                    [
                        "SPD",
                        2
                    ]
                ]
            ]
        ]
    }
]