[
    {
        "nid": "TLT_Poise",
        "name": "Poise",
        "desc": "If attacking, DEF/RES +5.",
        "icon_nid": "Skills",
        "icon_index": [
            10,
            5
        ],
        "components": [
            [
                "dynamic_resist",
                "5 if (mode == 'defense') else 0"
            ],
            [
                "class_skill",
                null
            ]
        ]
    }
]