[
    {
        "nid": "DEBUG",
        "size": [
            15,
            15
        ],
        "autotile_fps": 29,
        "layers": [
            {
                "nid": "base",
                "visible": true,
                "foreground": false,
                "terrain_grid": {
                    "0,11": "0",
                    "0,10": "0",
                    "1,10": "0",
                    "2,10": "0",
                    "2,11": "0",
                    "2,12": "0",
                    "1,11": "0",
                    "0,12": "0",
                    "3,2": "0",
                    "3,1": "0",
                    "3,0": "0",
                    "4,0": "0",
                    "5,0": "0",
                    "6,0": "0",
                    "7,0": "0",
                    "8,0": "0",
                    "8,1": "0",
                    "8,2": "0",
                    "6,1": "0",
                    "6,2": "0",
                    "7,1": "0",
                    "5,1": "0",
                    "4,1": "0",
                    "5,2": "0",
                    "2,1": "Forest",
                    "2,2": "Forest",
                    "2,3": "Forest",
                    "1,3": "Forest",
                    "1,2": "Forest",
                    "1,1": "Forest",
                    "0,2": "Forest",
                    "0,6": "Forest",
                    "0,7": "Forest",
                    "1,7": "Forest",
                    "2,5": "Forest",
                    "3,7": "Forest",
                    "2,8": "Forest",
                    "5,10": "Forest",
                    "7,9": "Forest",
                    "10,7": "Forest",
                    "11,6": "Forest",
                    "11,5": "Forest",
                    "5,4": "Forest",
                    "7,4": "Forest",
                    "9,5": "Forest",
                    "10,4": "Forest",
                    "12,8": "Forest",
                    "13,8": "Forest",
                    "14,8": "Forest",
                    "14,7": "Forest",
                    "14,9": "Forest",
                    "6,10": "Fort",
                    "10,5": "Fort",
                    "6,14": "Mountain",
                    "7,14": "Mountain",
                    "8,14": "Mountain",
                    "9,14": "Mountain",
                    "10,14": "Mountain",
                    "11,14": "Mountain",
                    "12,14": "Mountain",
                    "13,14": "Mountain",
                    "14,13": "Mountain",
                    "13,13": "Mountain",
                    "12,13": "Mountain",
                    "11,13": "Mountain",
                    "10,13": "Mountain",
                    "9,13": "Mountain",
                    "8,13": "Mountain",
                    "7,13": "Mountain",
                    "8,12": "Mountain",
                    "9,12": "Mountain",
                    "10,12": "Mountain",
                    "11,12": "Mountain",
                    "12,12": "Mountain",
                    "13,12": "Mountain",
                    "14,12": "Mountain",
                    "14,11": "Mountain",
                    "13,11": "Mountain",
                    "12,11": "Mountain",
                    "11,11": "Mountain",
                    "10,11": "Mountain",
                    "9,11": "Mountain",
                    "8,11": "Mountain",
                    "7,12": "Mountain",
                    "6,13": "Mountain",
                    "9,10": "Mountain",
                    "10,10": "Mountain",
                    "11,10": "Mountain",
                    "12,10": "Mountain",
                    "13,10": "Mountain",
                    "14,10": "Mountain",
                    "13,9": "Mountain",
                    "12,9": "Mountain",
                    "11,9": "Mountain",
                    "7,8": "Mountain",
                    "7,7": "Mountain",
                    "7,6": "Mountain",
                    "7,5": "Mountain",
                    "8,5": "Mountain",
                    "8,6": "Mountain",
                    "8,7": "Mountain",
                    "8,8": "Mountain",
                    "8,9": "Plain",
                    "8,4": "Mountain",
                    "9,4": "Mountain",
                    "9,3": "Mountain",
                    "8,3": "Mountain",
                    "9,2": "Mountain",
                    "9,1": "Mountain",
                    "10,2": "Mountain",
                    "10,3": "Mountain",
                    "10,1": "Mountain",
                    "10,0": "Mountain",
                    "11,0": "Mountain",
                    "12,0": "Mountain",
                    "13,0": "Mountain",
                    "14,0": "Mountain",
                    "14,1": "Mountain",
                    "14,2": "Mountain",
                    "4,11": "Mountain",
                    "4,12": "Mountain",
                    "3,11": "Mountain",
                    "3,10": "Mountain",
                    "3,9": "Mountain",
                    "4,10": "Mountain",
                    "6,7": "Mountain",
                    "2,9": "Mountain",
                    "0,9": "Mountain",
                    "0,8": "Mountain",
                    "1,8": "Mountain",
                    "9,7": "Mountain",
                    "0,1": "Plain",
                    "2,0": "Plain",
                    "1,0": "Plain",
                    "0,0": "Plain",
                    "5,9": "Plain",
                    "4,7": "Plain",
                    "6,9": "Plain",
                    "7,3": "Plain",
                    "6,6": "Hill",
                    "5,6": "Plain",
                    "4,8": "Plain",
                    "1,6": "Plain",
                    "0,3": "Plain",
                    "5,8": "Plain",
                    "7,2": "Village",
                    "4,9": "Plain",
                    "5,5": "Plain",
                    "3,3": "Plain",
                    "4,4": "Plain",
                    "6,3": "Plain",
                    "1,5": "Plain",
                    "3,6": "Plain",
                    "0,4": "Plain",
                    "6,4": "Plain",
                    "2,6": "Plain",
                    "4,5": "Plain",
                    "1,4": "Plain",
                    "0,5": "Plain",
                    "4,2": "Village",
                    "6,5": "Plain",
                    "3,5": "Plain",
                    "2,7": "Plain",
                    "5,3": "Plain",
                    "4,6": "Plain",
                    "6,8": "Plain",
                    "5,7": "Armory",
                    "3,8": "Plain",
                    "4,3": "Plain",
                    "3,4": "Plain",
                    "2,4": "Plain",
                    "9,0": "Plain",
                    "12,1": "Ruins",
                    "14,4": "Plain",
                    "13,4": "Plain",
                    "9,8": "Plain",
                    "11,2": "Ruins",
                    "12,5": "Plain",
                    "10,8": "Plain",
                    "12,2": "Ruins",
                    "14,5": "Plain",
                    "13,3": "Ruins",
                    "12,6": "Plain",
                    "13,7": "Plain",
                    "11,1": "Ruins",
                    "10,9": "Plain",
                    "12,3": "Plain",
                    "11,4": "Plain",
                    "13,2": "Ruins",
                    "12,7": "Plain",
                    "14,6": "Plain",
                    "13,6": "Plain",
                    "11,7": "Plain",
                    "13,1": "Ruins",
                    "11,8": "Plain",
                    "13,5": "Plain",
                    "9,9": "Plain",
                    "11,3": "Ruins",
                    "12,4": "Plain",
                    "14,3": "Plain",
                    "0,14": "Plain",
                    "5,13": "Plain",
                    "7,11": "Plain",
                    "3,14": "Plain",
                    "5,12": "Plain",
                    "1,14": "Plain",
                    "8,10": "Plain",
                    "4,13": "Plain",
                    "2,13": "Plain",
                    "7,10": "Plain",
                    "5,11": "Plain",
                    "6,11": "Plain",
                    "3,13": "Plain",
                    "1,13": "Plain",
                    "4,14": "Plain",
                    "6,12": "Plain",
                    "2,14": "Plain",
                    "3,12": "Plain",
                    "1,12": "Village",
                    "0,13": "Plain",
                    "5,14": "Hill",
                    "10,6": "Plain",
                    "9,6": "Plain",
                    "1,9": "Mountain",
                    "14,14": "Plain"
                },
                "sprite_grid": {
                    "7,3": [
                        "Chpt2",
                        [
                            7,
                            3
                        ]
                    ],
                    "6,9": [
                        "Chpt2",
                        [
                            6,
                            9
                        ]
                    ],
                    "12,1": [
                        "Chpt2",
                        [
                            12,
                            1
                        ]
                    ],
                    "11,11": [
                        "Chpt2",
                        [
                            11,
                            11
                        ]
                    ],
                    "7,12": [
                        "Chpt2",
                        [
                            7,
                            12
                        ]
                    ],
                    "13,4": [
                        "Chpt2",
                        [
                            13,
                            4
                        ]
                    ],
                    "12,12": [
                        "Chpt2",
                        [
                            12,
                            12
                        ]
                    ],
                    "0,7": [
                        "Chpt2",
                        [
                            0,
                            7
                        ]
                    ],
                    "1,6": [
                        "Chpt2",
                        [
                            1,
                            6
                        ]
                    ],
                    "0,10": [
                        "Chpt2",
                        [
                            0,
                            10
                        ]
                    ],
                    "3,7": [
                        "Chpt2",
                        [
                            3,
                            7
                        ]
                    ],
                    "2,5": [
                        "Chpt2",
                        [
                            2,
                            5
                        ]
                    ],
                    "1,11": [
                        "Chpt2",
                        [
                            1,
                            11
                        ]
                    ],
                    "8,5": [
                        "Chpt2",
                        [
                            8,
                            5
                        ]
                    ],
                    "5,8": [
                        "Chpt2",
                        [
                            5,
                            8
                        ]
                    ],
                    "4,0": [
                        "Chpt2",
                        [
                            4,
                            0
                        ]
                    ],
                    "10,8": [
                        "Chpt2",
                        [
                            10,
                            8
                        ]
                    ],
                    "9,0": [
                        "Chpt2",
                        [
                            9,
                            0
                        ]
                    ],
                    "6,7": [
                        "Chpt2",
                        [
                            6,
                            7
                        ]
                    ],
                    "5,5": [
                        "Chpt2",
                        [
                            5,
                            5
                        ]
                    ],
                    "11,5": [
                        "Chpt2",
                        [
                            11,
                            5
                        ]
                    ],
                    "10,7": [
                        "Chpt2",
                        [
                            10,
                            7
                        ]
                    ],
                    "7,6": [
                        "Chpt2",
                        [
                            7,
                            6
                        ]
                    ],
                    "6,10": [
                        "Chpt2",
                        [
                            6,
                            10
                        ]
                    ],
                    "12,6": [
                        "Chpt2",
                        [
                            12,
                            6
                        ]
                    ],
                    "13,7": [
                        "Chpt2",
                        [
                            13,
                            7
                        ]
                    ],
                    "0,4": [
                        "Chpt2",
                        [
                            0,
                            4
                        ]
                    ],
                    "1,1": [
                        "Chpt2",
                        [
                            1,
                            1
                        ]
                    ],
                    "4,10": [
                        "Chpt2",
                        [
                            4,
                            10
                        ]
                    ],
                    "3,2": [
                        "Chpt2",
                        [
                            3,
                            2
                        ]
                    ],
                    "2,6": [
                        "Chpt2",
                        [
                            2,
                            6
                        ]
                    ],
                    "9,14": [
                        "Chpt2",
                        [
                            9,
                            14
                        ]
                    ],
                    "8,2": [
                        "Chpt2",
                        [
                            8,
                            2
                        ]
                    ],
                    "5,11": [
                        "Chpt2",
                        [
                            5,
                            11
                        ]
                    ],
                    "4,5": [
                        "Chpt2",
                        [
                            4,
                            5
                        ]
                    ],
                    "10,13": [
                        "Chpt2",
                        [
                            10,
                            13
                        ]
                    ],
                    "9,3": [
                        "Chpt2",
                        [
                            9,
                            3
                        ]
                    ],
                    "6,0": [
                        "Chpt2",
                        [
                            6,
                            0
                        ]
                    ],
                    "11,0": [
                        "Chpt2",
                        [
                            11,
                            0
                        ]
                    ],
                    "7,5": [
                        "Chpt2",
                        [
                            7,
                            5
                        ]
                    ],
                    "12,11": [
                        "Chpt2",
                        [
                            12,
                            11
                        ]
                    ],
                    "13,10": [
                        "Chpt2",
                        [
                            13,
                            10
                        ]
                    ],
                    "0,1": [
                        "Chpt2",
                        [
                            0,
                            1
                        ]
                    ],
                    "3,12": [
                        "Chpt2",
                        [
                            3,
                            12
                        ]
                    ],
                    "1,12": [
                        "Chpt2",
                        [
                            1,
                            12
                        ]
                    ],
                    "8,12": [
                        "Chpt2",
                        [
                            8,
                            12
                        ]
                    ],
                    "3,1": [
                        "Chpt2",
                        [
                            3,
                            1
                        ]
                    ],
                    "2,11": [
                        "Chpt2",
                        [
                            2,
                            11
                        ]
                    ],
                    "9,9": [
                        "Chpt2",
                        [
                            9,
                            9
                        ]
                    ],
                    "5,14": [
                        "Chpt2",
                        [
                            5,
                            14
                        ]
                    ],
                    "10,14": [
                        "Chpt2",
                        [
                            10,
                            14
                        ]
                    ],
                    "6,13": [
                        "Chpt2",
                        [
                            6,
                            13
                        ]
                    ],
                    "7,8": [
                        "Chpt2",
                        [
                            7,
                            8
                        ]
                    ],
                    "13,0": [
                        "Chpt2",
                        [
                            13,
                            0
                        ]
                    ],
                    "12,8": [
                        "Chpt2",
                        [
                            12,
                            8
                        ]
                    ],
                    "13,13": [
                        "Chpt2",
                        [
                            13,
                            13
                        ]
                    ],
                    "0,14": [
                        "Chpt2",
                        [
                            0,
                            14
                        ]
                    ],
                    "3,11": [
                        "Chpt2",
                        [
                            3,
                            11
                        ]
                    ],
                    "2,1": [
                        "Chpt2",
                        [
                            2,
                            1
                        ]
                    ],
                    "8,9": [
                        "Chpt2",
                        [
                            8,
                            9
                        ]
                    ],
                    "4,12": [
                        "Chpt2",
                        [
                            4,
                            12
                        ]
                    ],
                    "2,12": [
                        "Chpt2",
                        [
                            2,
                            12
                        ]
                    ],
                    "9,4": [
                        "Chpt2",
                        [
                            9,
                            4
                        ]
                    ],
                    "5,1": [
                        "Chpt2",
                        [
                            5,
                            1
                        ]
                    ],
                    "10,3": [
                        "Chpt2",
                        [
                            10,
                            3
                        ]
                    ],
                    "7,2": [
                        "Chpt2",
                        [
                            7,
                            2
                        ]
                    ],
                    "6,14": [
                        "Chpt2",
                        [
                            6,
                            14
                        ]
                    ],
                    "12,2": [
                        "Chpt2",
                        [
                            12,
                            2
                        ]
                    ],
                    "11,10": [
                        "Chpt2",
                        [
                            11,
                            10
                        ]
                    ],
                    "13,3": [
                        "Chpt2",
                        [
                            13,
                            3
                        ]
                    ],
                    "12,13": [
                        "Chpt2",
                        [
                            12,
                            13
                        ]
                    ],
                    "1,5": [
                        "Chpt2",
                        [
                            1,
                            5
                        ]
                    ],
                    "0,11": [
                        "Chpt2",
                        [
                            0,
                            11
                        ]
                    ],
                    "3,6": [
                        "Chpt2",
                        [
                            3,
                            6
                        ]
                    ],
                    "2,2": [
                        "Chpt2",
                        [
                            2,
                            2
                        ]
                    ],
                    "1,10": [
                        "Chpt2",
                        [
                            1,
                            10
                        ]
                    ],
                    "8,6": [
                        "Chpt2",
                        [
                            8,
                            6
                        ]
                    ],
                    "4,1": [
                        "Chpt2",
                        [
                            4,
                            1
                        ]
                    ],
                    "10,9": [
                        "Chpt2",
                        [
                            10,
                            9
                        ]
                    ],
                    "9,7": [
                        "Chpt2",
                        [
                            9,
                            7
                        ]
                    ],
                    "6,4": [
                        "Chpt2",
                        [
                            6,
                            4
                        ]
                    ],
                    "5,4": [
                        "Chpt2",
                        [
                            5,
                            4
                        ]
                    ],
                    "11,4": [
                        "Chpt2",
                        [
                            11,
                            4
                        ]
                    ],
                    "10,4": [
                        "Chpt2",
                        [
                            10,
                            4
                        ]
                    ],
                    "7,1": [
                        "Chpt2",
                        [
                            7,
                            1
                        ]
                    ],
                    "6,11": [
                        "Chpt2",
                        [
                            6,
                            11
                        ]
                    ],
                    "12,7": [
                        "Chpt2",
                        [
                            12,
                            7
                        ]
                    ],
                    "11,9": [
                        "Chpt2",
                        [
                            11,
                            9
                        ]
                    ],
                    "13,6": [
                        "Chpt2",
                        [
                            13,
                            6
                        ]
                    ],
                    "0,5": [
                        "Chpt2",
                        [
                            0,
                            5
                        ]
                    ],
                    "1,0": [
                        "Chpt2",
                        [
                            1,
                            0
                        ]
                    ],
                    "0,8": [
                        "Chpt2",
                        [
                            0,
                            8
                        ]
                    ],
                    "4,11": [
                        "Chpt2",
                        [
                            4,
                            11
                        ]
                    ],
                    "3,5": [
                        "Chpt2",
                        [
                            3,
                            5
                        ]
                    ],
                    "2,7": [
                        "Chpt2",
                        [
                            2,
                            7
                        ]
                    ],
                    "9,13": [
                        "Chpt2",
                        [
                            9,
                            13
                        ]
                    ],
                    "8,3": [
                        "Chpt2",
                        [
                            8,
                            3
                        ]
                    ],
                    "5,10": [
                        "Chpt2",
                        [
                            5,
                            10
                        ]
                    ],
                    "4,6": [
                        "Chpt2",
                        [
                            4,
                            6
                        ]
                    ],
                    "10,10": [
                        "Chpt2",
                        [
                            10,
                            10
                        ]
                    ],
                    "9,2": [
                        "Chpt2",
                        [
                            9,
                            2
                        ]
                    ],
                    "6,1": [
                        "Chpt2",
                        [
                            6,
                            1
                        ]
                    ],
                    "5,7": [
                        "Chpt2",
                        [
                            5,
                            7
                        ]
                    ],
                    "11,3": [
                        "Chpt2",
                        [
                            11,
                            3
                        ]
                    ],
                    "7,4": [
                        "Chpt2",
                        [
                            7,
                            4
                        ]
                    ],
                    "12,4": [
                        "Chpt2",
                        [
                            12,
                            4
                        ]
                    ],
                    "13,9": [
                        "Chpt2",
                        [
                            13,
                            9
                        ]
                    ],
                    "0,2": [
                        "Chpt2",
                        [
                            0,
                            2
                        ]
                    ],
                    "1,3": [
                        "Chpt2",
                        [
                            1,
                            3
                        ]
                    ],
                    "8,13": [
                        "Chpt2",
                        [
                            8,
                            13
                        ]
                    ],
                    "4,8": [
                        "Chpt2",
                        [
                            4,
                            8
                        ]
                    ],
                    "3,0": [
                        "Chpt2",
                        [
                            3,
                            0
                        ]
                    ],
                    "2,8": [
                        "Chpt2",
                        [
                            2,
                            8
                        ]
                    ],
                    "9,8": [
                        "Chpt2",
                        [
                            9,
                            8
                        ]
                    ],
                    "8,0": [
                        "Chpt2",
                        [
                            8,
                            0
                        ]
                    ],
                    "5,13": [
                        "Chpt2",
                        [
                            5,
                            13
                        ]
                    ],
                    "6,2": [
                        "Chpt2",
                        [
                            6,
                            2
                        ]
                    ],
                    "11,14": [
                        "Chpt2",
                        [
                            11,
                            14
                        ]
                    ],
                    "7,11": [
                        "Chpt2",
                        [
                            7,
                            11
                        ]
                    ],
                    "12,9": [
                        "Chpt2",
                        [
                            12,
                            9
                        ]
                    ],
                    "13,12": [
                        "Chpt2",
                        [
                            13,
                            12
                        ]
                    ],
                    "3,10": [
                        "Chpt2",
                        [
                            3,
                            10
                        ]
                    ],
                    "1,14": [
                        "Chpt2",
                        [
                            1,
                            14
                        ]
                    ],
                    "8,10": [
                        "Chpt2",
                        [
                            8,
                            10
                        ]
                    ],
                    "4,13": [
                        "Chpt2",
                        [
                            4,
                            13
                        ]
                    ],
                    "2,13": [
                        "Chpt2",
                        [
                            2,
                            13
                        ]
                    ],
                    "9,11": [
                        "Chpt2",
                        [
                            9,
                            11
                        ]
                    ],
                    "5,0": [
                        "Chpt2",
                        [
                            5,
                            0
                        ]
                    ],
                    "10,0": [
                        "Chpt2",
                        [
                            10,
                            0
                        ]
                    ],
                    "12,3": [
                        "Chpt2",
                        [
                            12,
                            3
                        ]
                    ],
                    "11,13": [
                        "Chpt2",
                        [
                            11,
                            13
                        ]
                    ],
                    "7,14": [
                        "Chpt2",
                        [
                            7,
                            14
                        ]
                    ],
                    "13,2": [
                        "Chpt2",
                        [
                            13,
                            2
                        ]
                    ],
                    "12,14": [
                        "Chpt2",
                        [
                            12,
                            14
                        ]
                    ],
                    "1,4": [
                        "Chpt2",
                        [
                            1,
                            4
                        ]
                    ],
                    "0,12": [
                        "Chpt2",
                        [
                            0,
                            12
                        ]
                    ],
                    "3,9": [
                        "Chpt2",
                        [
                            3,
                            9
                        ]
                    ],
                    "2,3": [
                        "Chpt2",
                        [
                            2,
                            3
                        ]
                    ],
                    "1,9": [
                        "Chpt2",
                        [
                            1,
                            9
                        ]
                    ],
                    "8,7": [
                        "Chpt2",
                        [
                            8,
                            7
                        ]
                    ],
                    "4,2": [
                        "Chpt2",
                        [
                            4,
                            2
                        ]
                    ],
                    "2,14": [
                        "Chpt2",
                        [
                            2,
                            14
                        ]
                    ],
                    "9,6": [
                        "Chpt2",
                        [
                            9,
                            6
                        ]
                    ],
                    "6,5": [
                        "Chpt2",
                        [
                            6,
                            5
                        ]
                    ],
                    "5,3": [
                        "Chpt2",
                        [
                            5,
                            3
                        ]
                    ],
                    "11,7": [
                        "Chpt2",
                        [
                            11,
                            7
                        ]
                    ],
                    "10,5": [
                        "Chpt2",
                        [
                            10,
                            5
                        ]
                    ],
                    "7,0": [
                        "Chpt2",
                        [
                            7,
                            0
                        ]
                    ],
                    "6,8": [
                        "Chpt2",
                        [
                            6,
                            8
                        ]
                    ],
                    "12,0": [
                        "Chpt2",
                        [
                            12,
                            0
                        ]
                    ],
                    "11,8": [
                        "Chpt2",
                        [
                            11,
                            8
                        ]
                    ],
                    "7,13": [
                        "Chpt2",
                        [
                            7,
                            13
                        ]
                    ],
                    "13,5": [
                        "Chpt2",
                        [
                            13,
                            5
                        ]
                    ],
                    "0,6": [
                        "Chpt2",
                        [
                            0,
                            6
                        ]
                    ],
                    "1,7": [
                        "Chpt2",
                        [
                            1,
                            7
                        ]
                    ],
                    "0,9": [
                        "Chpt2",
                        [
                            0,
                            9
                        ]
                    ],
                    "3,4": [
                        "Chpt2",
                        [
                            3,
                            4
                        ]
                    ],
                    "2,4": [
                        "Chpt2",
                        [
                            2,
                            4
                        ]
                    ],
                    "9,12": [
                        "Chpt2",
                        [
                            9,
                            12
                        ]
                    ],
                    "8,4": [
                        "Chpt2",
                        [
                            8,
                            4
                        ]
                    ],
                    "5,9": [
                        "Chpt2",
                        [
                            5,
                            9
                        ]
                    ],
                    "4,7": [
                        "Chpt2",
                        [
                            4,
                            7
                        ]
                    ],
                    "10,11": [
                        "Chpt2",
                        [
                            10,
                            11
                        ]
                    ],
                    "9,1": [
                        "Chpt2",
                        [
                            9,
                            1
                        ]
                    ],
                    "6,6": [
                        "Chpt2",
                        [
                            6,
                            6
                        ]
                    ],
                    "5,6": [
                        "Chpt2",
                        [
                            5,
                            6
                        ]
                    ],
                    "11,2": [
                        "Chpt2",
                        [
                            11,
                            2
                        ]
                    ],
                    "10,6": [
                        "Chpt2",
                        [
                            10,
                            6
                        ]
                    ],
                    "7,7": [
                        "Chpt2",
                        [
                            7,
                            7
                        ]
                    ],
                    "12,5": [
                        "Chpt2",
                        [
                            12,
                            5
                        ]
                    ],
                    "13,8": [
                        "Chpt2",
                        [
                            13,
                            8
                        ]
                    ],
                    "0,3": [
                        "Chpt2",
                        [
                            0,
                            3
                        ]
                    ],
                    "3,14": [
                        "Chpt2",
                        [
                            3,
                            14
                        ]
                    ],
                    "1,2": [
                        "Chpt2",
                        [
                            1,
                            2
                        ]
                    ],
                    "8,14": [
                        "Chpt2",
                        [
                            8,
                            14
                        ]
                    ],
                    "4,9": [
                        "Chpt2",
                        [
                            4,
                            9
                        ]
                    ],
                    "3,3": [
                        "Chpt2",
                        [
                            3,
                            3
                        ]
                    ],
                    "2,9": [
                        "Chpt2",
                        [
                            2,
                            9
                        ]
                    ],
                    "8,1": [
                        "Chpt2",
                        [
                            8,
                            1
                        ]
                    ],
                    "5,12": [
                        "Chpt2",
                        [
                            5,
                            12
                        ]
                    ],
                    "4,4": [
                        "Chpt2",
                        [
                            4,
                            4
                        ]
                    ],
                    "10,12": [
                        "Chpt2",
                        [
                            10,
                            12
                        ]
                    ],
                    "6,3": [
                        "Chpt2",
                        [
                            6,
                            3
                        ]
                    ],
                    "11,1": [
                        "Chpt2",
                        [
                            11,
                            1
                        ]
                    ],
                    "7,10": [
                        "Chpt2",
                        [
                            7,
                            10
                        ]
                    ],
                    "12,10": [
                        "Chpt2",
                        [
                            12,
                            10
                        ]
                    ],
                    "13,11": [
                        "Chpt2",
                        [
                            13,
                            11
                        ]
                    ],
                    "0,0": [
                        "Chpt2",
                        [
                            0,
                            0
                        ]
                    ],
                    "3,13": [
                        "Chpt2",
                        [
                            3,
                            13
                        ]
                    ],
                    "1,13": [
                        "Chpt2",
                        [
                            1,
                            13
                        ]
                    ],
                    "8,11": [
                        "Chpt2",
                        [
                            8,
                            11
                        ]
                    ],
                    "4,14": [
                        "Chpt2",
                        [
                            4,
                            14
                        ]
                    ],
                    "2,10": [
                        "Chpt2",
                        [
                            2,
                            10
                        ]
                    ],
                    "9,10": [
                        "Chpt2",
                        [
                            9,
                            10
                        ]
                    ],
                    "10,1": [
                        "Chpt2",
                        [
                            10,
                            1
                        ]
                    ],
                    "6,12": [
                        "Chpt2",
                        [
                            6,
                            12
                        ]
                    ],
                    "11,12": [
                        "Chpt2",
                        [
                            11,
                            12
                        ]
                    ],
                    "7,9": [
                        "Chpt2",
                        [
                            7,
                            9
                        ]
                    ],
                    "13,1": [
                        "Chpt2",
                        [
                            13,
                            1
                        ]
                    ],
                    "13,14": [
                        "Chpt2",
                        [
                            13,
                            14
                        ]
                    ],
                    "0,13": [
                        "Chpt2",
                        [
                            0,
                            13
                        ]
                    ],
                    "3,8": [
                        "Chpt2",
                        [
                            3,
                            8
                        ]
                    ],
                    "2,0": [
                        "Chpt2",
                        [
                            2,
                            0
                        ]
                    ],
                    "1,8": [
                        "Chpt2",
                        [
                            1,
                            8
                        ]
                    ],
                    "8,8": [
                        "Chpt2",
                        [
                            8,
                            8
                        ]
                    ],
                    "4,3": [
                        "Chpt2",
                        [
                            4,
                            3
                        ]
                    ],
                    "9,5": [
                        "Chpt2",
                        [
                            9,
                            5
                        ]
                    ],
                    "5,2": [
                        "Chpt2",
                        [
                            5,
                            2
                        ]
                    ],
                    "11,6": [
                        "Chpt2",
                        [
                            11,
                            6
                        ]
                    ],
                    "10,2": [
                        "Chpt2",
                        [
                            10,
                            2
                        ]
                    ],
                    "14,11": [
                        "Chpt2",
                        [
                            14,
                            11
                        ]
                    ],
                    "14,10": [
                        "Chpt2",
                        [
                            14,
                            10
                        ]
                    ],
                    "14,5": [
                        "Chpt2",
                        [
                            14,
                            5
                        ]
                    ],
                    "14,4": [
                        "Chpt2",
                        [
                            14,
                            4
                        ]
                    ],
                    "14,7": [
                        "Chpt2",
                        [
                            14,
                            7
                        ]
                    ],
                    "14,13": [
                        "Chpt2",
                        [
                            14,
                            13
                        ]
                    ],
                    "14,6": [
                        "Chpt2",
                        [
                            14,
                            6
                        ]
                    ],
                    "14,12": [
                        "Chpt2",
                        [
                            14,
                            12
                        ]
                    ],
                    "14,1": [
                        "Chpt2",
                        [
                            14,
                            1
                        ]
                    ],
                    "14,0": [
                        "Chpt2",
                        [
                            14,
                            0
                        ]
                    ],
                    "14,14": [
                        "Chpt2",
                        [
                            14,
                            14
                        ]
                    ],
                    "14,3": [
                        "Chpt2",
                        [
                            14,
                            3
                        ]
                    ],
                    "14,9": [
                        "Chpt2",
                        [
                            14,
                            9
                        ]
                    ],
                    "14,2": [
                        "Chpt2",
                        [
                            14,
                            2
                        ]
                    ],
                    "14,8": [
                        "Chpt2",
                        [
                            14,
                            8
                        ]
                    ]
                }
            },
            {
                "nid": "Village1",
                "visible": false,
                "foreground": false,
                "terrain_grid": {
                    "4,2": "0"
                },
                "sprite_grid": {
                    "4,2": [
                        "SacredStonesBase",
                        [
                            10,
                            28
                        ]
                    ]
                }
            },
            {
                "nid": "Village2",
                "visible": false,
                "foreground": false,
                "terrain_grid": {
                    "7,2": "0"
                },
                "sprite_grid": {
                    "7,2": [
                        "SacredStonesBase",
                        [
                            10,
                            28
                        ]
                    ]
                }
            },
            {
                "nid": "Village3",
                "visible": false,
                "foreground": false,
                "terrain_grid": {
                    "1,12": "0"
                },
                "sprite_grid": {
                    "1,12": [
                        "SacredStonesBase",
                        [
                            10,
                            28
                        ]
                    ]
                }
            },
            {
                "nid": "Ruin1",
                "visible": false,
                "foreground": false,
                "terrain_grid": {
                    "3,0": "Ruins",
                    "3,1": "Ruins",
                    "3,2": "Ruins",
                    "4,2": "Plain",
                    "5,2": "Ruins",
                    "5,1": "Ruins",
                    "5,0": "Ruins",
                    "4,0": "Ruins",
                    "4,1": "Ruins"
                },
                "sprite_grid": {
                    "4,1": [
                        "Chpt2",
                        [
                            12,
                            2
                        ]
                    ],
                    "5,0": [
                        "Chpt2",
                        [
                            13,
                            1
                        ]
                    ],
                    "4,0": [
                        "Chpt2",
                        [
                            12,
                            1
                        ]
                    ],
                    "5,1": [
                        "Chpt2",
                        [
                            13,
                            2
                        ]
                    ],
                    "5,2": [
                        "Chpt2",
                        [
                            13,
                            3
                        ]
                    ],
                    "3,1": [
                        "Chpt2",
                        [
                            11,
                            2
                        ]
                    ],
                    "3,2": [
                        "Chpt2",
                        [
                            11,
                            3
                        ]
                    ],
                    "3,0": [
                        "Chpt2",
                        [
                            11,
                            1
                        ]
                    ],
                    "4,2": [
                        "Chpt2",
                        [
                            12,
                            3
                        ]
                    ]
                }
            },
            {
                "nid": "Ruin2",
                "visible": false,
                "foreground": false,
                "terrain_grid": {
                    "6,0": "Ruins",
                    "6,1": "Ruins",
                    "6,2": "Ruins",
                    "7,2": "Plain",
                    "8,2": "Ruins",
                    "8,1": "Ruins",
                    "8,0": "Ruins",
                    "7,0": "Ruins",
                    "7,1": "Ruins"
                },
                "sprite_grid": {
                    "7,1": [
                        "Chpt2",
                        [
                            12,
                            2
                        ]
                    ],
                    "8,0": [
                        "Chpt2",
                        [
                            13,
                            1
                        ]
                    ],
                    "7,0": [
                        "Chpt2",
                        [
                            12,
                            1
                        ]
                    ],
                    "8,1": [
                        "Chpt2",
                        [
                            13,
                            2
                        ]
                    ],
                    "8,2": [
                        "Chpt2",
                        [
                            13,
                            3
                        ]
                    ],
                    "6,1": [
                        "Chpt2",
                        [
                            11,
                            2
                        ]
                    ],
                    "6,2": [
                        "Chpt2",
                        [
                            11,
                            3
                        ]
                    ],
                    "6,0": [
                        "Chpt2",
                        [
                            11,
                            1
                        ]
                    ],
                    "7,2": [
                        "Chpt2",
                        [
                            12,
                            3
                        ]
                    ]
                }
            },
            {
                "nid": "Ruin3",
                "visible": false,
                "foreground": false,
                "terrain_grid": {
                    "0,10": "Ruins",
                    "0,11": "Ruins",
                    "0,12": "Ruins",
                    "1,12": "Plain",
                    "2,12": "Ruins",
                    "2,11": "Ruins",
                    "2,10": "Ruins",
                    "1,11": "Ruins",
                    "1,10": "Ruins"
                },
                "sprite_grid": {
                    "1,11": [
                        "Chpt2",
                        [
                            12,
                            2
                        ]
                    ],
                    "2,10": [
                        "Chpt2",
                        [
                            13,
                            1
                        ]
                    ],
                    "1,10": [
                        "Chpt2",
                        [
                            12,
                            1
                        ]
                    ],
                    "2,11": [
                        "Chpt2",
                        [
                            13,
                            2
                        ]
                    ],
                    "2,12": [
                        "Chpt2",
                        [
                            13,
                            3
                        ]
                    ],
                    "0,11": [
                        "Chpt2",
                        [
                            11,
                            2
                        ]
                    ],
                    "0,12": [
                        "Chpt2",
                        [
                            11,
                            3
                        ]
                    ],
                    "0,10": [
                        "Chpt2",
                        [
                            11,
                            1
                        ]
                    ],
                    "1,12": [
                        "Chpt2",
                        [
                            12,
                            3
                        ]
                    ]
                }
            },
            {
                "nid": "PrevVillage",
                "visible": false,
                "foreground": false,
                "terrain_grid": {
                    "11,3": "0",
                    "11,2": "0",
                    "11,1": "0",
                    "12,1": "0",
                    "13,1": "0",
                    "13,2": "0",
                    "13,3": "0",
                    "12,2": "0",
                    "12,3": "Village"
                },
                "sprite_grid": {
                    "11,3": [
                        "Chpt2",
                        [
                            3,
                            2
                        ]
                    ],
                    "13,2": [
                        "Chpt2",
                        [
                            5,
                            1
                        ]
                    ],
                    "11,1": [
                        "Chpt2",
                        [
                            3,
                            0
                        ]
                    ],
                    "11,2": [
                        "Chpt2",
                        [
                            3,
                            1
                        ]
                    ],
                    "13,3": [
                        "Chpt2",
                        [
                            5,
                            2
                        ]
                    ],
                    "13,1": [
                        "Chpt2",
                        [
                            5,
                            0
                        ]
                    ],
                    "12,3": [
                        "Chpt2",
                        [
                            4,
                            2
                        ]
                    ],
                    "12,2": [
                        "Chpt2",
                        [
                            4,
                            1
                        ]
                    ],
                    "12,1": [
                        "Chpt2",
                        [
                            4,
                            0
                        ]
                    ]
                }
            }
        ],
        "tilesets": [
            "Chpt2",
            "SacredStonesBase"
        ]
    }
]