[
    {
        "nid": "Adamant Sword",
        "name": "Adamant Swd",
        "desc": "",
        "icon_nid": "Sword",
        "icon_index": [
            0,
            12
        ],
        "components": [
            [
                "weapon",
                null
            ],
            [
                "target_enemy",
                null
            ],
            [
                "level_exp",
                null
            ],
            [
                "damage",
                9
            ],
            [
                "hit",
                70
            ],
            [
                "weapon_type",
                "Sword"
            ],
            [
                "weapon_rank",
                "B"
            ],
            [
                "weight",
                8
            ],
            [
                "uses",
                15
            ],
            [
                "uses_options",
                {
                    "lose_uses_on_miss": false,
                    "one_loss_per_combat": false
                }
            ],
            [
                "value",
                1800
            ],
            [
                "min_range",
                1
            ],
            [
                "max_range",
                1
            ]
        ]
    }
]