[
    {
        "nid": "Ulver",
        "name": "Ulver",
        "desc": "Hard-nosed Imperial Duke occupying Kerala.",
        "variant": "",
        "level": 5,
        "klass": "Duke",
        "tags": [
            "Boss"
        ],
        "bases": {
            "HP": 80,
            "STR": 19,
            "MAG": 12,
            "SKL": 20,
            "SPD": 12,
            "LCK": 8,
            "DEF": 18,
            "RES": 16,
            "CON": 11,
            "MOV": 6
        },
        "growths": {
            "HP": 0,
            "STR": 0,
            "MAG": 0,
            "SKL": 0,
            "SPD": 0,
            "LCK": 0,
            "DEF": 0,
            "RES": 0,
            "CON": 0,
            "MOV": 0
        },
        "stat_cap_modifiers": {},
        "starting_items": [
            [
                "Makara",
                false
            ]
        ],
        "learned_skills": [
            [
                1,
                "TLT_Imperial Wards"
            ]
        ],
        "unit_notes": [],
        "wexp_gain": {
            "Sword": [
                true,
                71,
                null
            ],
            "Lance": [
                true,
                71,
                null
            ],
            "Axe": [
                true,
                71,
                null
            ],
            "Bow": [
                false,
                0,
                null
            ],
            "Light": [
                false,
                0,
                null
            ],
            "Anima": [
                false,
                0,
                null
            ],
            "Dark": [
                false,
                0,
                null
            ],
            "Default": [
                false,
                0,
                null
            ]
        },
        "alternate_classes": [],
        "portrait_nid": "Ulver",
        "affinity": null,
        "fields": []
    }
]