[
    {
        "name": "FightOphieJules",
        "trigger": "combat_start",
        "level_nid": "5",
        "condition": "check_pair('Ophie', 'Jules')",
        "commands": [],
        "only_once": true,
        "priority": 20,
        "_source": [
            "multi_add_portrait;Jules;Left;Ophie;Right",
            "speak;Jules;I hate to shatter your ego,|but this is not the first time I've crossed swords, kid.",
            "speak;Ophie;But it's gonna be your last.",
            "multi_remove_portrait;Ophie;Jules"
        ]
    }
]