[
    {
        "name": "SwitchEast",
        "trigger": "Switch",
        "level_nid": "6",
        "condition": "region.nid == 'SwitchEast'",
        "commands": [],
        "only_once": false,
        "priority": 20,
        "_source": [
            "inc_level_var;switch",
            "flicker_cursor;23,21",
            "show_layer;SwitchEast",
            "wait;500",
            "alert;Switch Pulled!",
            "has_attacked;{unit}"
        ]
    }
]