[
    {
        "nid": "Shove",
        "name": "Shove",
        "desc": "Activated. Push a unit one square away.",
        "icon_nid": "Skills",
        "icon_index": [
            4,
            4
        ],
        "components": [
            [
                "ability",
                "so_Shove"
            ],
            [
                "class_skill",
                null
            ]
        ]
    }
]