[
    {
        "nid": "TLT_Enervated",
        "name": "Enervated",
        "desc": "All stats lowered.",
        "icon_nid": "Skills",
        "icon_index": [
            7,
            9
        ],
        "components": [
            [
                "stat_change",
                [
                    [
                        "STR",
                        -6
                    ],
                    [
                        "MAG",
                        -6
                    ],
                    [
                        "SKL",
                        -6
                    ],
                    [
                        "SPD",
                        -6
                    ],
                    [
                        "DEF",
                        -6
                    ],
                    [
                        "RES",
                        -6
                    ]
                ]
            ],
            [
                "upkeep_stat_change",
                [
                    [
                        "STR",
                        2
                    ],
                    [
                        "MAG",
                        2
                    ],
                    [
                        "SKL",
                        2
                    ],
                    [
                        "SPD",
                        2
                    ],
                    [
                        "DEF",
                        2
                    ],
                    [
                        "RES",
                        2
                    ]
                ]
            ],
            [
                "unit_anim",
                "MapPoison"
            ],
            [
                "negative",
                null
            ],
            [
                "time",
                3
            ]
        ]
    }
]