[
    {
        "nid": "TLT_Healtouch",
        "name": "Healtouch",
        "desc": "Heal +5 HP when healing an ally.",
        "icon_nid": "Skills",
        "icon_index": [
            2,
            6
        ],
        "components": [
            [
                "class_skill",
                null
            ],
            [
                "empower_heal",
                "5 if target and unit is not target and skill_system.check_ally(unit, target) else 0"
            ]
        ]
    }
]