[
    {
        "name": "RuinSouth",
        "trigger": "Search",
        "level_nid": "7",
        "condition": "region.nid == 'RuinSouth'",
        "commands": [],
        "only_once": true,
        "priority": 20,
        "_source": [
            "give_item;{unit};Hex",
            "has_attacked;{unit}"
        ]
    }
]