[
    {
        "name": "Outro",
        "trigger": "level_end",
        "level_nid": "5",
        "condition": "True",
        "commands": [],
        "only_once": false,
        "priority": 20,
        "_source": [
            "# Change Sam and Kayla to player controlled",
            "change_team;Sam;player",
            "change_team;Kayla;player",
            "add_lore;CFS",
            "add_lore;Kayla",
            "victory_screen",
            "music;Good Theme",
            "transition;Close",
            "change_background;Desert",
            "transition;Open",
            "multi_add_portrait;Sam;FarLeft;Man1;Right",
            "speak;Man1;Sir, I don't know how we can ever repay you.",
            "speak;Sam;No need.|Besides, it is not me you should be thanking.",
            "add_portrait;Ophie;MidLeft;low_priority",
            "speak;Sam;Without my friend's stubborn insistence on doing what is right,|we never would have succeeded.|He led the charge.",
            "speak;Man1;Thank you.|Finding and returning our children...|It's like a miracle from out of the age of the Moon King.",
            "speak;Ophie;All in a days' work for the Resistance.|We Keralans have to stick together.",
            "speak;Man1;Indeed.|Thank you again, all of you, for your help.",
            "remove_portrait;Man1",
            "remove_portrait;Ophie",
            "add_portrait;Ophie;MidRight",
            "speak;Ophie;So, I guess I should thank you.|You arrived in the nick of time.",
            "speak;Sam;No, actually I should apologize to you.|You were right.|We can't hide in the shadows and expect to accomplish anything substantial.",
            "speak;Ophie;Well, I'm glad you came around.",
            "music;Hum of the Streets",
            "add_portrait;Kayla;MidLeft",
            "speak;Ophie;So, who's this?",
            "speak;Kayla;Who's this...?|Sammy, my dear, you still haven't told them about me?|Trying to keep me all to yourself? Tsk Tsk.|It's a pleasure to meet you, Ophie.|I'm Kayla.",
            "speak;Sam;...My source...",
            "speak;Ophie;This woman is your secret source?",
            "speak;Sam;...Kayla is a liason from the Confederacy of Free Cities.",
            "speak;Ophie;The Confederacy of what now?",
            "speak;Sam;The Confederacy of Free Cities.",
            "speak;Ophie;Which is?",
            "speak;Sam;The Confederacy is a group of free city states to the east.|They've banded together to protect themselves against the Empire's ambition.",
            "speak;Kayla;Indeed. I'm with the Confederacy's... diplomacy bureau.",
            "speak;Sam;She's one of the reasons the Resistance has had such success lately.|There are many Confederacy spies in the ranks of the Empire.|They relay back important information about where the Empire is weak,|and when would be a good time to strike.",
            "speak;Ophie;So you're Sam's mysterious source.|This is who you've been trusting, Sam?{w}{clear}Kayla, your 'information' nearly got us killed at Fort Kosheen.",
            "speak;Kayla;Ah yes, one of our spies fed us false information.|Tsk Tsk.|Don't worry, he was dealt with.|Harshly.",
            "speak;Sam;There's no need to be suspicious.|Any enemy of the Empire is a friend of ours.|The Confederacy's been struggling against the Empire for many solstices.|They're interested in Kerala's freedom just as much as we are.",
            "speak;Kayla;Lately, the Confederacy's decided to take a more active approach.|I'll be accompanying you all on your missions from now on.|How exciting!|You should know I've never really done anything so hands-on before.|Freedom fighters, nighttime raids, disguised princesses...|Oh, how romantic!",
            "speak;Ophie;Yeah, we'll see how you like it after the next mission, eh?",
            "remove_portrait;Sam",
            "add_portrait;Sam;FarRight",
            "speak;Kayla;Oh, don't be rude.|I didn't get this far on my looks alone now.",
            "speak;Sam;Kayla's one of the Confederacy's top shamans.|She can take care of herself.",
            "speak;Kayla;Well, no use dilly-dallying.|I want to see what accoutrements you've managed to scrounge up.",
            "speak;Ophie;You never brought her to the base, Sam?",
            "speak;Sam;No--",
            "speak;Kayla;I know right, how rude!",
            "speak;Ophie;No, actually, that's smart...",
            "speak;Kayla;So what does your base look like?",
            "speak;Ophie;Err...",
            "remove_portrait;Ophie",
            "speak;Kayla;Do you all live in a big treehouse?",
            "speak;Sam;No...",
            "remove_portrait;Sam",
            "speak;Kayla;Or maybe in the sewers, with, like, rat throw-rugs?|Or I know, behind a waterfall!|That's gotta be it...",
            "move_portrait;Kayla;96,0",
            "transition;Close"
        ]
    }
]