[
    {
        "name": "Turn7",
        "trigger": "turn_change",
        "level_nid": "9",
        "condition": "game.turncount == 7",
        "commands": [],
        "only_once": false,
        "priority": 20,
        "_source": [
            "set_position;Rein",
            "move_cursor;{position}",
            "add_unit;p31;{position};warp;closest",
            "wait;500",
            "set_position;Rein",
            "move_cursor;{position}",
            "add_unit;p32;{position};warp;closest",
            "wait;500",
            "set_position;Rein",
            "move_cursor;{position}",
            "add_unit;p33;{position};warp;closest",
            "wait;500",
            "set_position;Rein",
            "move_cursor;{position}",
            "add_unit;p34;{position};warp;closest",
            "wait;500"
        ]
    }
]