[
    {
        "nid": "Willow Bow",
        "name": "Willow Bow",
        "desc": "",
        "icon_nid": "Bow",
        "icon_index": [
            0,
            0
        ],
        "components": [
            [
                "weapon",
                null
            ],
            [
                "target_enemy",
                null
            ],
            [
                "level_exp",
                null
            ],
            [
                "damage",
                4
            ],
            [
                "hit",
                85
            ],
            [
                "weapon_type",
                "Bow"
            ],
            [
                "weapon_rank",
                "D"
            ],
            [
                "uses",
                45
            ],
            [
                "uses_options",
                {
                    "lose_uses_on_miss": false,
                    "one_loss_per_combat": false
                }
            ],
            [
                "weight",
                3
            ],
            [
                "value",
                540
            ],
            [
                "min_range",
                2
            ],
            [
                "max_range",
                3
            ]
        ]
    }
]