[
    {
        "nid": "4",
        "name": "Chapter IV",
        "tilemap": "Chapter 4",
        "bg_tilemap": null,
        "party": "Resistance",
        "music": {
            "player_phase": "In the Midst",
            "enemy_phase": "Chariot Chase",
            "other_phase": null,
            "enemy2_phase": null,
            "player_battle": null,
            "enemy_battle": null,
            "other_battle": null,
            "enemy2_battle": null
        },
        "objective": {
            "simple": "Destroy all Wagons,{eval:game.game_vars.get('dead_wagons', 0)}/10 destroyed",
            "win": "Destroy at least 7 wagons. {eval:game.game_vars.get('dead_wagons', 0)}/10 destroyed",
            "loss": "Ophie dies,Four or more wagons escape,Party size falls below 5. Currently {eval:len(game.get_units_in_party())}."
        },
        "roam": false,
        "roam_unit": null,
        "go_to_overworld": false,
        "should_record": true,
        "units": [
            {
                "nid": "Eliza",
                "team": "player",
                "ai": "None",
                "roam_ai": null,
                "ai_group": null,
                "starting_position": null,
                "starting_traveler": null,
                "generic": false
            },
            {
                "nid": "wagon1",
                "variant": null,
                "level": 5,
                "klass": "Wagon",
                "faction": "Wagon",
                "starting_items": [
                    [
                        "Rapier",
                        true
                    ]
                ],
                "starting_skills": [],
                "team": "enemy",
                "ai": "Escape",
                "roam_ai": null,
                "ai_group": null,
                "starting_position": null,
                "starting_traveler": null,
                "generic": true
            },
            {
                "nid": "wagon2",
                "variant": null,
                "level": 5,
                "klass": "Wagon",
                "faction": "Wagon",
                "starting_items": [
                    [
                        "Steel Lance",
                        true
                    ]
                ],
                "starting_skills": [],
                "team": "enemy",
                "ai": "Escape",
                "roam_ai": null,
                "ai_group": null,
                "starting_position": null,
                "starting_traveler": null,
                "generic": true
            },
            {
                "nid": "wagon3",
                "variant": null,
                "level": 5,
                "klass": "Wagon",
                "faction": "Wagon",
                "starting_items": [
                    [
                        "Fire",
                        true
                    ]
                ],
                "starting_skills": [],
                "team": "enemy",
                "ai": "Escape",
                "roam_ai": null,
                "ai_group": null,
                "starting_position": null,
                "starting_traveler": null,
                "generic": true
            },
            {
                "nid": "wagon4",
                "variant": null,
                "level": 5,
                "klass": "Wagon",
                "faction": "Wagon",
                "starting_items": [
                    [
                        "Thunder",
                        true
                    ]
                ],
                "starting_skills": [],
                "team": "enemy",
                "ai": "Escape",
                "roam_ai": null,
                "ai_group": null,
                "starting_position": null,
                "starting_traveler": null,
                "generic": true
            },
            {
                "nid": "wagon5",
                "variant": null,
                "level": 5,
                "klass": "Wagon",
                "faction": "Wagon",
                "starting_items": [
                    [
                        "Talisman",
                        true
                    ]
                ],
                "starting_skills": [],
                "team": "enemy",
                "ai": "Escape",
                "roam_ai": null,
                "ai_group": null,
                "starting_position": null,
                "starting_traveler": null,
                "generic": true
            },
            {
                "nid": "wagon6",
                "variant": null,
                "level": 5,
                "klass": "Wagon",
                "faction": "Wagon",
                "starting_items": [
                    [
                        "Javelin",
                        true
                    ]
                ],
                "starting_skills": [],
                "team": "enemy",
                "ai": "Escape",
                "roam_ai": null,
                "ai_group": null,
                "starting_position": null,
                "starting_traveler": null,
                "generic": true
            },
            {
                "nid": "wagon7",
                "variant": null,
                "level": 5,
                "klass": "Wagon",
                "faction": "Wagon",
                "starting_items": [
                    [
                        "Shine",
                        true
                    ]
                ],
                "starting_skills": [],
                "team": "enemy",
                "ai": "Escape",
                "roam_ai": null,
                "ai_group": null,
                "starting_position": null,
                "starting_traveler": null,
                "generic": true
            },
            {
                "nid": "Midas",
                "team": "enemy",
                "ai": "Escape",
                "roam_ai": null,
                "ai_group": null,
                "starting_position": null,
                "starting_traveler": null,
                "generic": false
            },
            {
                "nid": "wagon9",
                "variant": null,
                "level": 5,
                "klass": "Wagon",
                "faction": "Wagon",
                "starting_items": [
                    [
                        "Ruby",
                        true
                    ]
                ],
                "starting_skills": [],
                "team": "enemy",
                "ai": "Escape",
                "roam_ai": null,
                "ai_group": null,
                "starting_position": null,
                "starting_traveler": null,
                "generic": true
            },
            {
                "nid": "wagon10",
                "variant": null,
                "level": 5,
                "klass": "Wagon",
                "faction": "Wagon",
                "starting_items": [
                    [
                        "Fly",
                        true
                    ]
                ],
                "starting_skills": [],
                "team": "enemy",
                "ai": "Escape",
                "roam_ai": null,
                "ai_group": null,
                "starting_position": null,
                "starting_traveler": null,
                "generic": true
            },
            {
                "nid": "101",
                "variant": null,
                "level": 3,
                "klass": "Cavalier",
                "faction": "Soldier",
                "starting_items": [
                    [
                        "Iron Sword",
                        false
                    ]
                ],
                "starting_skills": [],
                "team": "enemy",
                "ai": "Pursue",
                "roam_ai": null,
                "ai_group": null,
                "starting_position": null,
                "starting_traveler": null,
                "generic": true
            },
            {
                "nid": "102",
                "variant": null,
                "level": 4,
                "klass": "Raider",
                "faction": "Soldier",
                "starting_items": [
                    [
                        "Iron Axe",
                        false
                    ]
                ],
                "starting_skills": [],
                "team": "enemy",
                "ai": "FollowWagon",
                "roam_ai": null,
                "ai_group": null,
                "starting_position": null,
                "starting_traveler": null,
                "generic": true
            },
            {
                "nid": "103",
                "variant": null,
                "level": 3,
                "klass": "Cavalier",
                "faction": "Soldier",
                "starting_items": [
                    [
                        "Iron Sword",
                        false
                    ]
                ],
                "starting_skills": [],
                "team": "enemy",
                "ai": "Pursue",
                "roam_ai": null,
                "ai_group": null,
                "starting_position": null,
                "starting_traveler": null,
                "generic": true
            },
            {
                "nid": "104",
                "variant": null,
                "level": 4,
                "klass": "Raider",
                "faction": "Soldier",
                "starting_items": [
                    [
                        "Iron Axe",
                        false
                    ]
                ],
                "starting_skills": [],
                "team": "enemy",
                "ai": "FollowWagon",
                "roam_ai": null,
                "ai_group": null,
                "starting_position": null,
                "starting_traveler": null,
                "generic": true
            },
            {
                "nid": "105",
                "variant": null,
                "level": 5,
                "klass": "Raider",
                "faction": "Soldier",
                "starting_items": [
                    [
                        "Iron Axe",
                        false
                    ]
                ],
                "starting_skills": [],
                "team": "enemy",
                "ai": "FollowWagon",
                "roam_ai": null,
                "ai_group": null,
                "starting_position": null,
                "starting_traveler": null,
                "generic": true
            },
            {
                "nid": "106",
                "variant": null,
                "level": 3,
                "klass": "Archer",
                "faction": "Soldier",
                "starting_items": [
                    [
                        "Willow Bow",
                        false
                    ]
                ],
                "starting_skills": [],
                "team": "enemy",
                "ai": "FollowWagon",
                "roam_ai": null,
                "ai_group": null,
                "starting_position": null,
                "starting_traveler": null,
                "generic": true
            },
            {
                "nid": "107",
                "variant": null,
                "level": 5,
                "klass": "Raider",
                "faction": "Soldier",
                "starting_items": [
                    [
                        "Iron Axe",
                        false
                    ]
                ],
                "starting_skills": [],
                "team": "enemy",
                "ai": "FollowWagon",
                "roam_ai": null,
                "ai_group": null,
                "starting_position": null,
                "starting_traveler": null,
                "generic": true
            },
            {
                "nid": "108",
                "variant": null,
                "level": 3,
                "klass": "Archer",
                "faction": "Soldier",
                "starting_items": [
                    [
                        "Willow Bow",
                        false
                    ]
                ],
                "starting_skills": [],
                "team": "enemy",
                "ai": "FollowWagon",
                "roam_ai": null,
                "ai_group": null,
                "starting_position": null,
                "starting_traveler": null,
                "generic": true
            },
            {
                "nid": "109",
                "variant": null,
                "level": 5,
                "klass": "Mage",
                "faction": "Soldier",
                "starting_items": [
                    [
                        "Fire",
                        false
                    ]
                ],
                "starting_skills": [],
                "team": "enemy",
                "ai": "FollowWagon",
                "roam_ai": null,
                "ai_group": null,
                "starting_position": null,
                "starting_traveler": null,
                "generic": true
            },
            {
                "nid": "110",
                "variant": null,
                "level": 5,
                "klass": "Mage",
                "faction": "Soldier",
                "starting_items": [
                    [
                        "Fire",
                        false
                    ]
                ],
                "starting_skills": [],
                "team": "enemy",
                "ai": "FollowWagon",
                "roam_ai": null,
                "ai_group": null,
                "starting_position": null,
                "starting_traveler": null,
                "generic": true
            },
            {
                "nid": "111",
                "variant": null,
                "level": 4,
                "klass": "Dracoknight",
                "faction": "Soldier",
                "starting_items": [
                    [
                        "Iron Lance",
                        false
                    ]
                ],
                "starting_skills": [],
                "team": "enemy",
                "ai": "Pursue",
                "roam_ai": null,
                "ai_group": null,
                "starting_position": null,
                "starting_traveler": null,
                "generic": true
            },
            {
                "nid": "112",
                "variant": null,
                "level": 4,
                "klass": "Dracoknight",
                "faction": "Soldier",
                "starting_items": [
                    [
                        "Iron Lance",
                        false
                    ]
                ],
                "starting_skills": [],
                "team": "enemy",
                "ai": "Pursue",
                "roam_ai": null,
                "ai_group": null,
                "starting_position": null,
                "starting_traveler": null,
                "generic": true
            },
            {
                "nid": "113",
                "variant": null,
                "level": 5,
                "klass": "Mercenary",
                "faction": "Soldier",
                "starting_items": [
                    [
                        "Iron Sword",
                        false
                    ]
                ],
                "starting_skills": [],
                "team": "enemy",
                "ai": "FollowWagon",
                "roam_ai": null,
                "ai_group": null,
                "starting_position": null,
                "starting_traveler": null,
                "generic": true
            },
            {
                "nid": "114",
                "variant": null,
                "level": 5,
                "klass": "Fighter",
                "faction": "Soldier",
                "starting_items": [
                    [
                        "Hatchet",
                        false
                    ]
                ],
                "starting_skills": [],
                "team": "enemy",
                "ai": "FollowWagon",
                "roam_ai": null,
                "ai_group": null,
                "starting_position": null,
                "starting_traveler": null,
                "generic": true
            },
            {
                "nid": "Anders",
                "team": "enemy",
                "ai": "Pursue",
                "roam_ai": null,
                "ai_group": null,
                "starting_position": null,
                "starting_traveler": null,
                "generic": false
            },
            {
                "nid": "115",
                "variant": null,
                "level": 5,
                "klass": "Soldier",
                "faction": "Soldier",
                "starting_items": [
                    [
                        "Iron Lance",
                        false
                    ]
                ],
                "starting_skills": [],
                "team": "enemy",
                "ai": "FollowWagon",
                "roam_ai": null,
                "ai_group": null,
                "starting_position": null,
                "starting_traveler": null,
                "generic": true
            },
            {
                "nid": "116",
                "variant": null,
                "level": 6,
                "klass": "Cavalier",
                "faction": "Soldier",
                "starting_items": [
                    [
                        "Iron Sword",
                        false
                    ]
                ],
                "starting_skills": [],
                "team": "enemy",
                "ai": "FollowWagon",
                "roam_ai": null,
                "ai_group": null,
                "starting_position": null,
                "starting_traveler": null,
                "generic": true
            },
            {
                "nid": "117",
                "variant": null,
                "level": 5,
                "klass": "Cavalier",
                "faction": "Soldier",
                "starting_items": [
                    [
                        "Iron Lance",
                        false
                    ],
                    [
                        "Javelin",
                        false
                    ]
                ],
                "starting_skills": [],
                "team": "enemy",
                "ai": "FollowWagon",
                "roam_ai": null,
                "ai_group": null,
                "starting_position": null,
                "starting_traveler": null,
                "generic": true
            },
            {
                "nid": "118",
                "variant": null,
                "level": 6,
                "klass": "Cavalier",
                "faction": "Soldier",
                "starting_items": [
                    [
                        "Iron Sword",
                        false
                    ]
                ],
                "starting_skills": [],
                "team": "enemy",
                "ai": "FollowWagon",
                "roam_ai": null,
                "ai_group": null,
                "starting_position": null,
                "starting_traveler": null,
                "generic": true
            },
            {
                "nid": "119",
                "variant": null,
                "level": 5,
                "klass": "Cavalier",
                "faction": "Soldier",
                "starting_items": [
                    [
                        "Iron Lance",
                        false
                    ],
                    [
                        "Javelin",
                        false
                    ]
                ],
                "starting_skills": [],
                "team": "enemy",
                "ai": "FollowWagon",
                "roam_ai": null,
                "ai_group": null,
                "starting_position": null,
                "starting_traveler": null,
                "generic": true
            },
            {
                "nid": "fakeSam",
                "variant": null,
                "level": 1,
                "klass": "Tactician",
                "faction": "Monk",
                "starting_items": [],
                "starting_skills": [],
                "team": "player",
                "ai": "None",
                "roam_ai": null,
                "ai_group": null,
                "starting_position": null,
                "starting_traveler": null,
                "generic": true
            }
        ],
        "regions": [
            {
                "nid": "Ruin1",
                "region_type": "event",
                "position": [
                    15,
                    8
                ],
                "size": [
                    1,
                    1
                ],
                "sub_nid": "Search",
                "condition": "True",
                "time_left": null,
                "only_once": true,
                "interrupt_move": false
            },
            {
                "nid": "Ruin2",
                "region_type": "event",
                "position": [
                    6,
                    15
                ],
                "size": [
                    1,
                    1
                ],
                "sub_nid": "Search",
                "condition": "True",
                "time_left": null,
                "only_once": true,
                "interrupt_move": false
            },
            {
                "nid": "Wagon1",
                "region_type": "event",
                "position": [
                    22,
                    2
                ],
                "size": [
                    1,
                    3
                ],
                "sub_nid": "Thief Escape",
                "condition": "unit.team == 'enemy'",
                "time_left": null,
                "only_once": false,
                "interrupt_move": false
            },
            {
                "nid": "Wagon2",
                "region_type": "event",
                "position": [
                    22,
                    11
                ],
                "size": [
                    1,
                    3
                ],
                "sub_nid": "Thief Escape",
                "condition": "unit.team == 'enemy'",
                "time_left": null,
                "only_once": false,
                "interrupt_move": false
            },
            {
                "nid": "Formation1",
                "region_type": "formation",
                "position": [
                    10,
                    9
                ],
                "size": [
                    1,
                    1
                ],
                "sub_nid": "",
                "condition": "True",
                "time_left": null,
                "only_once": false,
                "interrupt_move": false
            },
            {
                "nid": "Formation2",
                "region_type": "formation",
                "position": [
                    11,
                    8
                ],
                "size": [
                    1,
                    1
                ],
                "sub_nid": "",
                "condition": "True",
                "time_left": null,
                "only_once": false,
                "interrupt_move": false
            },
            {
                "nid": "Formation3",
                "region_type": "formation",
                "position": [
                    11,
                    10
                ],
                "size": [
                    1,
                    1
                ],
                "sub_nid": "",
                "condition": "True",
                "time_left": null,
                "only_once": false,
                "interrupt_move": false
            },
            {
                "nid": "Formation4",
                "region_type": "formation",
                "position": [
                    12,
                    9
                ],
                "size": [
                    1,
                    1
                ],
                "sub_nid": "",
                "condition": "True",
                "time_left": null,
                "only_once": false,
                "interrupt_move": false
            },
            {
                "nid": "Formation5",
                "region_type": "formation",
                "position": [
                    13,
                    8
                ],
                "size": [
                    1,
                    1
                ],
                "sub_nid": "",
                "condition": "True",
                "time_left": null,
                "only_once": false,
                "interrupt_move": false
            },
            {
                "nid": "Formation6",
                "region_type": "formation",
                "position": [
                    13,
                    10
                ],
                "size": [
                    1,
                    1
                ],
                "sub_nid": "",
                "condition": "True",
                "time_left": null,
                "only_once": false,
                "interrupt_move": false
            },
            {
                "nid": "Formation7",
                "region_type": "formation",
                "position": [
                    14,
                    9
                ],
                "size": [
                    1,
                    1
                ],
                "sub_nid": "",
                "condition": "True",
                "time_left": null,
                "only_once": false,
                "interrupt_move": false
            },
            {
                "nid": "Formation8",
                "region_type": "formation",
                "position": [
                    12,
                    11
                ],
                "size": [
                    1,
                    1
                ],
                "sub_nid": "",
                "condition": "True",
                "time_left": null,
                "only_once": false,
                "interrupt_move": false
            },
            {
                "nid": "Formation9",
                "region_type": "formation",
                "position": [
                    12,
                    7
                ],
                "size": [
                    1,
                    1
                ],
                "sub_nid": "",
                "condition": "True",
                "time_left": null,
                "only_once": false,
                "interrupt_move": false
            }
        ],
        "unit_groups": [
            {
                "nid": "Pack1",
                "units": [
                    "wagon1",
                    "101",
                    "102"
                ],
                "positions": {
                    "wagon1": [
                        0,
                        7
                    ],
                    "101": [
                        0,
                        6
                    ],
                    "102": [
                        0,
                        8
                    ]
                }
            },
            {
                "nid": "Pack2",
                "units": [
                    "wagon2",
                    "103",
                    "104"
                ],
                "positions": {
                    "wagon2": [
                        0,
                        16
                    ],
                    "103": [
                        0,
                        17
                    ],
                    "104": [
                        0,
                        15
                    ]
                }
            },
            {
                "nid": "Pack3",
                "units": [
                    "wagon3",
                    "105",
                    "106"
                ],
                "positions": {
                    "wagon3": [
                        0,
                        7
                    ],
                    "105": [
                        0,
                        6
                    ],
                    "106": [
                        0,
                        8
                    ]
                }
            },
            {
                "nid": "Pack4",
                "units": [
                    "wagon4",
                    "107",
                    "108"
                ],
                "positions": {
                    "wagon4": [
                        0,
                        16
                    ],
                    "107": [
                        0,
                        17
                    ],
                    "108": [
                        0,
                        15
                    ]
                }
            },
            {
                "nid": "Pack5",
                "units": [
                    "wagon5",
                    "109"
                ],
                "positions": {
                    "wagon5": [
                        0,
                        7
                    ],
                    "109": [
                        0,
                        8
                    ]
                }
            },
            {
                "nid": "Pack6",
                "units": [
                    "wagon6",
                    "110"
                ],
                "positions": {
                    "wagon6": [
                        0,
                        16
                    ],
                    "110": [
                        0,
                        15
                    ]
                }
            },
            {
                "nid": "Wyverns",
                "units": [
                    "111",
                    "112"
                ],
                "positions": {
                    "111": [
                        0,
                        11
                    ],
                    "112": [
                        0,
                        12
                    ]
                }
            },
            {
                "nid": "Pack7",
                "units": [
                    "wagon7",
                    "113",
                    "114"
                ],
                "positions": {
                    "wagon7": [
                        0,
                        7
                    ],
                    "113": [
                        0,
                        8
                    ],
                    "114": [
                        0,
                        6
                    ]
                }
            },
            {
                "nid": "Pack8",
                "units": [
                    "Midas",
                    "Anders",
                    "115"
                ],
                "positions": {
                    "Midas": [
                        0,
                        16
                    ],
                    "Anders": [
                        0,
                        17
                    ],
                    "115": [
                        0,
                        15
                    ]
                }
            },
            {
                "nid": "Pack9",
                "units": [
                    "wagon9",
                    "116",
                    "117"
                ],
                "positions": {
                    "wagon9": [
                        0,
                        7
                    ],
                    "117": [
                        0,
                        6
                    ],
                    "116": [
                        0,
                        8
                    ]
                }
            },
            {
                "nid": "Pack10",
                "units": [
                    "wagon10",
                    "118",
                    "119"
                ],
                "positions": {
                    "wagon10": [
                        0,
                        16
                    ],
                    "118": [
                        0,
                        15
                    ],
                    "119": [
                        0,
                        17
                    ]
                }
            }
        ],
        "ai_groups": []
    }
]