categories;name;numero_bt;label;status;date_creation;date_modification;comment;image;view;xGeoCoord;yGeoCoord;isDomain;color
Command;load_whiteboard;;load_whiteboard;actif;;;;;;;;;
Command;update_magnet;;update_magnet;actif;;;;;;;;;
Command;move_magnet;;move_magnet;actif;;;;;;;;;
Command;delete_magnet;;delete_magnet;actif;;;;;;;;;
Command;create_magnets;;create_magnets;actif;;;;;;;;;
Command;create_single_magnet;;create_single_magnet;actif;;;;;;;;;
Command;create_zones;;create_zones;actif;;;;;;;;;
Command;update_zone;;update_zone;actif;;;;;;;;;
Command;delete_zone;;delete_zone;actif;;;;;;;;;
Command;update_whiteboard;;update_whiteboard;actif;;;;;;;;;
Command;create_group;;create_group;actif;;;;;;;;;
Command;add_to_group;;add_to_group;actif;;;;;;;;;
Command;ungroup_magnet;;ungroup_magnet;actif;;;;;;;;;
Command;move_group;;move_group;actif;;;;;;;;;
Command;create_whiteboard_template;;create_whiteboard_template;actif;;;;;;;;;
Command;update_magnet_type;;update_magnet_type;actif;;;;;;;;;
Command;magnet_type_manager;;magnet_type_manager;actif;;;;;;;;;
Command;rights_manager;;rights_manager;actif;;;;;;;;;
Command;duplicate_group;;duplicate_group;actif;;;;;;;;;
Command;delete_whiteboard;;delete_whiteboard;actif;;;;;;;;;
Command;duplicate_whiteboard;;duplicate_whiteboard;actif;;;;;;;;;
Command;create_news;;create_news;actif;;;;;;;;;
Command;delete_news;;delete_news;actif;;;;;;;;;
Command;update_news;;update_news;actif;;;;;;;;;
Command;duplicate_zone;;duplicate_zone;actif;;;;;;;;;
Command;templates_manager;;templates_manager;actif;;;;;;;;;
