<?xml version="1.0" encoding="UTF-8" standalone="no"?>
<!-- Created with Inkscape (http://www.inkscape.org/) -->

<svg
   xmlns:dc="http://purl.org/dc/elements/1.1/"
   xmlns:cc="http://creativecommons.org/ns#"
   xmlns:rdf="http://www.w3.org/1999/02/22-rdf-syntax-ns#"
   xmlns:svg="http://www.w3.org/2000/svg"
   xmlns="http://www.w3.org/2000/svg"
   xmlns:xlink="http://www.w3.org/1999/xlink"
   xmlns:sodipodi="http://sodipodi.sourceforge.net/DTD/sodipodi-0.dtd"
   xmlns:inkscape="http://www.inkscape.org/namespaces/inkscape"
   id="svg2046"
   sodipodi:docname="Stop.svg"
   viewBox="0 0 159.61 159.61"
   sodipodi:version="0.32"
   version="1.0"
   inkscape:version="0.48.4 r9939"
   width="100%"
   height="100%">
  <defs
     id="defs2048">
    <linearGradient
       id="linearGradient2109"
       y2="553.74"
       gradientUnits="userSpaceOnUse"
       x2="380.68"
       gradientTransform="matrix(0.31227,0,0,0.32049,127.55,434.38)"
       y1="296.37"
       x1="264.58">
      <stop
         id="stop5192"
         style="stop-color:#ffffff"
         offset="0" />
      <stop
         id="stop5194"
         style="stop-color:#52ba00;stop-opacity:1;"
         offset="1" />
    </linearGradient>
    <linearGradient
       inkscape:collect="always"
       xlink:href="#linearGradient2109"
       id="linearGradient5621"
       gradientUnits="userSpaceOnUse"
       gradientTransform="matrix(0.281043,0,0,0.288441,285.235,359.829)"
       x1="264.58"
       y1="296.37"
       x2="380.68"
       y2="553.74" />
    <linearGradient
       inkscape:collect="always"
       xlink:href="#linearGradient2109"
       id="linearGradient5624"
       gradientUnits="userSpaceOnUse"
       gradientTransform="matrix(-0.271467,0.0727398,-0.0746541,-0.278613,533.014,625.986)"
       x1="249.48"
       y1="262.87"
       x2="272.03"
       y2="427.54001" />
  </defs>
  <sodipodi:namedview
     id="base"
     bordercolor="#666666"
     inkscape:pageshadow="2"
     guidetolerance="10"
     pagecolor="#ffffff"
     gridtolerance="10000"
     inkscape:window-height="803"
     inkscape:zoom="1.979899"
     objecttolerance="10"
     borderopacity="1.0"
     inkscape:current-layer="layer1"
     inkscape:cx="53.19949"
     inkscape:cy="80.248024"
     inkscape:window-y="32"
     inkscape:window-x="0"
     inkscape:window-width="1598"
     inkscape:pageopacity="0.0"
     inkscape:document-units="px"
     showgrid="false"
     inkscape:window-maximized="0" />
  <g
     id="layer1"
     inkscape:label="Layer 1"
     inkscape:groupmode="layer"
     transform="translate(-311.62 -429.7)">
    <path
       sodipodi:cx="384.28571"
       sodipodi:cy="559.50507"
       transform="matrix(0.276174,0,0,0.276174,285.298,354.987)"
       d="m 634.28571,559.50507 a 250,250 0 1 1 -500,0 250,250 0 1 1 500,0 z"
       sodipodi:type="arc"
       style="fill:#6fa600;fill-rule:evenodd;stroke:#887d00;stroke-width:20.12800026000000031;fill-opacity:1;stroke-opacity:1"
       sodipodi:ry="250"
       sodipodi:rx="250"
       id="path2174" />
    <path
       inkscape:connector-curvature="0"
       d="m 408.211,570.924 c 17.145,-4.59 30.753,-15.894 38.907,-30.438 13.239,-31.338 -36.153,42.03 -76.941,28.701 11.853,4.347 25.029,5.22 38.034,1.737 z"
       style="fill:url(#linearGradient5624);fill-rule:evenodd;fill-opacity:1.0"
       sodipodi:nodetypes="cccc"
       id="path2540" />
    <path
       inkscape:connector-curvature="0"
       d="m 391.534,445.311 c -35.496,0 -64.296,29.565 -64.296,65.988 0,4.932 0.54,9.729 1.539,14.346 35.289,-67.923 73.305,-25.164 122.319,-39.195 -9.576,-24.12 -32.634,-41.139 -59.562,-41.139 z"
       style="fill:url(#linearGradient5621);fill-rule:evenodd"
       sodipodi:nodetypes="ccccc"
       id="path2197" />
    <path
       style="fill:#ffffff;fill-opacity:1;stroke:#dfd6dd;stroke-width:2;stroke-linecap:butt;stroke-linejoin:miter;stroke-miterlimit:4;stroke-opacity:1;stroke-dasharray:none"
       d="m 370.19143,472.88144 0,73.57142 57.14285,-36.07144 z"
       id="path5819"
       inkscape:connector-curvature="0"
       sodipodi:nodetypes="cccc" />
  </g>
  <metadata
     id="metadata5108">
    <rdf:RDF>
      <cc:Work>
        <dc:format>image/svg+xml</dc:format>
        <dc:type
           rdf:resource="http://purl.org/dc/dcmitype/StillImage" />
        <cc:license
           rdf:resource="http://creativecommons.org/licenses/publicdomain/" />
        <dc:publisher>
          <cc:Agent
             rdf:about="http://openclipart.org/">
            <dc:title>Openclipart</dc:title>
          </cc:Agent>
        </dc:publisher>
        <dc:title></dc:title>
        <dc:date>2006-09-07T17:35:55</dc:date>
        <dc:description>a red round error or warning icon</dc:description>
        <dc:source>https://openclipart.org/detail/109/red-round-error-warning-icon-by-molumen</dc:source>
        <dc:creator>
          <cc:Agent>
            <dc:title>molumen</dc:title>
          </cc:Agent>
        </dc:creator>
        <dc:subject>
          <rdf:Bag>
            <rdf:li>button</rdf:li>
            <rdf:li>cancel</rdf:li>
            <rdf:li>delete</rdf:li>
            <rdf:li>error</rdf:li>
            <rdf:li>glossy</rdf:li>
            <rdf:li>icon</rdf:li>
            <rdf:li>negative</rdf:li>
            <rdf:li>red</rdf:li>
            <rdf:li>round</rdf:li>
            <rdf:li>stop</rdf:li>
            <rdf:li>warning</rdf:li>
          </rdf:Bag>
        </dc:subject>
      </cc:Work>
      <cc:License
         rdf:about="http://creativecommons.org/licenses/publicdomain/">
        <cc:permits
           rdf:resource="http://creativecommons.org/ns#Reproduction" />
        <cc:permits
           rdf:resource="http://creativecommons.org/ns#Distribution" />
        <cc:permits
           rdf:resource="http://creativecommons.org/ns#DerivativeWorks" />
      </cc:License>
    </rdf:RDF>
  </metadata>
</svg>
