<?xml version="1.0" encoding="UTF-8" standalone="no"?>
<!-- Created with Inkscape (http://www.inkscape.org/) -->

<svg
   xmlns:dc="http://purl.org/dc/elements/1.1/"
   xmlns:cc="http://creativecommons.org/ns#"
   xmlns:rdf="http://www.w3.org/1999/02/22-rdf-syntax-ns#"
   xmlns:svg="http://www.w3.org/2000/svg"
   xmlns="http://www.w3.org/2000/svg"
   version="1.0"
   width="100%"
   height="100%"
   viewBox="0 0 60 60"
   id="svg1">
  <defs
     id="defs21" />
  <path
     d="M 8.7488,47.97 46.5278,26.158"
     id="path2999"
     style="fill:none;stroke:#ffffff;stroke-width:10;stroke-linecap:round;stroke-linejoin:round" />
  <path
     d="m 50.264,23.95 -2.9,8.612 -6.044,-10.223 8.944,1.611 z"
     id="path2992"
     style="color:#000000;fill:#000000;stroke:#ffffff;stroke-width:8.125;stroke-linecap:round;stroke-linejoin:round" />
  <path
     d="m 50.264,23.95 -2.9,8.612 -6.044,-10.223 8.944,1.611 z"
     id="path1317"
     style="color:#000000;fill:#e71c02;stroke:#e71c02;stroke-width:3.125;stroke-linecap:round;stroke-linejoin:round" />
  <path
     d="M 29.948,10.885 8.593,47.874 h 42.711"
     id="path2097"
     style="color:#000000;fill:none;stroke:#ffffff;stroke-width:10;stroke-linecap:round;stroke-linejoin:round" />
  <path
     d="m 24.074,11.474 c -0.848,3.164 1.032,6.42 4.196,7.268 3.165,0.848 6.421,-1.032 7.269,-4.196 0.848,-3.164 -1.032,-6.4206 -4.197,-7.2684 -3.164,-0.8479 -6.42,1.0321 -7.268,4.1964 z"
     id="path2083"
     style="color:#000000;fill:none;stroke:#ffffff;stroke-width:8.125;stroke-linecap:round;stroke-linejoin:round;display:block" />
  <path
     d="m 4.8909,45.454 c -0.8478,3.164 1.0322,6.421 4.1964,7.268 3.1647,0.848 6.4207,-1.032 7.2687,-4.196 0.848,-3.164 -1.032,-6.42 -4.197,-7.268 C 8.995,40.41 5.7388,42.29 4.8909,45.454 z"
     id="path2085"
     style="color:#000000;fill:none;stroke:#ffffff;stroke-width:8.125;stroke-linecap:round;stroke-linejoin:round;display:block" />
  <path
     d="m 43.644,45.454 c -0.848,3.164 1.032,6.421 4.197,7.268 3.164,0.848 6.42,-1.032 7.268,-4.196 0.848,-3.164 -1.032,-6.42 -4.196,-7.268 -3.165,-0.848 -6.421,1.032 -7.269,4.196 z"
     id="path1331"
     style="color:#000000;fill:none;stroke:#ffffff;stroke-width:8.125;stroke-linecap:round;stroke-linejoin:round;display:block" />
  <path
     d="m 38.125,47 c 0,-10.572 -6.056,-19.649 -14.813,-24.25"
     id="path2167"
     style="color:#000000;fill:none;stroke:#f2f8ff;stroke-width:10;stroke-linecap:round;stroke-linejoin:round" />
  <path
     d="M 23.312,22.75 8.75,47.969 h 29.281 c 0.012,-0.33 0.094,-0.637 0.094,-0.969 0,-10.572 -6.056,-19.649 -14.813,-24.25 z"
     id="path2157"
     style="color:#000000;fill:#c5d8ef" />
  <path
     d="m 38.125,47 c 0,-10.572 -6.056,-19.649 -14.813,-24.25"
     id="path2165"
     style="color:#000000;fill:none;stroke:#9da1a6;stroke-width:5;stroke-linecap:round;stroke-linejoin:round" />
  <path
     d="M 30,11.162 8.749,47.97 h 42.502"
     id="path1322"
     style="color:#000000;fill:none;stroke:#000000;stroke-width:5;stroke-linecap:round;stroke-linejoin:round" />
  <path
     d="m 43.644,45.454 c -0.848,3.164 1.032,6.421 4.197,7.268 3.164,0.848 6.42,-1.032 7.268,-4.196 0.848,-3.164 -1.032,-6.42 -4.196,-7.268 -3.165,-0.848 -6.421,1.032 -7.269,4.196 z"
     id="path1333"
     style="color:#000000;fill:#ffe940;stroke:#000000;stroke-width:3.125;stroke-linecap:round;stroke-linejoin:round;display:block" />
  <path
     d="M 8.7488,47.97 46.5278,26.158"
     id="path1323"
     style="fill:none;stroke:#e71c02;stroke-width:5;stroke-linecap:round;stroke-linejoin:round" />
  <path
     d="m 4.8909,45.454 c -0.8478,3.164 1.0322,6.421 4.1964,7.268 3.1647,0.848 6.4207,-1.032 7.2687,-4.196 0.848,-3.164 -1.032,-6.42 -4.197,-7.268 C 8.995,40.41 5.7388,42.29 4.8909,45.454 z"
     id="path2087"
     style="color:#000000;fill:#ffe940;stroke:#000000;stroke-width:3.125;stroke-linecap:round;stroke-linejoin:round;display:block" />
  <path
     d="m 24.074,11.474 c -0.848,3.164 1.032,6.42 4.196,7.268 3.165,0.848 6.421,-1.032 7.269,-4.196 0.848,-3.164 -1.032,-6.4206 -4.197,-7.2684 -3.164,-0.8479 -6.42,1.0321 -7.268,4.1964 z"
     id="path2086"
     style="color:#000000;fill:#ffe940;stroke:#000000;stroke-width:3.125;stroke-linecap:round;stroke-linejoin:round;display:block" />
  <metadata
     id="metadata19">
    <rdf:RDF>
      <cc:Work>
        <dc:format>image/svg+xml</dc:format>
        <dc:type
           rdf:resource="http://purl.org/dc/dcmitype/StillImage" />
        <cc:license
           rdf:resource="http://creativecommons.org/licenses/publicdomain/" />
        <dc:publisher>
          <cc:Agent
             rdf:about="http://openclipart.org/">
            <dc:title>Openclipart</dc:title>
          </cc:Agent>
        </dc:publisher>
        <dc:title></dc:title>
      </cc:Work>
      <cc:License
         rdf:about="http://creativecommons.org/licenses/publicdomain/">
        <cc:permits
           rdf:resource="http://creativecommons.org/ns#Reproduction" />
        <cc:permits
           rdf:resource="http://creativecommons.org/ns#Distribution" />
        <cc:permits
           rdf:resource="http://creativecommons.org/ns#DerivativeWorks" />
      </cc:License>
    </rdf:RDF>
  </metadata>
</svg>
