<?xml version="1.0" encoding="UTF-8" standalone="no"?>
<!-- Created with Inkscape (http://www.inkscape.org/) -->

<svg
   xmlns:dc="http://purl.org/dc/elements/1.1/"
   xmlns:cc="http://creativecommons.org/ns#"
   xmlns:rdf="http://www.w3.org/1999/02/22-rdf-syntax-ns#"
   xmlns:svg="http://www.w3.org/2000/svg"
   xmlns="http://www.w3.org/2000/svg"
   xmlns:sodipodi="http://sodipodi.sourceforge.net/DTD/sodipodi-0.dtd"
   xmlns:inkscape="http://www.inkscape.org/namespaces/inkscape"
   version="1.0"
   width="100%"
   height="100%"
   viewBox="0 0 40 40"
   id="svg1"
   inkscape:version="0.48.4 r9939"
   sodipodi:docname="AngularVelocity.svg">
  <sodipodi:namedview
     pagecolor="#ffffff"
     bordercolor="#666666"
     borderopacity="1"
     objecttolerance="10"
     gridtolerance="10"
     guidetolerance="10"
     inkscape:pageopacity="0"
     inkscape:pageshadow="2"
     inkscape:window-width="1598"
     inkscape:window-height="771"
     id="namedview5630"
     showgrid="false"
     inkscape:zoom="8.34386"
     inkscape:cx="-9.4651047"
     inkscape:cy="15.682894"
     inkscape:window-x="0"
     inkscape:window-y="48"
     inkscape:window-maximized="0"
     inkscape:current-layer="svg1" />
  <defs
     id="defs21" />
  <metadata
     id="metadata19">
    <rdf:RDF>
      <cc:Work>
        <dc:format>image/svg+xml</dc:format>
        <dc:type
           rdf:resource="http://purl.org/dc/dcmitype/StillImage" />
        <cc:license
           rdf:resource="http://creativecommons.org/licenses/publicdomain/" />
        <dc:publisher>
          <cc:Agent
             rdf:about="http://openclipart.org/">
            <dc:title>Openclipart</dc:title>
          </cc:Agent>
        </dc:publisher>
        <dc:title></dc:title>
        <dc:title />
      </cc:Work>
      <cc:License
         rdf:about="http://creativecommons.org/licenses/publicdomain/">
        <cc:permits
           rdf:resource="http://creativecommons.org/ns#Reproduction" />
        <cc:permits
           rdf:resource="http://creativecommons.org/ns#Distribution" />
        <cc:permits
           rdf:resource="http://creativecommons.org/ns#DerivativeWorks" />
      </cc:License>
    </rdf:RDF>
  </metadata>
  <path
     d="M 3.5890853,36.093384 C 2.7677037,5.3724769 26.672487,4.2913554 35.526365,5.1966353"
     id="path2992"
     style="fill:none;stroke:#000000;stroke-width:1;stroke-linecap:butt;stroke-linejoin:miter;stroke-opacity:1;stroke-miterlimit:4;stroke-dasharray:1,1;stroke-dashoffset:0"
     inkscape:connector-curvature="0"
     sodipodi:nodetypes="cc" />
  <path
     id="path2086-1-6"
     style="color:#000000;fill:#c8c8c8;fill-opacity:1;stroke:#000000;stroke-width:1.20000005;stroke-linecap:round;stroke-linejoin:round;stroke-miterlimit:4;stroke-dasharray:none;display:block"
     d="m 32.638826,4.5202666 c -0.311676,1.162905 0.379304,2.359623 1.54221,2.671299 1.163272,0.311676 2.35999,-0.379304 2.671666,-1.542208 0.311677,-1.162905 -0.379303,-2.359844 -1.542576,-2.671447 -1.162904,-0.311639 -2.359623,0.379341 -2.6713,1.542356 z"
     inkscape:connector-curvature="0" />
  <path
     style="fill:none;stroke:#000000;stroke-width:1;stroke-linecap:butt;stroke-linejoin:miter;stroke-opacity:1;stroke-miterlimit:4;stroke-dasharray:8,2,1,2;stroke-dashoffset:0"
     d="M 3.5954582,35.925147 34.636248,36.044996 34.875945,4.7645095"
     id="path3109"
     inkscape:connector-curvature="0" />
  <g
     id="g3904">
    <path
       d="M 5.7354506,3.2901512 12.111133,4.3043836 5.5797529,9.7111956 5.7354318,3.2901314 z"
       id="path1317"
       style="color:#000000;fill:#e71c02;stroke:#e71c02;stroke-width:2.21639967;stroke-linecap:round;stroke-linejoin:round"
       inkscape:connector-curvature="0" />
    <path
       d="M 33.297414,34.612895 9.6073007,7.6918089"
       id="path1323"
       style="fill:none;stroke:#e71c02;stroke-width:3.55802894;stroke-linecap:round;stroke-linejoin:round"
       inkscape:connector-curvature="0" />
  </g>
</svg>
