<?xml version="1.0" encoding="UTF-8" standalone="no"?>
<!-- Created with Inkscape (http://www.inkscape.org/) -->

<svg
   xmlns:dc="http://purl.org/dc/elements/1.1/"
   xmlns:cc="http://creativecommons.org/ns#"
   xmlns:rdf="http://www.w3.org/1999/02/22-rdf-syntax-ns#"
   xmlns:svg="http://www.w3.org/2000/svg"
   xmlns="http://www.w3.org/2000/svg"
   xmlns:sodipodi="http://sodipodi.sourceforge.net/DTD/sodipodi-0.dtd"
   xmlns:inkscape="http://www.inkscape.org/namespaces/inkscape"
   id="svg2"
   viewBox="0 0 80 80"
   version="1.0"
   inkscape:version="0.48.4 r9939"
   width="100%"
   height="100%"
   sodipodi:docname="Collision.svg">
  <defs
     id="defs12" />
  <sodipodi:namedview
     pagecolor="#ffffff"
     bordercolor="#666666"
     borderopacity="1"
     objecttolerance="10"
     gridtolerance="10"
     guidetolerance="10"
     inkscape:pageopacity="0"
     inkscape:pageshadow="2"
     inkscape:window-width="1598"
     inkscape:window-height="835"
     id="namedview10"
     showgrid="false"
     inkscape:zoom="3.7083822"
     inkscape:cx="25.901132"
     inkscape:cy="71.509782"
     inkscape:window-x="0"
     inkscape:window-y="32"
     inkscape:window-maximized="0"
     inkscape:current-layer="svg2" />
  <path
     inkscape:connector-curvature="0"
     d="m 42.682219,51.3502 a 18.366185,18.366235 0 0 1 -36.7323701,0 18.366185,18.366235 0 1 1 36.7323701,0 z"
     style="fill:#646464;fill-opacity:1;stroke:#000000;stroke-width:4;stroke-miterlimit:4;stroke-opacity:1;stroke-dasharray:none"
     id="path2490" />
  <metadata
     id="metadata8">
    <rdf:RDF>
      <cc:Work>
        <dc:format>image/svg+xml</dc:format>
        <dc:type
           rdf:resource="http://purl.org/dc/dcmitype/StillImage" />
        <cc:license
           rdf:resource="http://creativecommons.org/licenses/publicdomain/" />
        <dc:publisher>
          <cc:Agent
             rdf:about="http://openclipart.org/">
            <dc:title>Openclipart</dc:title>
          </cc:Agent>
        </dc:publisher>
        <dc:title></dc:title>
        <dc:date>2011-02-02T23:50:45</dc:date>
        <dc:description>This picture is meant to show people the supreme shapes. They were designed to be big enough to see clearly.\nI made them in inkscape, which is currently the best free vector graphics program available for Linux.\n\nWhen dealing with the natural world we live in, we tend to not appreciate the most basic things around us.\nMany colors, numbers, and shapes, make up the objects which we see and feel. Although there are endless variations of everything,I have noticed that almost everything man made tends to resemble one of 4 common shapes.\n\nAlso, look up the definition of supreme and you'll see why I like this word.\nhttp://en.wiktionary.org/wiki/supreme\n\nregular quadrilateral(square)\n\nThe square is my favorite shape of all. All of it's four sides are the same length. Many people think that\na square and rectangle are different things, however, a square is a type of rectangle. Other rectangles may have\na different width/height ratio but all types of rectangles are useful for building things(brick houses,legos,chessboards,etc).\nIt's also the only type of shape which can actually be represented accurately on a computer screen because pixels\nare squares. If you look around you, you'll probably find that squares and other\nrectangles(all of which can be divided into smaller squares), are the most commonly made shape of all man-made objects.\nThe 3 dimensional version of a square is called a cube. Most furniture and storage containers are a rectangle on every side.\n\nregular triangle\n\nA triangle is a 3 sided shape.\nAll triangles are interesting, however, the most commonly used triangle is a regular or equilateral triangle.\nRegular triangles have something in common with squares in that both of them can tesselate. This means that it's\npossible fit a bunch of them together with no gaps. Many times, the are useful in making other shapes.\n\nregular hexagon\n\nA hexagon has 6 sides, but a regular hexagon is the most useful because it is the regular polygon with the most sides\nthat can still tesselate perfectly! A regular hexagon can be formed with 6 regular triangles.\n\ncircle\n\ncircles are totally different from the other 3 supreme shapes. They do not tesselate, they can't be described by a number of sides. However, there are two reason that I include them in my definition of supreme shapes. First, they occur in God's creation more than anything else. Almost all plants have circular parts. The stems of plants(and trunks of trees), many fruits, and maybe every living animal. Although not all things are perfect circles, many things on the human body are mostly round. Rarely do you find anything that is flat or straight. The second reason is that they are useful for anything that is designed to move. Think of wheels on everything or spheres which are used for nearly every sport.\nRound things move easy. This is the total opposite of rectangles which are useful when you need something to stay in one place.\n</dc:description>
        <dc:source>https://openclipart.org/detail/116905/supreme-shapes-by-10binary</dc:source>
        <dc:creator>
          <cc:Agent>
            <dc:title>10binary</dc:title>
          </cc:Agent>
        </dc:creator>
        <dc:subject>
          <rdf:Bag>
            <rdf:li>10binary</rdf:li>
            <rdf:li>Chandler</rdf:li>
            <rdf:li>Isaac</rdf:li>
            <rdf:li>Klebs</rdf:li>
            <rdf:li>circle</rdf:li>
            <rdf:li>hexagon</rdf:li>
            <rdf:li>square</rdf:li>
            <rdf:li>supreme</rdf:li>
            <rdf:li>triangle</rdf:li>
          </rdf:Bag>
        </dc:subject>
      </cc:Work>
      <cc:License
         rdf:about="http://creativecommons.org/licenses/publicdomain/">
        <cc:permits
           rdf:resource="http://creativecommons.org/ns#Reproduction" />
        <cc:permits
           rdf:resource="http://creativecommons.org/ns#Distribution" />
        <cc:permits
           rdf:resource="http://creativecommons.org/ns#DerivativeWorks" />
      </cc:License>
    </rdf:RDF>
  </metadata>
  <path
     inkscape:connector-curvature="0"
     d="M 44.761306,6.5583215 40.316599,37.450541 69.29289,25.853036 44.761306,6.5583215 z"
     style="fill:#646464;fill-opacity:1;fill-rule:evenodd;stroke:#000000;stroke-width:4;stroke-miterlimit:4;stroke-opacity:1;stroke-dasharray:none"
     id="path2462" />
  <path
     style="fill:none;stroke:#000000;stroke-width:1.5;stroke-linecap:butt;stroke-linejoin:miter;stroke-opacity:1;stroke-miterlimit:4;stroke-dasharray:none"
     d="m 46.576639,41.22959 c 18.201408,3.814036 19.010833,4.526979 19.010833,4.526979"
     id="path3809"
     inkscape:connector-curvature="0"
     inkscape:transform-center-x="-8.3523475"
     inkscape:transform-center-y="-11.315571" />
  <path
     style="fill:none;stroke:#000000;stroke-width:1.5;stroke-linecap:butt;stroke-linejoin:miter;stroke-opacity:1;stroke-miterlimit:4;stroke-dasharray:none"
     d="M 35.072462,28.462945 C 29.106466,11.808298 29.106466,11.808298 29.106466,11.808298"
     id="path3813"
     inkscape:connector-curvature="0" />
  <path
     style="fill:none;stroke:#000000;stroke-width:1.5;stroke-linecap:butt;stroke-linejoin:miter;stroke-opacity:1;stroke-miterlimit:4;stroke-dasharray:none"
     d="M 16.98854,15.281752 C 31.010827,30.382677 31.010827,30.382677 31.010827,30.382677"
     id="path3815"
     inkscape:connector-curvature="0" />
  <path
     style="fill:none;stroke:#000000;stroke-width:1.5;stroke-linecap:butt;stroke-linejoin:miter;stroke-opacity:1;stroke-miterlimit:4;stroke-dasharray:none"
     d="M 45.302774,45.213942 C 59.325061,60.314867 59.325061,60.314867 59.325061,60.314867"
     id="path3815-9"
     inkscape:connector-curvature="0" />
</svg>
