<?xml version="1.0" encoding="UTF-8" standalone="no"?>
<!-- Created with Inkscape (http://www.inkscape.org/) -->

<svg
   xmlns:dc="http://purl.org/dc/elements/1.1/"
   xmlns:cc="http://creativecommons.org/ns#"
   xmlns:rdf="http://www.w3.org/1999/02/22-rdf-syntax-ns#"
   xmlns:svg="http://www.w3.org/2000/svg"
   xmlns="http://www.w3.org/2000/svg"
   xmlns:xlink="http://www.w3.org/1999/xlink"
   xmlns:sodipodi="http://sodipodi.sourceforge.net/DTD/sodipodi-0.dtd"
   xmlns:inkscape="http://www.inkscape.org/namespaces/inkscape"
   id="svg13670"
   viewBox="0 0 623.13 607.53"
   version="1.1"
   inkscape:version="0.48.4 r9939"
   width="100%"
   height="100%"
   sodipodi:docname="Flower-a7.svg">
  <sodipodi:namedview
     pagecolor="#ffffff"
     bordercolor="#666666"
     borderopacity="1"
     objecttolerance="10"
     gridtolerance="10"
     guidetolerance="10"
     inkscape:pageopacity="0"
     inkscape:pageshadow="2"
     inkscape:window-width="1918"
     inkscape:window-height="951"
     id="namedview45"
     showgrid="false"
     inkscape:zoom="0.38845818"
     inkscape:cx="311.565"
     inkscape:cy="303.765"
     inkscape:window-x="1600"
     inkscape:window-y="48"
     inkscape:window-maximized="0"
     inkscape:current-layer="svg13670" />
  <defs
     id="defs13672">
    <linearGradient
       id="linearGradient18014">
      <stop
         id="stop18016"
         style="stop-color:#ffffff"
         offset="0" />
      <stop
         id="stop18018"
         style="stop-color:#ffffff;stop-opacity:0"
         offset="1" />
    </linearGradient>
    <filter
       id="filter18742-6"
       color-interpolation-filters="sRGB">
      <feGaussianBlur
         id="feGaussianBlur18744-7"
         stdDeviation="1.5845507" />
    </filter>
    <clipPath
       id="clipPath18010">
      <path
         id="path18012"
         style="stroke:#000000;stroke-width:.27272px;fill:none"
         d="m2538.1-695.19s-16.541 34.223 23.956 70.158c40.498 35.935 103.24 50.194 103.24 50.194l34.223-77.003-86.699-60.461z" />
    </clipPath>
    <filter
       id="filter18582"
       color-interpolation-filters="sRGB">
      <feGaussianBlur
         id="feGaussianBlur18584"
         stdDeviation="2.348116" />
    </filter>
    <linearGradient
       id="linearGradient18603"
       y2="-667.1"
       gradientUnits="userSpaceOnUse"
       x2="2673.2"
       y1="-526.3"
       x1="2528.8">
      <stop
         id="stop18044"
         style="stop-color:#ffdd55"
         offset="0" />
      <stop
         id="stop18046"
         style="stop-color:#aa8800"
         offset="1" />
    </linearGradient>
    <linearGradient
       id="linearGradient18605"
       y2="-547.32"
       gradientUnits="userSpaceOnUse"
       x2="2584.2"
       y1="-645.51"
       x1="2592.1">
      <stop
         id="stop18036"
         style="stop-color:#d4aa00"
         offset="0" />
      <stop
         id="stop18038"
         style="stop-color:#ffdd55;stop-opacity:0"
         offset="1" />
    </linearGradient>
    <linearGradient
       id="linearGradient18607"
       y2="-572.56"
       xlink:href="#linearGradient18014"
       gradientUnits="userSpaceOnUse"
       x2="2560.4"
       y1="-690.63"
       x1="2634" />
    <linearGradient
       id="linearGradient18611"
       y2="-114.62"
       gradientUnits="userSpaceOnUse"
       x2="3004.4"
       gradientTransform="matrix(-3.6668 0 0 3.6668 11530 807.63)"
       y1="-184.94"
       x1="3043.5">
      <stop
         id="stop19343-4"
         style="stop-color:#ff9955"
         offset="0" />
      <stop
         id="stop19345-1"
         style="stop-color:#ff9955;stop-opacity:0"
         offset="1" />
    </linearGradient>
    <linearGradient
       id="linearGradient18613"
       y2="415.55"
       gradientUnits="userSpaceOnUse"
       x2="300.79"
       y1="218.18"
       x1="259.69">
      <stop
         id="stop18026"
         style="stop-color:#ffffff"
         offset="0" />
      <stop
         id="stop18028"
         style="stop-color:#ffffff;stop-opacity:0"
         offset="1" />
    </linearGradient>
  </defs>
  <g
     id="layer1"
     transform="translate(-68.764 91.248)">
    <g
       id="g18586">
      <g
         id="g18050"
         style="filter:url(#filter18582);fill:#000000"
         transform="matrix(-3.6668 0 0 3.6668 9863.8 2341.8)">
        <path
           id="path18052"
           style="fill:#000000"
           d="m2599.3-657.85c-10.883 0.67071-20.867 8.1275-24.531 18.375-14.633-12.715-40.413-8.4956-49.406 8.7188-5.4376 9.7206-4.1241 22.964 3.25 31.312-17.74 6.059-27.248 29.227-18.031 45.844 5.6445 10.71 18.956 16.689 30.625 14.062-2.3134 18.04 13.029 35.949 31.281 36.031 10.678 0.26736 21.037-6.1451 25.469-15.75 14.451 12.362 39.909 8.6046 49.031-8.375 5.9134-9.7384 4.4106-23.209-2.875-31.75 17.218-5.9794 26.981-28.331 18.379-45.008-5.2475-10.739-18.216-17.515-29.973-14.93 3.7827-19.599-13.12-39.87-33.219-38.531z" />
      </g>
      <g
         id="g20470"
         style="fill:#806600"
         transform="matrix(-3.6668 0 0 3.6668 9873.8 2345.8)">
        <path
           id="path20472"
           style="fill:#806600"
           d="m2599.3-657.85c-10.883 0.67071-20.867 8.1275-24.531 18.375-14.633-12.715-40.413-8.4956-49.406 8.7188-5.4376 9.7206-4.1241 22.964 3.25 31.312-17.74 6.059-27.248 29.227-18.031 45.844 5.6445 10.71 18.956 16.689 30.625 14.062-2.3134 18.04 13.029 35.949 31.281 36.031 10.678 0.26736 21.037-6.1451 25.469-15.75 14.451 12.362 39.909 8.6046 49.031-8.375 5.9134-9.7384 4.4106-23.209-2.875-31.75 17.218-5.9794 26.981-28.331 18.379-45.008-5.2475-10.739-18.216-17.515-29.973-14.93 3.7827-19.599-13.12-39.87-33.219-38.531z" />
      </g>
      <g
         id="g20474"
         style="fill:#ffcc00"
         transform="matrix(-3.6668 0 0 3.6668 9863.1 2417.9)">
        <path
           id="path20476"
           style="fill:#ffcc00"
           d="m2605.6-687.79c0 15.577-13.621 28.205-30.423 28.205s-30.423-12.628-30.423-28.205 13.621-28.205 30.423-28.205 30.423 12.628 30.423 28.205zm-65.284-76.058c0 15.577-13.621 28.205-30.423 28.205s-30.423-12.628-30.423-28.205 13.621-28.205 30.423-28.205 30.423 12.628 30.423 28.205zm63.856 2.5977c13.49 7.7886 17.616 25.899 9.2146 40.45-8.4012 14.551-26.148 20.034-39.638 12.245-13.49-7.7886-17.616-25.899-9.2146-40.45 8.4012-14.551 26.148-20.033 39.638-12.245zm-95.681 18.338c13.49 7.7886 17.616 25.899 9.2146 40.45-8.4012 14.551-26.148 20.034-39.638 12.245-13.49-7.7886-17.616-25.899-9.2145-40.45 8.4011-14.551 26.148-20.033 39.638-12.245zm35.445-56.537c13.49-7.7886 31.237-2.3064 39.638 12.245 8.4012 14.551 4.2757 32.661-9.2146 40.45-13.49 7.7886-31.237 2.3064-39.638-12.245-8.4011-14.551-4.2756-32.661 9.2146-40.45zm-17.236 48.74c13.49-7.7886 31.237-2.3064 39.638 12.245 8.4012 14.551 4.2757 32.661-9.2146 40.45-13.49 7.7886-31.237 2.3064-39.638-12.245-8.4012-14.551-4.2757-32.661 9.2146-40.45zm-15.991 45.826c13.49-7.7886 31.237-2.3064 39.638 12.245 8.4012 14.551 4.2757 32.661-9.2145 40.45-13.49 7.7886-31.237 2.3064-39.638-12.245-8.4011-14.551-4.2756-32.661 9.2146-40.45z"
           transform="matrix(-.5 .86603 -.86603 -.5 3222.7 -3162)" />
      </g>
      <g
         id="g20480"
         style="fill:url(#linearGradient18605)"
         transform="matrix(-3.6668 0 0 3.6668 9863.1 2414.6)">
        <path
           id="path20482"
           style="fill:url(#linearGradient18603)"
           d="m2593.9-670.62c-10.773 0.20733-19.395 9.0283-22.531 18.75-5.1926 2.3348-7.7831-4.1503-12.219-5.2812-14.773-7.1891-36.108 1.7729-38.281 18.719-1.3905 9.7138 4.0641 19.595 12.438 24.344-19.42-0.97127-33.74 22.612-25.094 39.719 4.9638 9.9999 17.632 14.9 28.25 11.656 4.3156 0.84213 3.4965 6.2838 3.0938 9.5312 0.1898 15.954 16.663 30.282 32.594 26.219 9.0721-2.3762 16.089-10.47 17.312-19.656 10.228 16.545 38.519 15.395 47.188-1.875 5.7318-10.684 1.1141-25.634-9.5-31.188 4.7553-1.413 10.054-1.6285 14.094-4.75 12.347-8.0462 17.518-27.007 8-39.094-6.8545-9.4595-21.628-11.857-31.406-5.125 11.077-17.165-3.5749-42.823-23.938-41.969z" />
      </g>
      <path
         id="path20478"
         style="filter:url(#filter18742-6);fill:#000000"
         d="m2613.9-575.29a31.691 31.691 0 1 1 -63.382 0 31.691 31.691 0 1 1 63.382 0z"
         transform="matrix(-3.6668 0 0 3.6668 9856.4 2339.8)" />
      <g
         id="g18004"
         style="fill:url(#linearGradient18607)"
         transform="matrix(-3.5967 0 0 3.4703 9685.5 2293.3)"
         clip-path="url(#clipPath18010)">
        <path
           id="path18006"
           style="fill:url(#linearGradient18607)"
           d="m2593.9-670.62c-10.773 0.20733-19.395 9.0283-22.531 18.75-5.1926 2.3348-7.7831-4.1503-12.219-5.2812-14.773-7.1891-36.108 1.7729-38.281 18.719-1.3905 9.7138 4.0641 19.595 12.438 24.344-19.42-0.97127-33.74 22.612-25.094 39.719 4.9638 9.9999 17.632 14.9 28.25 11.656 4.3156 0.84213 3.4965 6.2838 3.0938 9.5312 0.1898 15.954 16.663 30.282 32.594 26.219 9.0721-2.3762 16.089-10.47 17.312-19.656 10.228 16.545 38.519 15.395 47.188-1.875 5.7318-10.684 1.1141-25.634-9.5-31.188 4.7553-1.413 10.054-1.6285 14.094-4.75 12.347-8.0462 17.518-27.007 8-39.094-6.8545-9.4595-21.628-11.857-31.406-5.125 11.077-17.165-3.5749-42.823-23.938-41.969z" />
      </g>
      <path
         id="path20484"
         style="fill:#803300"
         d="m284.05 236.93a116.2 116.2 0 1 0 232.41 0 116.2 116.2 0 1 0 -232.41 0z" />
      <path
         id="path20486"
         style="fill:#d45500"
         d="m300.32 248.56a116.2 116.2 0 1 0 232.41 0 116.2 116.2 0 1 0 -232.41 0z" />
      <path
         id="path20488"
         style="fill:url(#linearGradient18611)"
         d="m419.08 146.11c67.087-1.2862 120.12 77.207 93.503 139.11-19.735 54.383-92.513 84.255-144.15 54.085-47.55-25.211-71.017-91.591-41.795-139.39 18.111-32.655 54.284-55.505 92.442-53.799z" />
      <path
         id="path18022"
         style="opacity:.55;fill:url(#linearGradient18613)"
         d="m372.29 316.36a87.843 56.471 0 1 1 -175.69 0 87.843 56.471 0 1 1 175.69 0z"
         transform="matrix(.86303 -.42928 .33476 1.1067 54.369 .33163)" />
    </g>
  </g>
  <metadata
     id="metadata43">
    <rdf:RDF>
      <cc:Work>
        <dc:format>image/svg+xml</dc:format>
        <dc:type
           rdf:resource="http://purl.org/dc/dcmitype/StillImage" />
        <cc:license
           rdf:resource="http://creativecommons.org/licenses/publicdomain/" />
        <dc:publisher>
          <cc:Agent
             rdf:about="http://openclipart.org/">
            <dc:title>Openclipart</dc:title>
          </cc:Agent>
        </dc:publisher>
        <dc:title></dc:title>
        <dc:date>2010-08-16T18:40:15</dc:date>
        <dc:description>Glossy flowers</dc:description>
        <dc:source>https://openclipart.org/detail/80911/flower-a7-by-inky2010</dc:source>
        <dc:creator>
          <cc:Agent>
            <dc:title>inky2010</dc:title>
          </cc:Agent>
        </dc:creator>
        <dc:subject>
          <rdf:Bag>
            <rdf:li>3D</rdf:li>
            <rdf:li>Flower</rdf:li>
            <rdf:li>art</rdf:li>
            <rdf:li>fall</rdf:li>
            <rdf:li>fall2010</rdf:li>
            <rdf:li>flowers</rdf:li>
            <rdf:li>gloss</rdf:li>
            <rdf:li>glossy</rdf:li>
            <rdf:li>inkscape</rdf:li>
            <rdf:li>inky2010</rdf:li>
          </rdf:Bag>
        </dc:subject>
      </cc:Work>
      <cc:License
         rdf:about="http://creativecommons.org/licenses/publicdomain/">
        <cc:permits
           rdf:resource="http://creativecommons.org/ns#Reproduction" />
        <cc:permits
           rdf:resource="http://creativecommons.org/ns#Distribution" />
        <cc:permits
           rdf:resource="http://creativecommons.org/ns#DerivativeWorks" />
      </cc:License>
    </rdf:RDF>
  </metadata>
</svg>
