<?xml version="1.0" encoding="UTF-8" standalone="no"?>
<!-- Created with Inkscape (http://www.inkscape.org/) -->

<svg
   xmlns:dc="http://purl.org/dc/elements/1.1/"
   xmlns:cc="http://creativecommons.org/ns#"
   xmlns:rdf="http://www.w3.org/1999/02/22-rdf-syntax-ns#"
   xmlns:svg="http://www.w3.org/2000/svg"
   xmlns="http://www.w3.org/2000/svg"
   xmlns:sodipodi="http://sodipodi.sourceforge.net/DTD/sodipodi-0.dtd"
   xmlns:inkscape="http://www.inkscape.org/namespaces/inkscape"
   width="171.07265mm"
   height="57.16787mm"
   viewBox="0 0 606.16292 202.56332"
   id="svg7690"
   version="1.1"
   inkscape:version="0.91 r13725"
   sodipodi:docname="rfda.svg">
  <defs
     id="defs7692">
    <marker
       inkscape:stockid="Arrow1Lstart"
       orient="auto"
       refY="0"
       refX="0"
       id="Arrow1Lstart-6"
       style="overflow:visible">
      <path
         inkscape:connector-curvature="0"
         id="path5259-7"
         d="M 0,0 5,-5 -12.5,0 5,5 0,0 Z"
         style="fill-rule:evenodd;stroke:#000000;stroke-width:1pt"
         transform="matrix(0.8,0,0,0.8,10,0)" />
    </marker>
    <marker
       inkscape:stockid="Arrow1Lend"
       orient="auto"
       refY="0"
       refX="0"
       id="Arrow1Lend-0"
       style="overflow:visible">
      <path
         inkscape:connector-curvature="0"
         id="path5262-9"
         d="M 0,0 5,-5 -12.5,0 5,5 0,0 Z"
         style="fill-rule:evenodd;stroke:#000000;stroke-width:1pt"
         transform="matrix(-0.8,0,0,-0.8,-10,0)" />
    </marker>
    <marker
       inkscape:stockid="Arrow1Lend"
       orient="auto"
       refY="0"
       refX="0"
       id="marker8264"
       style="overflow:visible">
      <path
         inkscape:connector-curvature="0"
         id="path8266"
         d="M 0,0 5,-5 -12.5,0 5,5 0,0 Z"
         style="fill-rule:evenodd;stroke:#000000;stroke-width:1pt"
         transform="matrix(-0.8,0,0,-0.8,-10,0)" />
    </marker>
    <marker
       inkscape:stockid="Arrow1Lstart"
       orient="auto"
       refY="0"
       refX="0"
       id="marker8268"
       style="overflow:visible">
      <path
         inkscape:connector-curvature="0"
         id="path8270"
         d="M 0,0 5,-5 -12.5,0 5,5 0,0 Z"
         style="fill-rule:evenodd;stroke:#000000;stroke-width:1pt"
         transform="matrix(0.8,0,0,0.8,10,0)" />
    </marker>
    <marker
       inkscape:stockid="Arrow1Lend"
       orient="auto"
       refY="0"
       refX="0"
       id="marker8272"
       style="overflow:visible">
      <path
         inkscape:connector-curvature="0"
         id="path8274"
         d="M 0,0 5,-5 -12.5,0 5,5 0,0 Z"
         style="fill-rule:evenodd;stroke:#000000;stroke-width:1pt"
         transform="matrix(-0.8,0,0,-0.8,-10,0)" />
    </marker>
    <marker
       inkscape:stockid="Arrow1Lstart"
       orient="auto"
       refY="0"
       refX="0"
       id="marker8276"
       style="overflow:visible">
      <path
         inkscape:connector-curvature="0"
         id="path8278"
         d="M 0,0 5,-5 -12.5,0 5,5 0,0 Z"
         style="fill-rule:evenodd;stroke:#000000;stroke-width:1pt"
         transform="matrix(0.8,0,0,0.8,10,0)" />
    </marker>
    <marker
       inkscape:stockid="Arrow1Lend"
       orient="auto"
       refY="0"
       refX="0"
       id="marker8280"
       style="overflow:visible">
      <path
         inkscape:connector-curvature="0"
         id="path8282"
         d="M 0,0 5,-5 -12.5,0 5,5 0,0 Z"
         style="fill-rule:evenodd;stroke:#000000;stroke-width:1pt"
         transform="matrix(-0.8,0,0,-0.8,-10,0)" />
    </marker>
    <marker
       inkscape:stockid="Arrow1Lend"
       orient="auto"
       refY="0"
       refX="0"
       id="marker8284"
       style="overflow:visible">
      <path
         inkscape:connector-curvature="0"
         id="path8286"
         d="M 0,0 5,-5 -12.5,0 5,5 0,0 Z"
         style="fill-rule:evenodd;stroke:#000000;stroke-width:1pt"
         transform="matrix(-0.8,0,0,-0.8,-10,0)" />
    </marker>
    <marker
       inkscape:isstock="true"
       style="overflow:visible"
       id="DotL"
       refX="0"
       refY="0"
       orient="auto"
       inkscape:stockid="DotL">
      <path
         inkscape:connector-curvature="0"
         transform="matrix(0.8,0,0,0.8,5.92,0.8)"
         style="fill:#000039;fill-opacity:1;fill-rule:evenodd;stroke:#000000;stroke-width:1pt;stroke-opacity:1"
         d="m -2.5,-1 c 0,2.76 -2.24,5 -5,5 -2.76,0 -5,-2.24 -5,-5 0,-2.76 2.24,-5 5,-5 2.76,0 5,2.24 5,5 z"
         id="path4207" />
    </marker>
  </defs>
  <sodipodi:namedview
     id="base"
     pagecolor="#576257"
     bordercolor="#666666"
     borderopacity="1.0"
     inkscape:pageopacity="0"
     inkscape:pageshadow="2"
     inkscape:zoom="1"
     inkscape:cx="336.81373"
     inkscape:cy="-44.45539"
     inkscape:document-units="px"
     inkscape:current-layer="layer1"
     showgrid="false"
     fit-margin-top="0"
     fit-margin-left="0"
     fit-margin-right="0"
     fit-margin-bottom="0"
     inkscape:window-width="1598"
     inkscape:window-height="867"
     inkscape:window-x="0"
     inkscape:window-y="0"
     inkscape:window-maximized="0" />
  <metadata
     id="metadata7695">
    <rdf:RDF>
      <cc:Work
         rdf:about="">
        <dc:format>image/svg+xml</dc:format>
        <dc:type
           rdf:resource="http://purl.org/dc/dcmitype/StillImage" />
        <dc:title></dc:title>
      </cc:Work>
    </rdf:RDF>
  </metadata>
  <g
     inkscape:label="Calque 1"
     inkscape:groupmode="layer"
     id="layer1"
     transform="translate(-16.518075,-118.25083)">
    <path
       sodipodi:nodetypes="cc"
       inkscape:connector-curvature="0"
       id="path6816"
       d="m 452.69123,147.25984 c -49.73635,-9.67099 -88.28138,21.20312 -104.71449,46.73841"
       style="fill:none;stroke:#ffffff;stroke-width:1;stroke-linecap:butt;stroke-linejoin:miter;stroke-miterlimit:4;stroke-dasharray:1, 1;stroke-dashoffset:0;stroke-opacity:1;marker-start:none;marker-end:url(#Arrow1Lend-0)" />
    <path
       style="fill:none;stroke:#ffffff;stroke-width:1px;stroke-linecap:butt;stroke-linejoin:miter;stroke-opacity:1"
       d="m 342.01697,200.42645 10.35407,-5.05077"
       id="path9070"
       inkscape:connector-curvature="0" />
    <path
       style="fill:none;stroke:#ffffff;stroke-width:1px;stroke-linecap:butt;stroke-linejoin:miter;stroke-opacity:1"
       d="m 340.24921,195.88076 12.37437,3.283"
       id="path9072"
       inkscape:connector-curvature="0" />
    <g
       id="g3671"
       transform="translate(-50.609836,-106.64239)"
       style="stroke:#ffffff;stroke-opacity:1">
      <path
         inkscape:connector-curvature="0"
         id="path9070-3"
         d="m 337.06842,287.37086 10.35407,-5.05077"
         style="fill:none;stroke:#ffffff;stroke-width:1px;stroke-linecap:butt;stroke-linejoin:miter;stroke-opacity:1" />
      <path
         inkscape:connector-curvature="0"
         id="path9072-2"
         d="m 335.30066,282.82517 12.37437,3.283"
         style="fill:none;stroke:#ffffff;stroke-width:1px;stroke-linecap:butt;stroke-linejoin:miter;stroke-opacity:1" />
    </g>
    <g
       transform="matrix(-0.41081946,0.80852975,-0.80852975,-0.41081946,678.30973,82.2163)"
       id="layer1-3-1-5"
       inkscape:label="Layer 1"
       style="stroke:#ffffff;stroke-opacity:1">
      <path
         inkscape:connector-curvature="0"
         id="rect6342-9-4"
         d="m 300.10441,416.70401 c -10.01382,1.91409 -16.58749,11.59535 -14.67371,21.60884 0.0759,0.39642 0.1964,0.7664 0.29604,1.1517 9.58546,0.89033 30.36732,-3.08367 36.16028,-6.75107 -0.0521,-0.44657 -0.088,-0.88714 -0.17382,-1.33575 -1.9141,-10.01382 -11.59439,-16.58716 -21.60884,-14.67371 z m 21.92703,18.14813 c -7.79388,5.21696 -24.86679,7.02086 -35.3687,7.35653 1.68333,3.87144 4.6106,6.9724 8.20228,8.89774 0.012,-3.7e-4 0.0248,0.0249 0.0369,0.0245 3.55208,-0.12116 7.84283,-0.62855 11.55643,-1.34252 3.73906,-0.71902 7.86777,-1.77431 11.21045,-3.05797 2.74954,-3.25945 4.36513,-7.44155 4.36273,-11.87824 z m -26.76483,18.24543 c 5.98567,22.08768 15.5163,59.51471 21.53941,81.50661 0.25769,1.34797 3.42145,1.88593 7.03149,1.19595 3.60994,-0.68992 6.30676,-2.32666 6.04914,-3.67473 -2.63205,-22.73239 -9.18496,-60.72347 -11.85934,-83.45895 -0.009,0.004 -0.0212,0.002 -0.0307,0.006 l -0.0183,0.0674 c -1.24604,0.42969 -2.55615,0.84444 -3.89582,1.23205 -0.0195,0.006 -0.0417,0.006 -0.0613,0.0124 -2.32422,0.66189 -4.75031,1.24004 -7.30253,1.72785 -2.51378,0.48047 -4.97003,0.82629 -7.34038,1.06603 -0.01,-0.002 -0.0212,0.008 -0.0307,0.006 -1.39363,0.13632 -2.74957,0.2508 -4.08117,0.31305 z m 24.18495,84.03345 0.6482,2.8978 c 0.28746,1.31093 1.58162,2.14315 2.89575,1.87067 l 4.31309,-0.90182 c 1.31419,-0.2722 2.13986,-1.51737 1.8524,-2.82831 l -0.62349,-2.77526 c -2.61079,1.61502 -5.99781,2.18658 -9.08595,1.73692 z"
         style="fill:#000000;stroke:#ffffff;stroke-opacity:1" />
    </g>
    <path
       style="fill:none;stroke:#ffffff;stroke-width:1;stroke-linecap:butt;stroke-linejoin:miter;stroke-miterlimit:4;stroke-dasharray:1, 1;stroke-dashoffset:0;stroke-opacity:1;marker-start:none;marker-end:url(#Arrow1Lend-0)"
       d="m 220.88598,155.64281 60.47862,18.12394"
       id="path6816-4-8-7"
       inkscape:connector-curvature="0"
       sodipodi:nodetypes="cc" />
    <path
       inkscape:connector-curvature="0"
       id="path4754"
       style="fill:none;stroke:#ffffff;stroke-width:2.47751904;stroke-linecap:round;stroke-linejoin:round;stroke-miterlimit:10;stroke-dasharray:none;stroke-opacity:1"
       d="m 199.25219,294.92407 94.14572,24.40357" />
    <path
       inkscape:connector-curvature="0"
       id="path4756"
       style="fill:none;stroke:#ffffff;stroke-width:2.47751904;stroke-linecap:round;stroke-linejoin:round;stroke-miterlimit:10;stroke-dasharray:none;stroke-opacity:1"
       d="M 300.83047,290.96004 257.59776,279.81121" />
    <path
       inkscape:connector-curvature="0"
       id="path4758"
       style="fill:none;stroke:#ffffff;stroke-width:2.47751904;stroke-linecap:round;stroke-linejoin:round;stroke-miterlimit:10;stroke-dasharray:none;stroke-opacity:1"
       d="m 468.18688,225.30579 94.2696,24.40356" />
    <path
       inkscape:connector-curvature="0"
       id="path4760"
       style="fill:none;stroke:#ffffff;stroke-width:2.47751904;stroke-linecap:round;stroke-linejoin:round;stroke-miterlimit:10;stroke-dasharray:none;stroke-opacity:1"
       d="M 569.76516,221.34176 526.65633,210.19292" />
    <path
       inkscape:connector-curvature="0"
       id="path4762"
       style="fill:#ffffff;stroke:#ffffff;stroke-width:2.478;stroke-linecap:round;stroke-linejoin:round;stroke-miterlimit:10;stroke-dasharray:none;stroke-opacity:1;fill-opacity:1"
       d="m 297.11419,319.32764 2.35365,-0.99101 2.10589,-1.61039 1.98201,-2.10589 1.61039,-2.72527 1.23876,-2.97302 0.74325,-3.22078 0.37163,-3.22077 -0.37163,-3.0969 -0.74325,-2.72527 -1.23876,-2.35365 -1.61039,-1.85814 -1.98201,-1.11488 -2.10589,-0.4955 -2.35365,0.24775 -2.35364,0.86713 -2.10589,1.61039 -1.98202,2.22977 -1.61038,2.72527 -1.23876,2.97302 -0.74326,3.0969 -0.37163,3.22077 0.37163,3.0969 0.74326,2.84915 1.23876,2.35364 1.61038,1.73426 1.98202,1.23876 2.10589,0.49551 2.35364,-0.24775" />
    <path
       inkscape:connector-curvature="0"
       id="path4764"
       style="fill:#ffffff;stroke:#ffffff;stroke-width:2.478;stroke-linecap:round;stroke-linejoin:round;stroke-miterlimit:10;stroke-dasharray:none;stroke-opacity:1;fill-opacity:1"
       d="m 566.04888,221.46563 -2.22976,0.86714 -2.22977,1.61038 -1.98201,2.22977 -1.61039,2.72527 -1.23876,2.97302 -0.74326,3.0969 -0.24775,3.22078 0.24775,3.0969 0.74326,2.84914 1.23876,2.35365 1.61039,1.73426 1.98201,1.23876 2.22977,0.4955 2.22976,-0.24775 2.35365,-0.99101 2.22976,-1.61038 1.85814,-2.22977 1.73427,-2.6014 1.23876,-2.97302 0.74325,-3.22077 0.24775,-3.22078 -0.24775,-3.0969 -0.74325,-2.72527 -1.23876,-2.35364 -1.73427,-1.85814 -1.85814,-1.11488 -2.22976,-0.49551 -2.35365,0.24775" />
    <path
       inkscape:connector-curvature="0"
       id="path4766"
       style="fill:none;stroke:#ffffff;stroke-width:2.47751904;stroke-linecap:round;stroke-linejoin:round;stroke-miterlimit:10;stroke-dasharray:none;stroke-opacity:1"
       d="m 183.27219,299.13586 0,-28.3676" />
    <path
       inkscape:connector-curvature="0"
       id="path4768"
       style="fill:none;stroke:#ffffff;stroke-width:2.47751904;stroke-linecap:round;stroke-linejoin:round;stroke-miterlimit:10;stroke-dasharray:none;stroke-opacity:1"
       d="M 183.27219,299.13586 17.773921,256.27478" />
    <path
       inkscape:connector-curvature="0"
       id="path4770"
       style="fill:none;stroke:#ffffff;stroke-width:2.47751904;stroke-linecap:round;stroke-linejoin:round;stroke-miterlimit:10;stroke-dasharray:none;stroke-opacity:1"
       d="m 17.773921,256.27478 0,-28.24372" />
    <path
       inkscape:connector-curvature="0"
       id="path4772"
       style="fill:none;stroke:#ffffff;stroke-width:2.47751904;stroke-linecap:round;stroke-linejoin:round;stroke-miterlimit:10;stroke-dasharray:none;stroke-opacity:1"
       d="M 183.27219,270.76826 17.773921,228.03106" />
    <path
       inkscape:connector-curvature="0"
       id="path4774"
       style="fill:none;stroke:#ffffff;stroke-width:2.47751904;stroke-linecap:round;stroke-linejoin:round;stroke-miterlimit:10;stroke-dasharray:none;stroke-opacity:1"
       d="M 17.773921,228.03106 431.64348,120.87836" />
    <path
       inkscape:connector-curvature="0"
       id="path4776"
       style="fill:none;stroke:#ffffff;stroke-width:2.47751904;stroke-linecap:round;stroke-linejoin:round;stroke-miterlimit:10;stroke-dasharray:none;stroke-opacity:1"
       d="m 431.64348,120.87836 165.49827,42.86108" />
    <path
       inkscape:connector-curvature="0"
       id="path4778"
       style="fill:none;stroke:#ffffff;stroke-width:2.47751904;stroke-linecap:round;stroke-linejoin:round;stroke-miterlimit:10;stroke-dasharray:none;stroke-opacity:1"
       d="M 597.14175,163.73944 183.27219,270.76826" />
    <path
       inkscape:connector-curvature="0"
       id="path4780"
       style="fill:none;stroke:#ffffff;stroke-width:2.47751904;stroke-linecap:round;stroke-linejoin:round;stroke-miterlimit:10;stroke-dasharray:none;stroke-opacity:1"
       d="m 597.14175,191.98316 0,-28.24372" />
    <path
       inkscape:connector-curvature="0"
       id="path4782"
       style="fill:none;stroke:#ffffff;stroke-width:2.47751904;stroke-linecap:round;stroke-linejoin:round;stroke-miterlimit:10;stroke-dasharray:none;stroke-opacity:1"
       d="M 597.14175,191.98316 183.27219,299.13586" />
    <ellipse
       id="path3021"
       style="fill:#000000;fill-opacity:1;stroke:#ffffff;stroke-width:1.29702973;stroke-linecap:round;stroke-linejoin:miter;stroke-miterlimit:4;stroke-dasharray:none;stroke-dashoffset:0;stroke-opacity:1"
       cx="477.75098"
       cy="156.8322"
       rx="16.580633"
       ry="16.261774" />
    <path
       sodipodi:nodetypes="cccc"
       inkscape:connector-curvature="0"
       id="path3791"
       d="m 494.38846,154.76436 127.37917,39.70259 c 1.00805,4.78705 -0.17575,8.69736 -3.92891,11.57992 L 491.0799,166.55107"
       style="fill:#000000;fill-opacity:1;stroke:#ffffff;stroke-width:1;stroke-linecap:butt;stroke-linejoin:miter;stroke-miterlimit:4;stroke-dasharray:none;stroke-opacity:1" />
    <path
       sodipodi:nodetypes="cc"
       inkscape:connector-curvature="0"
       id="path7645"
       d="m 490.54056,169.34021 c 2.82194,-2.88421 5.44472,-12.56534 4.96301,-16.39345"
       style="fill:#f8f3ff;stroke:#ffffff;stroke-width:2;stroke-linecap:butt;stroke-linejoin:miter;stroke-miterlimit:4;stroke-dasharray:none;stroke-opacity:1;fill-opacity:1" />
    <path
       d="m 399.51947,148.3771 c -3.5182,13.26726 -7.30143,25.41424 -11.44537,38.73553 -1.10521,3.39631 -4.39755,4.69862 -7.27714,5.23629 -2.61749,0.65475 -5.47023,0.49076 -7.79978,-1.13904 -2.26788,-1.17281 -4.12018,-4.0508 -3.31453,-6.95195 0.8346,-3.40192 3.88244,-5.70075 6.88958,-6.01947 3.06082,-0.67977 6.41404,0.20233 8.82463,2.45555 1.20727,1.00222 2.00543,-0.27822 2.5804,-1.58362 3.23989,-10.33771 6.44863,-20.68735 9.56488,-31.0742 0.33409,-1.02953 2.26256,-0.66558 1.97715,0.34091 z"
       style="opacity:1;fill:#000000;fill-opacity:1;fill-rule:evenodd;stroke:#ffffff;stroke-width:0.46994454;stroke-linecap:round;stroke-linejoin:round;stroke-opacity:1"
       id="path3"
       inkscape:connector-curvature="0" />
  </g>
</svg>
