<?xml version="1.0" encoding="UTF-8" standalone="no"?>
<!-- Created with Inkscape (http://www.inkscape.org/) -->

<svg
   xmlns:dc="http://purl.org/dc/elements/1.1/"
   xmlns:cc="http://creativecommons.org/ns#"
   xmlns:rdf="http://www.w3.org/1999/02/22-rdf-syntax-ns#"
   xmlns:svg="http://www.w3.org/2000/svg"
   xmlns="http://www.w3.org/2000/svg"
   xmlns:xlink="http://www.w3.org/1999/xlink"
   xmlns:sodipodi="http://sodipodi.sourceforge.net/DTD/sodipodi-0.dtd"
   xmlns:inkscape="http://www.inkscape.org/namespaces/inkscape"
   width="160mm"
   height="110mm"
   viewBox="0 0 566.92914 389.76378"
   id="svg10836"
   version="1.1"
   inkscape:version="0.91 r13725"
   sodipodi:docname="torsion.svg">
  <defs
     id="defs10838">
    <pattern
       inkscape:collect="always"
       xlink:href="#Strips1_1-6"
       id="pattern8265"
       patternTransform="matrix(10,0,0,10,31.16041,444.89356)" />
    <pattern
       inkscape:stockid="Stripes 1:1"
       id="Strips1_1-6"
       patternTransform="translate(0,0) scale(10,10)"
       height="1"
       width="2"
       patternUnits="userSpaceOnUse"
       inkscape:collect="always">
      <rect
         id="rect4534-2"
         height="2"
         width="1"
         y="-0.5"
         x="0"
         style="fill:black;stroke:none" />
    </pattern>
    <pattern
       inkscape:collect="always"
       xlink:href="#Strips1_1-6"
       id="pattern8259"
       patternTransform="matrix(10,0,0,10,31.16041,444.89356)" />
    <marker
       inkscape:stockid="Arrow1Lstart"
       orient="auto"
       refY="0"
       refX="0"
       id="Arrow1Lstart-6"
       style="overflow:visible">
      <path
         inkscape:connector-curvature="0"
         id="path5259-7"
         d="M 0,0 5,-5 -12.5,0 5,5 0,0 Z"
         style="fill-rule:evenodd;stroke:#000000;stroke-width:1pt"
         transform="matrix(0.8,0,0,0.8,10,0)" />
    </marker>
    <marker
       inkscape:stockid="Arrow1Lend"
       orient="auto"
       refY="0"
       refX="0"
       id="Arrow1Lend-0"
       style="overflow:visible">
      <path
         inkscape:connector-curvature="0"
         id="path5262-9"
         d="M 0,0 5,-5 -12.5,0 5,5 0,0 Z"
         style="fill-rule:evenodd;stroke:#000000;stroke-width:1pt"
         transform="matrix(-0.8,0,0,-0.8,-10,0)" />
    </marker>
    <marker
       inkscape:stockid="Arrow1Lstart"
       orient="auto"
       refY="0"
       refX="0"
       id="marker10737"
       style="overflow:visible">
      <path
         inkscape:connector-curvature="0"
         id="path10739"
         d="M 0,0 5,-5 -12.5,0 5,5 0,0 Z"
         style="fill-rule:evenodd;stroke:#000000;stroke-width:1pt"
         transform="matrix(0.8,0,0,0.8,10,0)" />
    </marker>
    <marker
       inkscape:stockid="Arrow1Lend"
       orient="auto"
       refY="0"
       refX="0"
       id="marker10741"
       style="overflow:visible">
      <path
         inkscape:connector-curvature="0"
         id="path10743"
         d="M 0,0 5,-5 -12.5,0 5,5 0,0 Z"
         style="fill-rule:evenodd;stroke:#000000;stroke-width:1pt"
         transform="matrix(-0.8,0,0,-0.8,-10,0)" />
    </marker>
    <marker
       inkscape:stockid="Arrow1Lend"
       orient="auto"
       refY="0"
       refX="0"
       id="marker10745"
       style="overflow:visible">
      <path
         inkscape:connector-curvature="0"
         id="path10747"
         d="M 0,0 5,-5 -12.5,0 5,5 0,0 Z"
         style="fill-rule:evenodd;stroke:#000000;stroke-width:1pt"
         transform="matrix(-0.8,0,0,-0.8,-10,0)" />
    </marker>
    <pattern
       patternTransform="matrix(-10,0,0,-10,490.93192,1374.0875)"
       id="pattern8339"
       xlink:href="#pattern8265-7"
       inkscape:collect="always" />
    <pattern
       inkscape:collect="always"
       xlink:href="#Strips1_1-3"
       id="pattern8265-7"
       patternTransform="scale(10,10)" />
    <pattern
       inkscape:stockid="Stripes 1:1"
       id="Strips1_1-3"
       patternTransform="translate(0,0) scale(10,10)"
       height="1"
       width="2"
       patternUnits="userSpaceOnUse"
       inkscape:collect="always">
      <rect
         id="rect4534-3"
         height="2"
         width="1"
         y="-0.5"
         x="0"
         style="fill:black;stroke:none" />
    </pattern>
    <pattern
       patternTransform="matrix(10,0,0,10,-131.00863,390.98062)"
       id="pattern8371"
       xlink:href="#pattern8339-9"
       inkscape:collect="always" />
    <pattern
       patternTransform="matrix(-10,0,0,-10,459.77152,929.1939)"
       id="pattern8339-9"
       xlink:href="#pattern8265-7-5"
       inkscape:collect="always" />
    <pattern
       inkscape:collect="always"
       xlink:href="#Strips1_1-3-5"
       id="pattern8265-7-5"
       patternTransform="scale(10,10)" />
    <pattern
       inkscape:stockid="Stripes 1:1"
       id="Strips1_1-3-5"
       patternTransform="translate(0,0) scale(10,10)"
       height="1"
       width="2"
       patternUnits="userSpaceOnUse"
       inkscape:collect="always">
      <rect
         id="rect4534-3-3"
         height="2"
         width="1"
         y="-0.5"
         x="0"
         style="fill:black;stroke:none" />
    </pattern>
    <marker
       inkscape:stockid="Arrow1Lstart"
       orient="auto"
       refY="0"
       refX="0"
       id="marker10758"
       style="overflow:visible">
      <path
         inkscape:connector-curvature="0"
         id="path10760"
         d="M 0,0 5,-5 -12.5,0 5,5 0,0 Z"
         style="fill-rule:evenodd;stroke:#000000;stroke-width:1pt"
         transform="matrix(0.8,0,0,0.8,10,0)" />
    </marker>
    <marker
       inkscape:stockid="Arrow1Lend"
       orient="auto"
       refY="0"
       refX="0"
       id="marker10762"
       style="overflow:visible">
      <path
         inkscape:connector-curvature="0"
         id="path10764"
         d="M 0,0 5,-5 -12.5,0 5,5 0,0 Z"
         style="fill-rule:evenodd;stroke:#000000;stroke-width:1pt"
         transform="matrix(-0.8,0,0,-0.8,-10,0)" />
    </marker>
    <marker
       inkscape:stockid="Arrow1Lstart"
       orient="auto"
       refY="0"
       refX="0"
       id="marker10766"
       style="overflow:visible">
      <path
         inkscape:connector-curvature="0"
         id="path10768"
         d="M 0,0 5,-5 -12.5,0 5,5 0,0 Z"
         style="fill-rule:evenodd;stroke:#000000;stroke-width:1pt"
         transform="matrix(0.8,0,0,0.8,10,0)" />
    </marker>
    <marker
       inkscape:stockid="Arrow1Lend"
       orient="auto"
       refY="0"
       refX="0"
       id="marker10770"
       style="overflow:visible">
      <path
         inkscape:connector-curvature="0"
         id="path10772"
         d="M 0,0 5,-5 -12.5,0 5,5 0,0 Z"
         style="fill-rule:evenodd;stroke:#000000;stroke-width:1pt"
         transform="matrix(-0.8,0,0,-0.8,-10,0)" />
    </marker>
    <marker
       inkscape:stockid="Arrow1Lend"
       orient="auto"
       refY="0"
       refX="0"
       id="marker10774"
       style="overflow:visible">
      <path
         inkscape:connector-curvature="0"
         id="path10776"
         d="M 0,0 5,-5 -12.5,0 5,5 0,0 Z"
         style="fill-rule:evenodd;stroke:#000000;stroke-width:1pt"
         transform="matrix(-0.8,0,0,-0.8,-10,0)" />
    </marker>
  </defs>
  <sodipodi:namedview
     id="base"
     pagecolor="#ffffff"
     bordercolor="#666666"
     borderopacity="1.0"
     inkscape:pageopacity="0.0"
     inkscape:pageshadow="2"
     inkscape:zoom="0.7"
     inkscape:cx="-51.991156"
     inkscape:cy="209.83193"
     inkscape:document-units="px"
     inkscape:current-layer="g3718"
     showgrid="false"
     fit-margin-top="0"
     fit-margin-left="0"
     fit-margin-right="0"
     fit-margin-bottom="0"
     inkscape:window-width="1918"
     inkscape:window-height="951"
     inkscape:window-x="1600"
     inkscape:window-y="32"
     inkscape:window-maximized="0" />
  <metadata
     id="metadata10841">
    <rdf:RDF>
      <cc:Work
         rdf:about="">
        <dc:format>image/svg+xml</dc:format>
        <dc:type
           rdf:resource="http://purl.org/dc/dcmitype/StillImage" />
        <dc:title />
      </cc:Work>
    </rdf:RDF>
  </metadata>
  <g
     inkscape:label="Calque 1"
     inkscape:groupmode="layer"
     id="layer1"
     transform="translate(472.17153,-205.36532)">
    <g
       id="g11634">
      <g
         transform="translate(-582.58566,-452.80927)"
         id="g3718">
        <path
           style="fill:none;stroke:#000000;stroke-width:4;stroke-linecap:butt;stroke-linejoin:miter;stroke-miterlimit:4;stroke-dasharray:none;stroke-opacity:1;marker-start:"
           d="m 112.47769,825.5043 147.48226,53.03301 404.5661,-101.52033 -146.9772,-54.04316 z"
           id="path2997-9"
           inkscape:connector-curvature="0" />
        <path
           style="fill:none;stroke:#000000;stroke-width:4;stroke-linecap:butt;stroke-linejoin:miter;stroke-miterlimit:4;stroke-dasharray:none;stroke-opacity:1;marker-start:"
           d="m 111.72008,825.5043 0,65.40738 149.50256,50.00255 404.09349,-99.83452 -0.0818,-64.31635"
           id="path2999-1"
           inkscape:connector-curvature="0"
           sodipodi:nodetypes="ccccc" />
        <path
           style="fill:none;stroke:#000000;stroke-width:4;stroke-linecap:butt;stroke-linejoin:miter;stroke-miterlimit:4;stroke-dasharray:none;stroke-opacity:1;marker-start:"
           d="m 261.1604,877.25574 -0.71429,64.28572"
           id="path3001-2"
           inkscape:connector-curvature="0" />
        <path
           style="fill:none;stroke:#000000;stroke-width:1px;stroke-linecap:butt;stroke-linejoin:miter;stroke-opacity:1;marker-start:"
           d="m 421.02718,900.75719 42.26695,12.39167 24.66162,-5.99882 -17.10714,-17.82143 -7.32143,23.75"
           id="path3003-7"
           inkscape:connector-curvature="0"
           sodipodi:nodetypes="ccccc" />
        <path
           style="fill:url(#pattern8265);fill-opacity:1;stroke:#000000;stroke-width:0.2;stroke-linecap:butt;stroke-linejoin:miter;stroke-miterlimit:4;stroke-dasharray:none;stroke-opacity:1;marker-start:"
           d="m 261.17834,890.17788 210.262,-34.25481 -210.63708,73.68846 z"
           id="path3015-0"
           inkscape:connector-curvature="0"
           sodipodi:nodetypes="cccc" />
        <path
           style="fill:url(#pattern8259);fill-opacity:1;stroke:#000000;stroke-width:0.2;stroke-linecap:butt;stroke-linejoin:miter;stroke-miterlimit:4;stroke-dasharray:none;stroke-opacity:1;marker-start:"
           d="m 469.56393,856.734 195.70361,-67.69255 -0.0893,38.21429 z"
           id="path3019-9"
           inkscape:connector-curvature="0"
           sodipodi:nodetypes="cccc" />
        <path
           style="fill:none;stroke:#000000;stroke-width:1;stroke-linecap:butt;stroke-linejoin:miter;stroke-miterlimit:4;stroke-dasharray:6, 1;stroke-dashoffset:0;stroke-opacity:1;marker-start:"
           d="m 324.29403,770.51412 146.47212,52.96987 0.63135,63.07141"
           id="path3009-7-8"
           inkscape:connector-curvature="0"
           sodipodi:nodetypes="ccc" />
        <path
           style="fill:none;stroke:#000000;stroke-width:1px;stroke-linecap:butt;stroke-linejoin:miter;stroke-opacity:1;marker-start:"
           d="m 261.22264,964.65281 0.20922,83.28429"
           id="path6397-2"
           inkscape:connector-curvature="0"
           sodipodi:nodetypes="cc" />
        <path
           style="fill:none;stroke:#000000;stroke-width:1px;stroke-linecap:butt;stroke-linejoin:miter;stroke-opacity:1;marker-start:"
           d="m 476.75496,921.88938 0,24.74874"
           id="path6399-37"
           inkscape:connector-curvature="0" />
        <path
           style="fill:none;stroke:#000000;stroke-width:1px;stroke-linecap:butt;stroke-linejoin:miter;stroke-opacity:1;marker-end:url(#Arrow1Lend-0);marker-start:url(#Arrow1Lstart-6)"
           d="M 266.09912,983.97493 472.2518,934.39515"
           id="path6401-5"
           inkscape:connector-curvature="0"
           sodipodi:nodetypes="cc" />
        <text
           xml:space="preserve"
           style="font-style:normal;font-variant:normal;font-weight:normal;font-stretch:normal;font-size:16px;line-height:125%;font-family:'Liberation Mono';-inkscape-font-specification:'Liberation Mono';text-align:center;letter-spacing:0px;word-spacing:0px;text-anchor:middle;fill:#000000;fill-opacity:1;stroke:none;stroke-opacity:1;"
           x="102.54459"
           y="1045.9362"
           id="text6255-3-6-6-9"
           sodipodi:linespacing="125%"
           transform="matrix(0.96505228,-0.26205743,0.26205743,0.96505228,0,0)"><tspan
             sodipodi:role="line"
             id="tspan6257-5-0-2-2"
             x="102.54459"
             y="1045.9362">0.5<tspan
   style="font-size:12px;fill:#000000;fill-opacity:1;stroke:none;stroke-opacity:1;"
   id="tspan8573">x</tspan>L</tspan></text>
        <path
           style="fill:none;stroke:#000000;stroke-width:1px;stroke-linecap:butt;stroke-linejoin:miter;stroke-opacity:1;marker-start:"
           d="m 666.87469,878.09566 0.71429,74.03445"
           id="path6399-3-2"
           inkscape:connector-curvature="0"
           sodipodi:nodetypes="cc" />
        <path
           style="fill:none;stroke:#000000;stroke-width:1px;stroke-linecap:butt;stroke-linejoin:miter;stroke-opacity:1;marker-end:url(#Arrow1Lend-0);marker-start:url(#Arrow1Lstart-6)"
           d="M 264.35674,1027.6636 665.82121,936.08279"
           id="path6401-9-89"
           inkscape:connector-curvature="0"
           sodipodi:nodetypes="cc" />
        <text
           xml:space="preserve"
           style="font-style:normal;font-variant:normal;font-weight:normal;font-stretch:normal;font-size:16px;line-height:125%;font-family:'Liberation Mono';-inkscape-font-specification:'Liberation Mono';text-align:center;letter-spacing:0px;word-spacing:0px;text-anchor:middle;fill:#000000;fill-opacity:1;stroke:none;stroke-opacity:1;"
           x="203.43715"
           y="1092.3193"
           id="text6255-3-6-6-73-73"
           sodipodi:linespacing="125%"
           transform="matrix(0.96505228,-0.26205743,0.26205743,0.96505228,0,0)"><tspan
             sodipodi:role="line"
             id="tspan6257-5-0-2-6-6"
             x="203.43715"
             y="1092.3193">L</tspan></text>
        <g
           transform="matrix(-0.41081946,0.80852975,-0.80852975,-0.41081946,902.6111,637.36725)"
           id="layer1-3-1"
           inkscape:label="Layer 1"
           style="stroke:none;stroke-opacity:1">
          <path
             inkscape:connector-curvature="0"
             id="rect6342-9"
             d="m 300.10441,416.70401 c -10.01382,1.91409 -16.58749,11.59535 -14.67371,21.60884 0.0759,0.39642 0.1964,0.7664 0.29604,1.1517 9.58546,0.89033 30.36732,-3.08367 36.16028,-6.75107 -0.0521,-0.44657 -0.088,-0.88714 -0.17382,-1.33575 -1.9141,-10.01382 -11.59439,-16.58716 -21.60884,-14.67371 z m 21.92703,18.14813 c -7.79388,5.21696 -24.86679,7.02086 -35.3687,7.35653 1.68333,3.87144 4.6106,6.9724 8.20228,8.89774 0.012,-3.7e-4 0.0248,0.0249 0.0369,0.0245 3.55208,-0.12116 7.84283,-0.62855 11.55643,-1.34252 3.73906,-0.71902 7.86777,-1.77431 11.21045,-3.05797 2.74954,-3.25945 4.36513,-7.44155 4.36273,-11.87824 z m -26.76483,18.24543 c 5.98567,22.08768 15.5163,59.51471 21.53941,81.50661 0.25769,1.34797 3.42145,1.88593 7.03149,1.19595 3.60994,-0.68992 6.30676,-2.32666 6.04914,-3.67473 -2.63205,-22.73239 -9.18496,-60.72347 -11.85934,-83.45895 -0.009,0.004 -0.0212,0.002 -0.0307,0.006 l -0.0183,0.0674 c -1.24604,0.42969 -2.55615,0.84444 -3.89582,1.23205 -0.0195,0.006 -0.0417,0.006 -0.0613,0.0124 -2.32422,0.66189 -4.75031,1.24004 -7.30253,1.72785 -2.51378,0.48047 -4.97003,0.82629 -7.34038,1.06603 -0.01,-0.002 -0.0212,0.008 -0.0307,0.006 -1.39363,0.13632 -2.74957,0.2508 -4.08117,0.31305 z m 24.18495,84.03345 0.6482,2.8978 c 0.28746,1.31093 1.58162,2.14315 2.89575,1.87067 l 4.31309,-0.90182 c 1.31419,-0.2722 2.13986,-1.51737 1.8524,-2.82831 l -0.62349,-2.77526 c -2.61079,1.61502 -5.99781,2.18658 -9.08595,1.73692 z"
             style="fill:#000000;stroke:none;stroke-opacity:1" />
        </g>
        <path
           style="fill:none;stroke:#000000;stroke-width:1;stroke-linecap:butt;stroke-linejoin:miter;stroke-miterlimit:4;stroke-dasharray:1, 1;stroke-dashoffset:0;stroke-opacity:1;marker-start:;marker-end:url(#Arrow1Lend-0)"
           d="m 445.18735,710.79376 60.47862,18.12394"
           id="path6816-4-8"
           inkscape:connector-curvature="0"
           sodipodi:nodetypes="cc" />
        <g
           id="g6812-5"
           transform="matrix(1.0306137,-0.52799783,0.52799783,1.0306137,-591.09763,942.26972)"
           style="fill:#000000;fill-opacity:1;stroke:none;stroke-opacity:1">
          <ellipse
             ry="18.214285"
             rx="18.571428"
             cy="220.57646"
             cx="594.28571"
             transform="matrix(0.77099236,0,0,0.77099236,256.72847,59.799411)"
             id="path3021-0"
             style="fill:#000000;fill-opacity:1;stroke:none;stroke-width:1.29702973;stroke-linecap:round;stroke-linejoin:miter;stroke-miterlimit:4;stroke-dasharray:none;stroke-dashoffset:0;stroke-opacity:1" />
          <path
             sodipodi:nodetypes="cccc"
             inkscape:connector-curvature="0"
             id="path3791-3"
             d="m 729.28572,228.07647 110,34.28571 c 0.87052,4.13392 -0.15177,7.51072 -3.39286,10 L 726.42857,238.25504"
             style="fill:#000000;fill-opacity:1;stroke:none;stroke-width:1;stroke-linecap:butt;stroke-linejoin:miter;stroke-miterlimit:4;stroke-dasharray:none;stroke-opacity:1" />
        </g>
        <path
           style="fill:none;stroke:#ffffff;stroke-width:2;stroke-linecap:butt;stroke-linejoin:miter;stroke-miterlimit:4;stroke-dasharray:none;stroke-opacity:1"
           d="m 284.1595,806.99419 c 1.19645,-3.85364 -0.88348,-13.66573 -3.05767,-16.85311"
           id="path7645-6"
           inkscape:connector-curvature="0"
           sodipodi:nodetypes="cc" />
        <path
           style="fill:none;stroke:#000000;stroke-width:1;stroke-linecap:butt;stroke-linejoin:miter;stroke-miterlimit:4;stroke-dasharray:6, 1;stroke-dashoffset:0;stroke-opacity:1;marker-start:"
           d="m 581.81295,745.96461 -401.28308,103.4775 -0.63135,63.07141"
           id="path3009-7-5"
           inkscape:connector-curvature="0"
           sodipodi:nodetypes="ccc" />
        <path
           style="fill:url(#pattern8339);fill-opacity:1;stroke:#000000;stroke-width:0.2;stroke-linecap:butt;stroke-linejoin:miter;stroke-miterlimit:4;stroke-dasharray:none;stroke-opacity:1;marker-start:"
           d="m 260.91398,928.80313 -80.96246,-46.55739 81.33754,7.12374 z"
           id="path3015-8"
           inkscape:connector-curvature="0"
           sodipodi:nodetypes="cccc" />
        <path
           style="fill:url(#pattern8371);fill-opacity:1;stroke:#000000;stroke-width:0.2;stroke-linecap:butt;stroke-linejoin:miter;stroke-miterlimit:4;stroke-dasharray:none;stroke-opacity:1;marker-start:"
           d="m 111.63622,837.52763 68.33557,45.2947 -68.71065,-1.31536 z"
           id="path3015-8-8"
           inkscape:connector-curvature="0"
           sodipodi:nodetypes="cccc" />
        <g
           transform="translate(31.16041,444.89356)"
           id="g8412"
           style="stroke:#000000;stroke-opacity:1">
          <path
             sodipodi:nodetypes="cccc"
             transform="translate(-3.9843292,160.25822)"
             inkscape:connector-curvature="0"
             id="path8408"
             d="m 135.38017,323.98909 16.76269,-14.77521 10.08666,26.99184 z"
             style="fill:none;stroke:#000000;stroke-width:1px;stroke-linecap:butt;stroke-linejoin:miter;stroke-opacity:1" />
          <path
             sodipodi:nodetypes="cc"
             transform="translate(-3.9843292,160.25822)"
             inkscape:connector-curvature="0"
             id="path8410"
             d="m 161.87237,336.24905 36.42242,-12.15029"
             style="fill:none;stroke:#000000;stroke-width:1px;stroke-linecap:butt;stroke-linejoin:miter;stroke-opacity:1" />
        </g>
        <path
           style="fill:none;stroke:#000000;stroke-width:1px;stroke-linecap:butt;stroke-linejoin:miter;stroke-opacity:1;marker-start:"
           d="m 110.91413,909.32031 0.20922,83.28427"
           id="path6397-0"
           inkscape:connector-curvature="0"
           sodipodi:nodetypes="cc" />
        <path
           style="fill:none;stroke:#000000;stroke-width:1px;stroke-linecap:butt;stroke-linejoin:miter;stroke-opacity:1;marker-end:url(#Arrow1Lend-0);marker-start:url(#Arrow1Lstart-6)"
           d="m 118.61253,984.98818 133.30485,43.06532"
           id="path6401-9-8"
           inkscape:connector-curvature="0"
           sodipodi:nodetypes="cc" />
        <text
           xml:space="preserve"
           style="font-style:normal;font-variant:normal;font-weight:normal;font-stretch:normal;font-size:16px;line-height:125%;font-family:'Liberation Mono';-inkscape-font-specification:'Liberation Mono';text-align:center;letter-spacing:0px;word-spacing:0px;text-anchor:middle;fill:#000000;fill-opacity:1;stroke:none;stroke-opacity:1;"
           x="195.8656"
           y="1017.17"
           id="text6255-3-6-6-73-7"
           sodipodi:linespacing="125%"
           transform="matrix(0.99973947,0.02282547,-0.02282547,0.99973947,0,0)"><tspan
             sodipodi:role="line"
             id="tspan6257-5-0-2-6-0"
             x="195.8656"
             y="1017.17">l</tspan></text>
        <path
           style="fill:none;stroke:#000000;stroke-width:1px;stroke-linecap:butt;stroke-linejoin:miter;stroke-opacity:1;marker-start:"
           d="m 178.85719,942.36638 -0.14792,33.64141"
           id="path6397-0-5"
           inkscape:connector-curvature="0"
           sodipodi:nodetypes="cc" />
        <path
           style="fill:none;stroke:#000000;stroke-width:1px;stroke-linecap:butt;stroke-linejoin:miter;stroke-opacity:1;marker-end:url(#Arrow1Lend-0);marker-start:url(#Arrow1Lstart-6)"
           d="m 181.23794,958.19015 75.44771,24.85101"
           id="path6401-9-8-0"
           inkscape:connector-curvature="0"
           sodipodi:nodetypes="cc" />
        <text
           xml:space="preserve"
           style="font-style:normal;font-variant:normal;font-weight:normal;font-stretch:normal;font-size:16px;line-height:125%;font-family:'Liberation Mono';-inkscape-font-specification:'Liberation Mono';text-align:center;letter-spacing:0px;word-spacing:0px;text-anchor:middle;fill:#000000;fill-opacity:1;stroke:none;stroke-opacity:1;"
           x="236.19279"
           y="988.41296"
           id="text6255-3-6-6-73-7-4"
           sodipodi:linespacing="125%"
           transform="matrix(0.99973947,0.02282547,-0.02282547,0.99973947,0,0)"><tspan
             sodipodi:role="line"
             id="tspan6257-5-0-2-6-0-5"
             x="236.19279"
             y="988.41296">0.5<tspan
   style="font-size:12px;fill:#000000;fill-opacity:1;stroke:none;stroke-opacity:1;"
   id="tspan8575">x</tspan>l</tspan></text>
        <path
           style="fill:none;stroke:#000000;stroke-width:1;stroke-linecap:butt;stroke-linejoin:miter;stroke-miterlimit:4;stroke-dasharray:1, 1;stroke-dashoffset:0;stroke-opacity:1;marker-start:;marker-end:url(#Arrow1Lend-0)"
           d="m 256.23585,818.80111 c -10.34686,9.08695 -10.55908,24.95141 3.3556,48.83274"
           id="path6816-4-9"
           inkscape:connector-curvature="0"
           sodipodi:nodetypes="cc" />
        <path
           style="fill:none;stroke:#000000;stroke-width:1px;stroke-linecap:butt;stroke-linejoin:miter;stroke-opacity:1;marker-start:"
           d="m 255.72308,871.91801 10.35407,-5.05077"
           id="path9070-1"
           inkscape:connector-curvature="0" />
        <path
           style="fill:none;stroke:#000000;stroke-width:1px;stroke-linecap:butt;stroke-linejoin:miter;stroke-opacity:1;marker-start:"
           d="m 253.95532,867.37232 12.37437,3.283"
           id="path9072-0"
           inkscape:connector-curvature="0" />
        <g
           id="g3684"
           style="stroke:#000000;stroke-opacity:1">
          <path
             inkscape:connector-curvature="0"
             id="path9070-0"
             d="m 512.58242,733.35321 10.35407,-5.05077"
             style="fill:none;stroke:#000000;stroke-width:1px;stroke-linecap:butt;stroke-linejoin:miter;stroke-opacity:1" />
          <path
             inkscape:connector-curvature="0"
             id="path9072-6"
             d="m 510.81466,728.80752 12.37437,3.283"
             style="fill:none;stroke:#000000;stroke-width:1px;stroke-linecap:butt;stroke-linejoin:miter;stroke-opacity:1" />
        </g>
      </g>
    </g>
  </g>
</svg>
