<?xml version="1.0" encoding="UTF-8" standalone="no"?>
<!-- Created with Inkscape (http://www.inkscape.org/) -->

<svg
   xmlns:dc="http://purl.org/dc/elements/1.1/"
   xmlns:cc="http://creativecommons.org/ns#"
   xmlns:rdf="http://www.w3.org/1999/02/22-rdf-syntax-ns#"
   xmlns:svg="http://www.w3.org/2000/svg"
   xmlns="http://www.w3.org/2000/svg"
   xmlns:xlink="http://www.w3.org/1999/xlink"
   xmlns:sodipodi="http://sodipodi.sourceforge.net/DTD/sodipodi-0.dtd"
   xmlns:inkscape="http://www.inkscape.org/namespaces/inkscape"
   width="1920"
   height="1080"
   id="svg4915"
   version="1.1"
   inkscape:version="0.91 r13725"
   sodipodi:docname="logo-rfda-big1.svg"
   inkscape:export-filename="/home/dada/work/dev/pyrfda/gui/data/logo-splash.png"
   inkscape:export-xdpi="270"
   inkscape:export-ydpi="270">
  <defs
     id="defs4917">
    <linearGradient
       id="linearGradient5722">
      <stop
         style="stop-color:#f0ff80;stop-opacity:1;"
         offset="0"
         id="stop5724" />
      <stop
         style="stop-color:#ecd32e;stop-opacity:1;"
         offset="1"
         id="stop5726" />
    </linearGradient>
    <marker
       inkscape:stockid="Arrow1Lstart"
       orient="auto"
       refY="0"
       refX="0"
       id="Arrow1Lstart-6"
       style="overflow:visible">
      <path
         inkscape:connector-curvature="0"
         id="path5259-7"
         d="M 0,0 5,-5 -12.5,0 5,5 0,0 Z"
         style="fill-rule:evenodd;stroke:#000000;stroke-width:1pt"
         transform="matrix(0.8,0,0,0.8,10,0)" />
    </marker>
    <marker
       inkscape:stockid="Arrow1Lend"
       orient="auto"
       refY="0"
       refX="0"
       id="Arrow1Lend-0"
       style="overflow:visible">
      <path
         inkscape:connector-curvature="0"
         id="path5262-9"
         d="M 0,0 5,-5 -12.5,0 5,5 0,0 Z"
         style="fill-rule:evenodd;stroke:#000000;stroke-width:1pt"
         transform="matrix(-0.8,0,0,-0.8,-10,0)" />
    </marker>
    <marker
       inkscape:stockid="Arrow1Lstart"
       orient="auto"
       refY="0"
       refX="0"
       id="marker4827"
       style="overflow:visible">
      <path
         inkscape:connector-curvature="0"
         id="path4829"
         d="M 0,0 5,-5 -12.5,0 5,5 0,0 Z"
         style="fill-rule:evenodd;stroke:#000000;stroke-width:1pt"
         transform="matrix(0.8,0,0,0.8,10,0)" />
    </marker>
    <marker
       inkscape:stockid="Arrow1Lend"
       orient="auto"
       refY="0"
       refX="0"
       id="marker4831"
       style="overflow:visible">
      <path
         inkscape:connector-curvature="0"
         id="path4833"
         d="M 0,0 5,-5 -12.5,0 5,5 0,0 Z"
         style="fill-rule:evenodd;stroke:#000000;stroke-width:1pt"
         transform="matrix(-0.8,0,0,-0.8,-10,0)" />
    </marker>
    <marker
       inkscape:stockid="Arrow1Lend"
       orient="auto"
       refY="0"
       refX="0"
       id="marker4835"
       style="overflow:visible">
      <path
         inkscape:connector-curvature="0"
         id="path4837"
         d="M 0,0 5,-5 -12.5,0 5,5 0,0 Z"
         style="fill-rule:evenodd;stroke:#000000;stroke-width:1pt"
         transform="matrix(-0.8,0,0,-0.8,-10,0)" />
    </marker>
    <marker
       inkscape:stockid="Arrow1Lstart"
       orient="auto"
       refY="0"
       refX="0"
       id="marker4848"
       style="overflow:visible">
      <path
         inkscape:connector-curvature="0"
         id="path4850"
         d="M 0,0 5,-5 -12.5,0 5,5 0,0 Z"
         style="fill-rule:evenodd;stroke:#000000;stroke-width:1pt"
         transform="matrix(0.8,0,0,0.8,10,0)" />
    </marker>
    <marker
       inkscape:stockid="Arrow1Lend"
       orient="auto"
       refY="0"
       refX="0"
       id="marker4852"
       style="overflow:visible">
      <path
         inkscape:connector-curvature="0"
         id="path4854"
         d="M 0,0 5,-5 -12.5,0 5,5 0,0 Z"
         style="fill-rule:evenodd;stroke:#000000;stroke-width:1pt"
         transform="matrix(-0.8,0,0,-0.8,-10,0)" />
    </marker>
    <marker
       inkscape:stockid="Arrow1Lstart"
       orient="auto"
       refY="0"
       refX="0"
       id="marker4856"
       style="overflow:visible">
      <path
         inkscape:connector-curvature="0"
         id="path4858"
         d="M 0,0 5,-5 -12.5,0 5,5 0,0 Z"
         style="fill-rule:evenodd;stroke:#000000;stroke-width:1pt"
         transform="matrix(0.8,0,0,0.8,10,0)" />
    </marker>
    <marker
       inkscape:stockid="Arrow1Lend"
       orient="auto"
       refY="0"
       refX="0"
       id="marker4860"
       style="overflow:visible">
      <path
         inkscape:connector-curvature="0"
         id="path4862"
         d="M 0,0 5,-5 -12.5,0 5,5 0,0 Z"
         style="fill-rule:evenodd;stroke:#000000;stroke-width:1pt"
         transform="matrix(-0.8,0,0,-0.8,-10,0)" />
    </marker>
    <marker
       inkscape:stockid="Arrow1Lend"
       orient="auto"
       refY="0"
       refX="0"
       id="marker4864"
       style="overflow:visible">
      <path
         inkscape:connector-curvature="0"
         id="path4866"
         d="M 0,0 5,-5 -12.5,0 5,5 0,0 Z"
         style="fill-rule:evenodd;stroke:#000000;stroke-width:1pt"
         transform="matrix(-0.8,0,0,-0.8,-10,0)" />
    </marker>
    <radialGradient
       inkscape:collect="always"
       xlink:href="#linearGradient5722"
       id="radialGradient5728"
       cx="-155.56349"
       cy="417.73386"
       fx="-155.56349"
       fy="417.73386"
       r="52.51778"
       gradientTransform="matrix(1,0,0,1.0048086,0,-2.0087132)"
       gradientUnits="userSpaceOnUse" />
    <radialGradient
       inkscape:collect="always"
       xlink:href="#linearGradient5722"
       id="radialGradient5769"
       gradientUnits="userSpaceOnUse"
       gradientTransform="matrix(1,0,0,1.0048086,0,-2.0087132)"
       cx="-155.56349"
       cy="417.73386"
       fx="-155.56349"
       fy="417.73386"
       r="52.51778" />
    <radialGradient
       inkscape:collect="always"
       xlink:href="#linearGradient5722"
       id="radialGradient5791"
       gradientUnits="userSpaceOnUse"
       gradientTransform="matrix(1,0,0,1.0048086,0,-2.0087132)"
       cx="-155.56349"
       cy="417.73386"
       fx="-155.56349"
       fy="417.73386"
       r="52.51778" />
    <linearGradient
       x1="382.34"
       y1="489.14001"
       gradientTransform="matrix(2.0779,0,0,2.0779,-518.08,-281.8)"
       x2="490.53"
       gradientUnits="userSpaceOnUse"
       y2="333.89001"
       id="linearGradient3019">
      <stop
         offset="0"
         style="stop-color:#000000;stop-opacity:.82639"
         id="stop3015" />
      <stop
         offset="1"
         style="stop-color:#000000"
         id="stop3017" />
    </linearGradient>
    <linearGradient
       x1="382.34"
       y1="489.14001"
       gradientTransform="matrix(2.0779,0,0,2.0779,-518.08,-281.8)"
       x2="490.53"
       gradientUnits="userSpaceOnUse"
       y2="333.89001"
       id="linearGradient3019-9">
      <stop
         offset="0"
         style="stop-color:#000000;stop-opacity:.82639"
         id="stop3015-3" />
      <stop
         offset="1"
         style="stop-color:#000000"
         id="stop3017-6" />
    </linearGradient>
    <radialGradient
       inkscape:collect="always"
       xlink:href="#linearGradient5722"
       id="radialGradient5784"
       gradientUnits="userSpaceOnUse"
       gradientTransform="matrix(1,0,0,1.0048086,0,-2.0087132)"
       cx="-155.56349"
       cy="417.73386"
       fx="-155.56349"
       fy="417.73386"
       r="52.51778" />
    <radialGradient
       inkscape:collect="always"
       xlink:href="#linearGradient5722"
       id="radialGradient3626"
       gradientUnits="userSpaceOnUse"
       gradientTransform="matrix(1.1269389,0,0,1.1274944,15.715212,-101.72447)"
       cx="-155.56349"
       cy="417.73386"
       fx="-155.56349"
       fy="417.73386"
       r="52.51778" />
    <filter
       inkscape:collect="always"
       style="color-interpolation-filters:sRGB"
       id="filter4974"
       x="-0.073221441"
       width="1.1464429"
       y="-0.073178571"
       height="1.1463571">
      <feGaussianBlur
         inkscape:collect="always"
         stdDeviation="3.5425383"
         id="feGaussianBlur4976" />
    </filter>
  </defs>
  <sodipodi:namedview
     id="base"
     pagecolor="#ffffff"
     bordercolor="#666666"
     borderopacity="1.0"
     inkscape:pageopacity="0.0"
     inkscape:pageshadow="2"
     inkscape:zoom="0.12374369"
     inkscape:cx="-655.38685"
     inkscape:cy="246.98937"
     inkscape:document-units="px"
     inkscape:current-layer="g5767"
     showgrid="false"
     fit-margin-top="0"
     fit-margin-left="0"
     fit-margin-right="0"
     fit-margin-bottom="0"
     inkscape:window-width="1598"
     inkscape:window-height="835"
     inkscape:window-x="0"
     inkscape:window-y="32"
     inkscape:window-maximized="0" />
  <metadata
     id="metadata4920">
    <rdf:RDF>
      <cc:Work
         rdf:about="">
        <dc:format>image/svg+xml</dc:format>
        <dc:type
           rdf:resource="http://purl.org/dc/dcmitype/StillImage" />
        <dc:title></dc:title>
      </cc:Work>
    </rdf:RDF>
  </metadata>
  <g
     inkscape:label="Calque 1"
     inkscape:groupmode="layer"
     id="layer1"
     transform="translate(725.90367,551.61594)">
    <g
       id="g5767"
       transform="matrix(1.3078324,0,0,1.3078324,48.578573,-95.72168)">
      <g
         id="g4241"
         transform="matrix(2.8945499,0,0,2.8945499,603.80798,-1004.5558)"
         style="filter:url(#filter4974)">
        <ellipse
           ry="58.091404"
           rx="58.057392"
           cy="369.26813"
           cx="-159.59534"
           style="opacity:0.15800003;fill:url(#radialGradient3626);fill-opacity:1;stroke:#000000;stroke-width:2.95921659;stroke-linecap:round;stroke-linejoin:miter;stroke-miterlimit:4;stroke-dasharray:none;stroke-dashoffset:0;stroke-opacity:1"
           id="path5152" />
        <g
           style="opacity:0.15800003"
           transform="matrix(0.97929296,-0.20244827,0.20244827,0.97929296,-74.89511,-16.693955)"
           id="g4328">
          <ellipse
             transform="matrix(0.89079451,-0.45440637,0.4575155,0.88920165,0,0)"
             id="path3021-0"
             style="fill:#000000;fill-opacity:1;stroke:#000000;stroke-width:1.6219604;stroke-linecap:round;stroke-linejoin:miter;stroke-miterlimit:4;stroke-dasharray:none;stroke-dashoffset:0;stroke-opacity:1"
             cx="-318.75781"
             cy="240.23164"
             rx="23.253141"
             ry="22.74869" />
          <path
             sodipodi:nodetypes="cccc"
             inkscape:connector-curvature="0"
             id="path3791-3"
             d="m -154.57671,345.28515 45.58494,-5.66974 c 4.32315,5.31225 5.70142,10.93071 2.8576,16.90817 l -45.0321,5.53161"
             style="fill:#000000;fill-opacity:1;stroke:#000000;stroke-width:1.62195528;stroke-linecap:butt;stroke-linejoin:miter;stroke-miterlimit:4;stroke-dasharray:none;stroke-opacity:1" />
          <path
             sodipodi:nodetypes="cc"
             inkscape:connector-curvature="0"
             id="path7645-6"
             d="m -150.05486,365.86835 c 1.67944,-5.38604 -1.24012,-19.09991 -4.29199,-23.55474"
             style="fill:none;stroke:#ffffff;stroke-width:2.80132318;stroke-linecap:butt;stroke-linejoin:miter;stroke-miterlimit:4;stroke-dasharray:none;stroke-opacity:1" />
        </g>
        <g
           id="g5753"
           transform="matrix(1.0534841,0,0,0.57063479,-12.015373,137.68948)"
           style="opacity:0.15800003;stroke-width:5.41952658;stroke-miterlimit:4;stroke-dasharray:none">
          <path
             sodipodi:nodetypes="cc"
             inkscape:connector-curvature="0"
             id="path5730"
             d="m -155.56349,494.50543 c 12.6269,-8.08122 21.2132,-12.87944 21.2132,-12.87944"
             style="fill:none;stroke:#000000;stroke-width:5.41952658;stroke-linecap:butt;stroke-linejoin:miter;stroke-miterlimit:4;stroke-dasharray:none;stroke-opacity:1" />
          <g
             id="g5750"
             style="stroke-width:5.41952658;stroke-miterlimit:4;stroke-dasharray:none">
            <path
               style="fill:none;stroke:#000000;stroke-width:5.41952658;stroke-linecap:butt;stroke-linejoin:miter;stroke-miterlimit:4;stroke-dasharray:none;stroke-opacity:1"
               d="m -156.06857,480.99465 c 12.6269,8.08122 21.2132,12.87944 21.2132,12.87944"
               id="path5730-5"
               inkscape:connector-curvature="0"
               sodipodi:nodetypes="cc" />
          </g>
        </g>
        <path
           inkscape:connector-curvature="0"
           id="path3"
           style="opacity:0.15800003;fill:#000000;fill-opacity:1;fill-rule:evenodd;stroke:#000000;stroke-width:0.43550503;stroke-linecap:round;stroke-linejoin:round;stroke-opacity:1"
           d="m -116.39907,372.29169 c -3.4749,11.53593 -7.21156,22.09778 -11.3045,33.68071 -1.0916,2.9531 -4.34342,4.08546 -7.18756,4.55297 -2.58528,0.56931 -5.40291,0.42672 -7.70379,-0.9904 -2.23996,-1.01977 -4.06946,-3.52219 -3.27373,-6.04475 0.82433,-2.95798 3.83465,-4.95683 6.80478,-5.23396 3.02315,-0.59106 6.3351,0.17593 8.71602,2.13511 1.19241,0.87144 1.98075,-0.24191 2.54864,-1.37695 3.20001,-8.98869 6.36925,-17.98775 9.44714,-27.01915 0.32998,-0.89519 2.23472,-0.57873 1.95282,0.29642 z" />
      </g>
    </g>
  </g>
</svg>
