%YAML 1.1
%TAG !u! tag:unity3d.com,2011:
--- !u!78 &1
TagManager:
  serializedVersion: 2
  tags: []
  layers:
  - Default
  - TransparentFX
  - Ignore Raycast
  - 
  - Water
  - UI
  - Wall
  - Enemy
  - Player
  - 
  - 
  - 
  - 
  - 
  - 
  - 
  - 
  - 
  - 
  - 
  - 
  - 
  - 
  - 
  - 
  - 
  - 
  - 
  - 
  - 
  - 
  - 
  m_SortingLayers:
  - name: Default
    uniqueID: 0
    locked: 0
  - name: Walls
    uniqueID: 2875053949
    locked: 0
  - name: Object
    uniqueID: 2289643803
    locked: 0
  - name: Enemy
    uniqueID: 687533547
    locked: 0
  - name: Player
    uniqueID: 1782059075
    locked: 0
