ply
format ascii 1.0
comment Created by Blender 2.79 (sub 0) - www.blender.org, source file: ''
element vertex 24
property float x
property float y
property float z
property float nx
property float ny
property float nz
property uchar red
property uchar green
property uchar blue
element face 12
property list uchar uint vertex_indices
end_header
-0.008933 0.009217 0.018750 -1.000000 0.000000 0.000000 58 95 255
-0.008933 0.009217 0.000000 -1.000000 0.000000 0.000000 58 95 255
-0.008933 -0.009533 0.018750 -1.000000 0.000000 0.000000 58 95 255
-0.008933 -0.009533 0.000000 -1.000000 0.000000 0.000000 58 95 255
0.009817 0.009217 0.018750 0.000000 -0.000000 1.000000 58 96 253
-0.008933 0.009217 0.018750 0.000000 -0.000000 1.000000 58 96 253
0.009817 -0.009533 0.018750 0.000000 -0.000000 1.000000 57 98 250
-0.008933 -0.009533 0.018750 -0.000000 0.000000 1.000000 58 95 255
0.009817 0.009217 0.000000 1.000000 -0.000000 0.000000 60 112 235
0.009817 0.009217 0.018750 1.000000 -0.000000 0.000000 58 104 242
0.009817 -0.009533 0.000000 1.000000 -0.000000 0.000000 52 133 195
0.009817 -0.009533 0.018750 1.000000 -0.000000 0.000000 52 128 204
-0.008933 0.009217 0.000000 0.000000 0.000000 -1.000000 58 95 255
0.009817 0.009217 0.000000 0.000000 0.000000 -1.000000 58 95 255
-0.008933 -0.009533 0.000000 0.000000 0.000000 -1.000000 58 95 255
0.009817 -0.009533 0.000000 -0.000000 0.000000 -1.000000 58 95 254
0.009817 0.009217 0.018750 -0.000000 1.000000 0.000000 59 105 241
0.009817 0.009217 0.000000 -0.000000 1.000000 0.000000 57 100 248
-0.008933 0.009217 0.018750 -0.000000 1.000000 0.000000 55 109 233
-0.008933 0.009217 0.000000 0.000000 1.000000 -0.000000 51 132 195
0.009817 -0.009533 0.000000 0.000000 -1.000000 0.000000 58 95 255
0.009817 -0.009533 0.018750 0.000000 -1.000000 0.000000 58 96 254
-0.008933 -0.009533 0.000000 0.000000 -1.000000 0.000000 58 95 255
-0.008933 -0.009533 0.018750 0.000000 -1.000000 -0.000000 58 95 255
3 0 1 2
3 2 1 3
3 4 5 6
3 6 5 7
3 8 9 10
3 10 9 11
3 12 13 14
3 14 13 15
3 16 17 18
3 18 17 19
3 20 21 22
3 22 21 23
