Division,WeightClassKg,Place,Name,Team,BodyweightKg,Best3SquatKg,Best3BenchKg,Best3DeadliftKg,TotalKg,Equipment,Event,Sex
Boys,51.71,1,Will Solomon,Bastrop Cedar Creek,51.71,102.06,74.84,127.01,303.91,Single-ply,SBD,M
Boys,51.71,2,Sergio Huertas,Georgetown,46.9,113.4,65.77,117.93,297.1,Single-ply,SBD,M
Boys,51.71,3,Colt Baranowski,Smithville,44.72,102.06,52.16,113.4,267.62,Single-ply,SBD,M
Boys,51.71,4,Zane Timpson,Smithville,51.44,77.11,56.7,113.4,247.21,Single-ply,SBD,M
Boys,51.71,5,Rudy Pina,Del Valle,48.99,68.04,54.43,108.86,231.33,Single-ply,SBD,M
Boys,51.71,DQ,Jaquariz Butler,Georgetown East View,47.9,,,,,Single-ply,SBD,M
Boys,55.79,1,Therrance Soto,San Marcos,55.52,142.88,77.11,163.29,383.29,Single-ply,SBD,M
Boys,55.79,2,Shawn Patterson,Bastrop Cedar Creek,53.98,106.59,70.31,142.88,319.78,Single-ply,SBD,M
Boys,55.79,3,DJ Walker,Georgetown East View,55.7,102.06,65.77,131.54,299.37,Single-ply,SBD,M
Boys,55.79,4,Chris Guerrero,Del Valle,55.79,97.52,56.7,129.27,283.5,Single-ply,SBD,M
Boys,55.79,5,Tucker Klein,Fredericksburg,52.25,104.33,63.5,113.4,281.23,Single-ply,SBD,M
Boys,55.79,DQ,Michael Guerrero,Georgetown East View,54.52,161.03,,,,Single-ply,SBD,M
Boys,55.79,DQ,Isaac Trejo,San Marcos,55.34,111.13,,,,Single-ply,SBD,M
Boys,59.87,1,Leonardo Calderon,San Marcos,58.51,213.19,129.27,183.7,526.17,Single-ply,SBD,M
Boys,59.87,2,Michael Marullo,Georgetown East View,59.24,142.88,97.52,138.35,378.75,Single-ply,SBD,M
Boys,59.87,3,Daniel Santana,San Marcos,59.6,124.74,74.84,154.22,353.8,Single-ply,SBD,M
Boys,59.87,4,Damian Albiter,Bastrop Cedar Creek,56.61,117.93,61.23,136.08,315.25,Single-ply,SBD,M
Boys,59.87,5,Brett Smigelski,Georgetown East View,58.06,108.86,74.84,131.54,315.25,Single-ply,SBD,M
Boys,59.87,DQ,Jason Leal,Buda Hays,58.51,,,,,Single-ply,SBD,M
Boys,59.87,DQ,Elijah Hubbard,Elgin,59.42,,,,,Single-ply,SBD,M
Boys,67.13,1,Cody Elizalde,Seguin,66.22,210.92,111.13,222.26,544.31,Single-ply,SBD,M
Boys,67.13,2,Sammy Muniz,San Marcos,65.77,167.83,97.52,226.8,492.15,Single-ply,SBD,M
Boys,67.13,3,Chris Velazquez,Geronimo Navarro,64.86,204.12,104.33,165.56,474,Single-ply,SBD,M
Boys,67.13,4,Nathaniel Burnett,Lockhart,63.96,163.29,102.06,190.51,455.86,Single-ply,SBD,M
Boys,67.13,5,Alexander Vargas,Del Valle,67.13,161.03,102.06,174.63,437.72,Single-ply,SBD,M
Boys,67.13,6,Daniel Mireles,Georgetown East View,65.32,165.56,113.4,156.49,435.45,Single-ply,SBD,M
Boys,67.13,7,Christian Alvarez #1,San Marcos,66.41,167.83,90.72,176.9,435.45,Single-ply,SBD,M
Boys,67.13,8,Ray Heiser,Kyle Lehman,64.68,151.95,95.25,181.44,428.64,Single-ply,SBD,M
Boys,67.13,9,Raul Arizola,Smithville,64.77,147.42,106.59,161.03,415.04,Single-ply,SBD,M
Boys,67.13,10,Mark Bundage,Kyle Lehman,66.04,151.95,97.52,163.29,412.77,Single-ply,SBD,M
Boys,67.13,11,Klayton Morriss,Bastrop Cedar Creek,65.14,145.15,74.84,176.9,396.89,Single-ply,SBD,M
Boys,67.13,12,Jaime Ortega,Fredericksburg,65.5,142.88,97.52,149.69,390.09,Single-ply,SBD,M
Boys,67.13,13,Alexander Osborne,Austin Lake Travis,64.59,142.88,86.18,136.08,365.14,Single-ply,SBD,M
Boys,67.13,14,Ryan Wall,Georgetown East View,64.5,122.47,63.5,142.88,328.85,Single-ply,SBD,M
Boys,67.13,15,Graham Sherrill,Smithville,65.14,102.06,52.16,129.27,283.5,Single-ply,SBD,M
Boys,67.13,DQ,Jesau Batres,Lockhart,60.69,129.27,,,,Single-ply,SBD,M
Boys,67.13,DQ,Declan Trevethan,Buda Hays,66.5,86.18,,,,Single-ply,SBD,M
Boys,67.13,DQ,Christopher Martinez,Del Valle,67.13,,,,,Single-ply,SBD,M
Boys,74.84,1,Brandon Palomares,Seguin,73.12,231.33,120.2,224.53,576.06,Single-ply,SBD,M
Boys,74.84,2,Isaac Johnson,Elgin,71.85,215.46,117.93,215.46,548.85,Single-ply,SBD,M
Boys,74.84,3,Kevin Cervantes,Elgin,74.66,192.78,131.54,201.85,526.17,Single-ply,SBD,M
Boys,74.84,4,Jared Cooper,Geronimo Navarro,71.67,195.04,111.13,210.92,517.1,Single-ply,SBD,M
Boys,74.84,5,Andrew Wyatt,Smithville,72.85,183.7,129.27,201.85,514.83,Single-ply,SBD,M
Boys,74.84,6,Euler de Leon,Geronimo Navarro,73.12,176.9,97.52,192.78,467.2,Single-ply,SBD,M
Boys,74.84,7,Matthew Ramos #3,Austin Lake Travis,70.49,156.49,95.25,167.83,419.57,Single-ply,SBD,M
Boys,74.84,8,Cade Edwards,Bastrop Cedar Creek,74.75,142.88,90.72,167.83,401.43,Single-ply,SBD,M
Boys,74.84,9,Adam Palomares,Buda Hays,73.66,163.29,83.91,151.95,399.16,Single-ply,SBD,M
Boys,74.84,10,Belema Dennis,Del Valle,74.39,142.88,72.57,165.56,381.02,Single-ply,SBD,M
Boys,74.84,11,Camren Willworth,Del Valle,74.84,113.4,81.65,154.22,349.27,Single-ply,SBD,M
Boys,74.84,DQ,Eduardo Perez,Georgetown,72.94,219.99,106.59,,,Single-ply,SBD,M
Boys,74.84,DQ,William Reyna,Geronimo Navarro,73.39,,,,,Single-ply,SBD,M
Boys,74.84,DQ,Josh Handley,Fredericksburg,72.94,156.49,,,,Single-ply,SBD,M
Boys,74.84,DQ,Marcus Barr,Del Valle,73.48,,,,,Single-ply,SBD,M
Boys,82.1,1,Alex Rivas,Seguin,81.92,226.8,133.81,226.8,587.4,Single-ply,SBD,M
Boys,82.1,2,Greg Rivera,Lockhart,81.83,201.85,136.08,238.14,576.06,Single-ply,SBD,M
Boys,82.1,3,Devin Norman,Lockhart,78.93,199.58,136.08,215.46,551.11,Single-ply,SBD,M
Boys,82.1,4,Nathan Bryson,Kyle Lehman,80.92,185.97,145.15,215.46,546.58,Single-ply,SBD,M
Boys,82.1,5,Jacob Gonzales,Lockhart,81.01,195.04,106.59,217.72,519.36,Single-ply,SBD,M
Boys,82.1,6,Tyler Law,Geronimo Navarro,81.47,190.51,120.2,208.65,519.36,Single-ply,SBD,M
Boys,82.1,7,Josh Garza,Bastrop Cedar Creek,81.56,183.7,92.99,215.46,492.15,Single-ply,SBD,M
Boys,82.1,8,Chris Aguirre,Buda Hays,80.29,190.51,108.86,183.7,483.08,Single-ply,SBD,M
Boys,82.1,9,Tamorian Moore,Del Valle,81.19,142.88,106.59,170.1,419.57,Single-ply,SBD,M
Boys,82.1,10,Von Tayvius Murphy,Del Valle,82.1,124.74,90.72,170.1,385.55,Single-ply,SBD,M
Boys,82.1,11,Joseph Carroll,Georgetown,77.2,140.61,70.31,145.15,356.07,Single-ply,SBD,M
Boys,82.1,12,Rosendo Bahena Avila,Del Valle,82.1,115.67,63.5,158.76,337.93,Single-ply,SBD,M
Boys,82.1,DQ,Luis Rodriguez,Geronimo Navarro,81.28,,,,,Single-ply,SBD,M
Boys,82.1,DQ,Eston Epton,Fredericksburg,81.37,,,,,Single-ply,SBD,M
Boys,89.81,1,Jared Leal,Geronimo Navarro,88.36,244.94,133.81,267.62,646.37,Single-ply,SBD,M
Boys,89.81,2,Ryan Leal,Buda Hays,87.72,249.48,158.76,226.8,635.03,Single-ply,SBD,M
Boys,89.81,3,Rene Velasquez,San Marcos,88,210.92,138.35,204.12,553.38,Single-ply,SBD,M
Boys,89.81,4,Tre Moreno,Kyle Lehman,84.64,197.31,115.67,210.92,523.9,Single-ply,SBD,M
Boys,89.81,5,Josh Ewald,Kyle Lehman,87.82,201.85,115.67,204.12,521.63,Single-ply,SBD,M
Boys,89.81,6,Sebastian Monroe,Austin Lake Travis,86.36,188.24,129.27,201.85,519.36,Single-ply,SBD,M
Boys,89.81,7,Nate Hines,Georgetown East View,82.64,190.51,117.93,197.31,505.76,Single-ply,SBD,M
Boys,89.81,8,Peyton Blake,Elgin,84.55,210.92,104.33,185.97,501.22,Single-ply,SBD,M
Boys,89.81,9,Connor Kelly,Bastrop Cedar Creek,89.81,167.83,113.4,217.72,498.95,Single-ply,SBD,M
Boys,89.81,10,Laden Brown,Lockhart,86.09,181.44,113.4,179.17,474,Single-ply,SBD,M
Boys,89.81,11,Nick Lelii,Lockhart,83.01,163.29,117.93,167.83,449.06,Single-ply,SBD,M
Boys,89.81,12,Cristian Faison,Buda Hays,89.72,176.9,108.86,163.29,449.06,Single-ply,SBD,M
Boys,89.81,13,Isaias Gonzalez,Del Valle,88.9,151.95,86.18,174.63,412.77,Single-ply,SBD,M
Boys,89.81,14,Nicholas Chavez,Del Valle,84.82,142.88,90.72,145.15,378.75,Single-ply,SBD,M
Boys,89.81,DQ,Brandon Ferguson-Kendrick,Del Valle,89.36,,,,,Single-ply,SBD,M
Boys,89.81,DQ,JC Castillo,Seguin,89.18,240.4,,,,Single-ply,SBD,M
Boys,99.79,1,Abel Longoria,Kyle Lehman,99.06,274.42,158.76,240.4,673.58,Single-ply,SBD,M
Boys,99.79,2,Reid Bacon,Austin Lake Travis,97.89,231.33,145.15,233.6,610.08,Single-ply,SBD,M
Boys,99.79,3,Garrett Luensmann,Seguin,96.16,226.8,127.01,229.06,582.87,Single-ply,SBD,M
Boys,99.79,4,Stone Jones,Bastrop Cedar Creek,95.25,195.04,108.86,210.92,514.83,Single-ply,SBD,M
Boys,99.79,5,Nicolas Williams,Buda Hays,90.36,174.63,88.45,170.1,433.18,Single-ply,SBD,M
Boys,99.79,6,Raymundo Constancio,Del Valle,94.35,165.56,83.91,170.1,419.57,Single-ply,SBD,M
Boys,99.79,7,Adam Vinyard,Georgetown East View,94.53,124.74,124.74,147.42,396.89,Single-ply,SBD,M
Boys,99.79,8,Brian Ortiz,Del Valle,92.53,133.81,97.52,161.03,392.36,Single-ply,SBD,M
Boys,99.79,9,Christian Marmolejo,San Marcos,97.61,133.81,79.38,172.37,385.55,Single-ply,SBD,M
Boys,99.79,10,Joshua Torres,Del Valle,96.62,136.08,77.11,124.74,337.93,Single-ply,SBD,M
Boys,99.79,11,Justin Burnett,Buda Hays,93.08,127.01,63.5,124.74,315.25,Single-ply,SBD,M
Boys,99.79,DQ,Rick Reyes,Buda Hays,90.63,263.08,,,,Single-ply,SBD,M
Boys,99.79,DQ,Samson Rena,Del Valle,96.16,142.88,68.04,,,Single-ply,SBD,M
Boys,99.79,DQ,Duncan Bauer,Seguin,97.7,260.82,,,,Single-ply,SBD,M
Boys,99.79,DQ,Harley Franklin,Elgin,95.8,179.17,102.06,,,Single-ply,SBD,M
Boys,99.79,DQ,Jorge Mondragon-Barron,Del Valle,99.79,,,,,Single-ply,SBD,M
Boys,109.77,1,Jose Hernandez #5,San Marcos,107.05,306.17,165.56,265.35,737.09,Single-ply,SBD,M
Boys,109.77,2,Ramsey Tijerina,San Marcos,109.77,251.74,145.15,240.4,637.3,Single-ply,SBD,M
Boys,109.77,3,Keane Davis,Seguin,108.59,226.8,136.08,249.48,612.35,Single-ply,SBD,M
Boys,109.77,4,Kade Langston,Austin Lake Travis,106.5,217.72,174.63,210.92,603.28,Single-ply,SBD,M
Boys,109.77,5,Harley Ullrich,Seguin,106.5,226.8,149.69,224.53,601.01,Single-ply,SBD,M
Boys,109.77,6,Matthew Herrera,Austin Lake Travis,105.05,238.14,145.15,215.46,598.74,Single-ply,SBD,M
Boys,109.77,7,Colton Barnett,Geronimo Navarro,102.42,226.8,127.01,238.14,591.94,Single-ply,SBD,M
Boys,109.77,8,Gerardo Martinez Torres,Del Valle,108.41,204.12,120.2,215.46,539.77,Single-ply,SBD,M
Boys,109.77,9,Randy Reyes,Bastrop Cedar Creek,105.78,183.7,131.54,199.58,514.83,Single-ply,SBD,M
Boys,109.77,10,Brayan Carrera,Del Valle,105.23,197.31,113.4,199.58,510.29,Single-ply,SBD,M
Boys,109.77,11,Brayan Vasquez-Diaz,Del Valle,107.95,138.35,124.74,185.97,449.06,Single-ply,SBD,M
Boys,109.77,12,Chad Wolf,Austin Lake Travis,103.69,151.95,111.13,161.03,424.11,Single-ply,SBD,M
Boys,109.77,13,Stephen Posey,Austin Lake Travis,108.14,151.95,92.99,142.88,387.82,Single-ply,SBD,M
Boys,109.77,DQ,David Sillero,Lockhart,108.05,192.78,,,,Single-ply,SBD,M
Boys,109.77,DQ,John Navejas,Elgin,106.96,,,,,Single-ply,SBD,M
Boys,124.74,1,Roman Ruiz,Lockhart,124.74,285.76,176.9,272.16,734.82,Single-ply,SBD,M
Boys,124.74,2,Tyler Noles,Georgetown,115.94,265.35,161.03,235.87,662.24,Single-ply,SBD,M
Boys,124.74,3,Kadin Hammonds,Georgetown,113.94,249.48,165.56,222.26,637.3,Single-ply,SBD,M
Boys,124.74,4,Dylan Sillero,San Marcos,116.12,272.16,136.08,226.8,635.03,Single-ply,SBD,M
Boys,124.74,5,Kaleb Barho,Smithville,120.56,260.82,158.76,215.46,635.03,Single-ply,SBD,M
Boys,124.74,6,Andrew Gaitan,Seguin,120.47,251.74,147.42,226.8,625.96,Single-ply,SBD,M
Boys,124.74,7,Tyler Howard,Geronimo Navarro,123.83,244.94,147.42,233.6,625.96,Single-ply,SBD,M
Boys,124.74,8,Terry Cook,Elgin,115.03,238.14,133.81,238.14,610.08,Single-ply,SBD,M
Boys,124.74,9,Ethan Garcia,Kyle Lehman,116.75,249.48,129.27,231.33,610.08,Single-ply,SBD,M
Boys,124.74,10,Dylan Hatfield,Geronimo Navarro,121.65,244.94,140.61,199.58,585.13,Single-ply,SBD,M
Boys,124.74,11,Louis Salamanca,Seguin,119.29,231.33,158.76,190.51,580.6,Single-ply,SBD,M
Boys,124.74,12,Jaylon Knighten,Del Valle,119.75,226.8,117.93,219.99,564.72,Single-ply,SBD,M
Boys,124.74,13,John Adam Castaneda,Fredericksburg,113.22,226.8,122.47,204.12,553.38,Single-ply,SBD,M
Boys,124.74,14,Jake McCabe,Austin Lake Travis,124.19,197.31,136.08,213.19,546.58,Single-ply,SBD,M
Boys,124.74,15,Kaiser Forcade,Fredericksburg,117.93,229.06,117.93,192.78,539.77,Single-ply,SBD,M
Boys,124.74,16,Harrison Schuler,Georgetown,114.12,195.04,138.35,181.44,514.83,Single-ply,SBD,M
Boys,124.74,17,Daniel Urquiza,Del Valle,122.92,142.88,70.31,204.12,417.3,Single-ply,SBD,M
Boys,124.74,DQ,Jimmy Garza,Elgin,111.22,,,,,Single-ply,SBD,M
Boys,124.74,DQ,Brian George,Bastrop Cedar Creek,122.74,,,,,Single-ply,SBD,M
Boys,124.74,DQ,Frank Selvera,Del Valle,121.11,,,,,Single-ply,SBD,M
Boys,124.74,DQ,Eliel Salazar,Elgin,115.67,226.8,149.69,,,Single-ply,SBD,M
Boys,124.74+,1,Carlos Morales,Kyle Lehman,141.52,272.16,158.76,240.4,671.32,Single-ply,SBD,M
Boys,124.74+,2,Brian Prickett,Kyle Lehman,130.18,265.35,154.22,244.94,664.51,Single-ply,SBD,M
Boys,124.74+,3,Ty Roaches,Kyle Lehman,126.37,267.62,154.22,226.8,648.64,Single-ply,SBD,M
Boys,124.74+,4,Chase Travis,Georgetown,131.18,272.16,149.69,219.99,641.83,Single-ply,SBD,M
Boys,124.74+,5,Jeremy Wills,Lockhart,191.23,272.16,181.44,183.7,637.3,Single-ply,SBD,M
Boys,124.74+,6,Garrett Dietert,Geronimo Navarro,124.83,263.08,133.81,226.8,623.69,Single-ply,SBD,M
Boys,124.74+,7,Zac Hostetter,Seguin,134.26,192.78,181.44,204.12,578.33,Single-ply,SBD,M
Boys,124.74+,8,Noe Ibarra,Georgetown,136.53,226.8,124.74,192.78,544.31,Single-ply,SBD,M
Boys,124.74+,9,Brok Garcia,Smithville,137.62,142.88,90.72,142.88,376.48,Single-ply,SBD,M
Boys,124.74+,DQ,Christopher Gutierrez,Del Valle,134.72,,,,,Single-ply,SBD,M
Boys,,NS,Jonathon Willet,Georgetown East View,,,,,,Single-ply,SBD,M
Boys,,NS,Isaac Ochoa,Georgetown East View,,,,,,Single-ply,SBD,M
Boys,,NS,Eduardo Ventura,Kyle Lehman,,,,,,Single-ply,SBD,M
Boys,,NS,James Gracia,Bastrop Cedar Creek,,,,,,Single-ply,SBD,M
Boys,,NS,Logan Till,Lockhart,,,,,,Single-ply,SBD,M
Boys,,NS,Jake Adams,Austin Lake Travis,,,,,,Single-ply,SBD,M
Boys,,NS,Cade Connors,Austin Lake Travis,,,,,,Single-ply,SBD,M
Boys,,NS,Jajuan Singleton,Elgin,,,,,,Single-ply,SBD,M
Boys,,NS,Shelbie Hill,Elgin,,,,,,Single-ply,SBD,M
