{"_id":{"$oid":"5c9bb024b161aa4688adca57"},"ParentId":null,"CategoryLevel":{"$numberInt":"0"},"Sort":{"$numberInt":"0"},"Url":null,"UrlAuto":null,"Name":"Menu Header","Position":"Menu Header","Avatar":null,"__v":{"$numberInt":"0"}}
{"_id":{"$oid":"5c9bb033b161aa4688adca59"},"ParentId":"5c9bb024b161aa4688adca57","CategoryLevel":{"$numberInt":"1"},"Sort":{"$numberInt":"1"},"Url":"/","UrlAuto":"/","Name":"Home","Position":null,"Avatar":null,"__v":{"$numberInt":"0"},"Key":"home"}
{"_id":{"$oid":"5c9c3077de091b25546b088b"},"ParentId":"5c9bb024b161aa4688adca57","CategoryLevel":{"$numberInt":"1"},"Sort":{"$numberInt":"3"},"Url":"/service-category/our-services","UrlAuto":"/service-category/our-services","Name":"Service","Position":null,"Avatar":null,"__v":{"$numberInt":"0"},"Key":"service"}
{"_id":{"$oid":"5c9c3089de091b25546b088c"},"ParentId":"5c9bb024b161aa4688adca57","CategoryLevel":{"$numberInt":"1"},"Sort":{"$numberInt":"2"},"Url":"/booking","UrlAuto":"/booking","Name":"Booking","Position":null,"Avatar":null,"__v":{"$numberInt":"0"},"Key":"booking"}
{"_id":{"$oid":"5c9c309cde091b25546b088d"},"ParentId":"5c9bb024b161aa4688adca57","CategoryLevel":{"$numberInt":"1"},"Sort":{"$numberInt":"4"},"Url":"/gallery-category","UrlAuto":"/gallery-category","Name":"Gallery","Position":null,"Avatar":null,"__v":{"$numberInt":"0"},"Key":"gallery"}
{"_id":{"$oid":"5c9c337b959fd7272498935a"},"ParentId":"5c9bb024b161aa4688adca57","CategoryLevel":{"$numberInt":"1"},"Sort":{"$numberInt":"5"},"Url":"/blog-category","UrlAuto":"/blog-category","Name":"Blogs","Position":null,"Avatar":null,"__v":{"$numberInt":"0"},"Key":"blogs"}
{"_id":{"$oid":"5c9c3390959fd7272498935b"},"ParentId":"5c9bb024b161aa4688adca57","CategoryLevel":{"$numberInt":"1"},"Sort":{"$numberInt":"6"},"Url":"/contact-us","UrlAuto":"/contact-us","Name":"Contact us","Position":null,"Avatar":null,"__v":{"$numberInt":"0"},"Key":"contact-us"}
