{"_id":{"$oid":"5c8880d59ba95820c0f16b0c"},"Price":{"$numberInt":"35"},"Time":{"$numberInt":"10"},"DisCount":{"$numberInt":"10"},"ListAlbum":null,"Url":"strip-lashes","Title":"Strip Lashes","ShortDescription":null,"CategoryId":"5c9054667cdcc81abc163ca4","CategoryName":"Eyelash extensions","MetaTitle":"Strip Lashes","MetaDescription":null,"MetaKeyword":null,"IsHtml":false,"PageContent":null,"Avatar":"/statics/resources/uploads/banners/15529631639461541778731-shutterstock_496314877.jpg","CreatedDate":{"$date":{"$numberLong":"1552449749833"}},"EcsUserId":null,"UpdatedDate":{"$date":{"$numberLong":"1552963174473"}},"__v":{"$numberInt":"0"}}
{"_id":{"$oid":"5c9056b51485ed3bbcb9dba6"},"Price":{"$numberInt":"150"},"Time":{"$numberInt":"30"},"DisCount":null,"ListAlbum":null,"Url":"classic","Title":"Classic","ShortDescription":null,"CategoryId":"5c9054667cdcc81abc163ca4","CategoryName":"Eyelash extensions","MetaTitle":"Classic","MetaDescription":null,"MetaKeyword":null,"IsHtml":false,"IsChecked":false,"PageContent":null,"Avatar":"/statics/resources/uploads/banners/15529632457951541778731-shutterstock_496314877.jpg","CreatedDate":{"$date":{"$numberLong":"1552963253771"}},"EcsUserId":null,"UpdatedDate":null,"__v":{"$numberInt":"0"}}
{"_id":{"$oid":"5c9056e91485ed3bbcb9dba7"},"Price":{"$numberInt":"250"},"Time":{"$numberInt":"30"},"DisCount":null,"ListAlbum":null,"Url":"russian-volume","Title":"Russian Volume","ShortDescription":null,"CategoryId":"5c9054667cdcc81abc163ca4","CategoryName":"Eyelash extensions","MetaTitle":"Russian Volume","MetaDescription":null,"MetaKeyword":null,"IsHtml":false,"IsChecked":false,"PageContent":null,"Avatar":null,"CreatedDate":{"$date":{"$numberLong":"1552963305977"}},"EcsUserId":null,"UpdatedDate":null,"__v":{"$numberInt":"0"}}
{"_id":{"$oid":"5c9056fc1485ed3bbcb9dba8"},"Price":{"$numberInt":"100"},"Time":{"$numberInt":"30"},"DisCount":null,"ListAlbum":null,"Url":"natural-lash-lift","Title":"Natural Lash Lift","ShortDescription":null,"CategoryId":"5c9054667cdcc81abc163ca4","CategoryName":"Eyelash extensions","MetaTitle":"Natural Lash Lift","MetaDescription":null,"MetaKeyword":null,"IsHtml":false,"IsChecked":false,"PageContent":null,"Avatar":null,"CreatedDate":{"$date":{"$numberLong":"1552963324290"}},"EcsUserId":null,"UpdatedDate":null,"__v":{"$numberInt":"0"}}
{"_id":{"$oid":"5c90b3df8ba8b130e4a99c32"},"Price":{"$numberInt":"25"},"Time":{"$numberInt":"30"},"DisCount":null,"ListAlbum":null,"Url":"acrylic","Title":"Acrylic","ShortDescription":null,"CategoryId":"5c90a95e31277c0f289afb9b","CategoryName":"Add on services","MetaTitle":"Acrylic","MetaDescription":null,"MetaKeyword":null,"IsHtml":false,"IsChecked":false,"PageContent":null,"Avatar":null,"CreatedDate":{"$date":{"$numberLong":"1552987103773"}},"EcsUserId":null,"UpdatedDate":null,"__v":{"$numberInt":"0"}}
