{"_id":{"$oid":"5c91f4d5d151e13dc428184f"},"Key":"THEME_HOME","Value":{"Name":"Trang chủ","Slug":"THEME_HOME","ThemeType":{"$numberInt":"0"},"Data":[{"Name":"Slider","Slug":null,"ThemeType":{"$numberInt":"0"},"Data":[{"Name":"Ds slide","Slug":null,"ThemeType":{"$numberInt":"3"},"Sort":{"$numberInt":"0"},"Data":[{"Name":null,"Url":null,"Src":"/statics/resources/uploads/banners/1542525147-royal-07-jpg-18.jpg","Alt":null,"Sort":{"$numberInt":"0"},"ThemeType":{"$numberInt":"1"},"IsChecked":false},{"Name":null,"Url":null,"Src":"/statics/resources/uploads/banners/1542769557-passion-18.jpg","Alt":null,"Sort":{"$numberInt":"1"},"ThemeType":{"$numberInt":"1"},"IsChecked":false},{"Name":null,"Url":null,"Src":"/statics/resources/uploads/banners/1542858743-untitled-22-20.jpg","Alt":null,"Sort":{"$numberInt":"2"},"ThemeType":{"$numberInt":"1"},"IsChecked":false}]}]},{"Name":"About Us","Slug":null,"ThemeType":{"$numberInt":"0"},"Data":[{"Name":"Hình đại diện","Url":null,"Src":"/statics/resources/uploads/banners/index-img1.jpg","Alt":null,"Sort":{"$numberInt":"0"},"ThemeType":{"$numberInt":"1"}},{"Name":"Nội dung","Slug":null,"ThemeType":{"$numberInt":"0"},"Data":[{"Name":"Tiêu đề","Value":"Welcome to Royal Beauty salon in Florida","Url":null,"Sort":{"$numberInt":"0"},"TextType":{"$numberInt":"0"},"ThemeType":{"$numberInt":"2"}},{"Name":"Mô tả","Value":"<p><strong>Royal Beauty Salon</strong> is a full-service beauty salon. We offer a variety of nail care services such as&nbsp;manicure, spa pedicure, nail enhancements and eyelash extension.</p>\n\n<p>At <strong>Royal Beauty Salon</strong>, your satisfaction and comfort are our highest priority. You will have a chance to unwind yourself in a relaxing and soothing environment, while receiving a great nails or spa service.</p>\n\n<p>We are very thankful for all of our loyal customers!</p>\n","Url":null,"Sort":{"$numberInt":"0"},"TextType":{"$numberInt":"1"},"ThemeType":{"$numberInt":"2"}},{"Name":"Giờ mở cửa","Value":"<p>Mon-Fri: 7:00 AM to 7:00 PM</p>\n\n<p>Saturday: 7:00 AM to 4:00 PM</p>\n\n<p>Sunday : CLOSED</p>\n","Url":null,"Sort":{"$numberInt":"0"},"TextType":{"$numberInt":"1"},"ThemeType":{"$numberInt":"2"}},{"Name":"Địa chỉ","Value":"<p>12685 Old Plantation Ln, Orlando, FL 32824</p>\n","Url":null,"Sort":{"$numberInt":"0"},"TextType":{"$numberInt":"1"},"ThemeType":{"$numberInt":"2"}}]}]},{"Name":"Testimonials","Slug":null,"ThemeType":{"$numberInt":"0"},"Data":[{"Name":"Testimonials List","Slug":null,"ThemeType":{"$numberInt":"4"},"Sort":{"$numberInt":"0"},"Data":[{"Sort":{"$numberInt":"0"},"TextList":[{"Name":"Tên","Value":"Kathy Smith","Url":null,"Sort":{"$numberInt":"0"},"TextType":{"$numberInt":"0"},"ThemeType":{"$numberInt":"2"}},{"Name":"Nội dung","Value":"I love the salon designs & services","Url":null,"Sort":{"$numberInt":"0"},"TextType":{"$numberInt":"0"},"ThemeType":{"$numberInt":"2"}}],"ImageList":[]},{"Sort":{"$numberInt":"1"},"TextList":[{"Name":"Tên","Value":"Susan Jackson","Url":null,"Sort":{"$numberInt":"0"},"TextType":{"$numberInt":"0"},"ThemeType":{"$numberInt":"2"}},{"Name":"Nội dung","Value":"Friendly staffs & incredible services","Url":null,"Sort":{"$numberInt":"0"},"TextType":{"$numberInt":"0"},"ThemeType":{"$numberInt":"2"}}],"ImageList":[]},{"Sort":{"$numberInt":"2"},"TextList":[{"Name":"Tên","Value":"Janet Park","Url":null,"Sort":{"$numberInt":"0"},"TextType":{"$numberInt":"0"},"ThemeType":{"$numberInt":"2"}},{"Name":"Nội dung","Value":"Highly recommend this salon","Url":null,"Sort":{"$numberInt":"0"},"TextType":{"$numberInt":"0"},"ThemeType":{"$numberInt":"2"}}],"ImageList":[]}],"Template":{"ImageList":[],"TextList":[{"Name":"Tên","TextType":{"$numberInt":"0"}},{"Name":"Nội dung","TextType":{"$numberInt":"0"}}]}}]}]},"__v":{"$numberInt":"0"}}
{"_id":{"$oid":"5c9853b19b7f6e3ec45a7312"},"Key":"BOOKING_SETTING","Value":{"Key":"BOOKING_SETTING","DayOff":[{"element":"2019-10-01T17:00:00.000Z","IsChecked":false}],"DaySpecial":[{"Day":"2020-01-14T17:00:00.000Z","Open":"07:00","Close":"12:00","IsChecked":false}],"DayWork":[{"Day":"Monday","Open":"07:00","Close":"20:00","IsActive":true,"DayIndex":{"$numberInt":"1"}},{"Day":"Tuesday","Open":"07:00","Close":"20:00","IsActive":true,"DayIndex":{"$numberInt":"2"}},{"Day":"Wednesday","Open":"07:00","Close":"20:00","IsActive":true,"DayIndex":{"$numberInt":"3"}},{"Day":"Thursday","Open":"07:00","Close":"20:00","IsActive":true,"DayIndex":{"$numberInt":"4"}},{"Day":"Friday","Open":"07:00","Close":"20:00","IsActive":true,"DayIndex":{"$numberInt":"5"}},{"Day":"Saturday","Open":"07:00","Close":"20:00","IsActive":true,"DayIndex":{"$numberInt":"6"}},{"Day":"Sunday","Open":"07:00","Close":"20:00","IsActive":false,"DayIndex":{"$numberInt":"0"}}],"TimeBook":{"$numberInt":"20"}},"__v":{"$numberInt":"0"}}
{"_id":{"$oid":"5c9c8928c8d9074b90825d5e"},"Key":"SEO_SETTING","Value":{"Key":"SEO_SETTING","SeoAdvancedConfig":{"Robot":"rot","SiteMap":"sitemap"},"SeoBasicConfig":{"Title":"WebNails & DK Mobility","MetaTitle":"WebNails & DK Mobility","Keyword":"WebNails & DK Mobility","GoogleAnalytics":"UA-136823597-1","WebmasterTool":"UA-136823597-1"},"WebConfig":{"WebsiteINFO":{"WebsiteTitle":"WebNails & DK Mobility","WebsiteURL":"https://www.webnails.money/","WebsiteEmail":"info@dkmobility.com","WebsiteNotification":"webnails@gmail.com","WebsitePhone":"+1-888-264-2764","WebsiteAddress":"12685 Old Plantation Ln, Orlando, FL 32824","WebsiteGoogleMap":"<iframe src=\"https://www.google.com/maps/embed?pb=!1m18!1m12!1m3!1d3510.2315217837204!2d-81.35800678492302!3d28.38207438251727!2m3!1f0!2f0!3f0!3m2!1i1024!2i768!4f13.1!3m3!1m2!1s0x88dd87eea4bd91bd%3A0xe89a90df09b4a1f3!2s12685+Old+Plantation+Ln%2C+Orlando%2C+FL+32824%2C+Hoa+K%E1%BB%B3!5e0!3m2!1svi!2s!4v1553770432479\" width=\"600\" height=\"450\" frameborder=\"0\" style=\"border:0\" allowfullscreen></iframe>","WebsiteFacebook":"Facebook","WebsiteYoutube":"Youtube","WebsiteInstagram":"Instagram","WebsiteGoogle":"Google","WebsitePinterest":"Pinterest","WebsiteTwitter":"Twitter","WebsiteLicense":"Copyright © 2018 WebNails & DK Mobility LLC, All Rights Reserved"},"WebsiteConfig":{"CSS":"css","Javascript":"javascript"},"SystemConfig":{"PathDefault":"css","DateTime":"dd/MM/yyyy HH:mm:ss"}}},"__v":{"$numberInt":"0"}}
{"_id":{"$oid":"5c9c89c4e239db3c80ad8f5e"},"Key":"THEME_LOGO","Value":{"Name":"Logo","Slug":"THEME_LOGO","ThemeType":{"$numberInt":"0"},"Data":[{"Name":"Logo","Url":null,"Src":"/statics/resources/uploads/banners/1541130637-logo-07.png","Alt":null,"Sort":{"$numberInt":"0"},"ThemeType":{"$numberInt":"1"}},{"Name":"Favicon","Url":null,"Src":"/statics/resources/uploads/banners/favicon.png","Alt":null,"Sort":{"$numberInt":"0"},"ThemeType":{"$numberInt":"1"}}]},"__v":{"$numberInt":"0"}}
{"_id":{"$oid":"5c9d879214c6fd1cbc079ad4"},"Key":"THEME_ADS","Value":{"Name":"Banner quảng cáo","Slug":"THEME_ADS","ThemeType":{"$numberInt":"0"},"Data":[{"Name":"Ads side bar","Url":null,"Src":"/statics/resources/uploads/banners/1544689304-03d24269086aeb34b27b.jpg","Alt":null,"Sort":{"$numberInt":"0"},"ThemeType":{"$numberInt":"1"}}]},"__v":{"$numberInt":"0"}}
{"_id":{"$oid":"5c9d90b00d7ff70e00ae3e2e"},"Key":"THEME_FOOTER","Value":{"Name":"Footer","Slug":"THEME_FOOTER","ThemeType":{"$numberInt":"0"},"Data":[{"Name":"Giờ mở cửa","Value":"<p>Mon-Fri: 7:00 AM to 7:00 PM</p>\n\n<p>Saturday: 7:00 AM to 4:00 PM</p>\n\n<p>Sunday : CLOSED</p>\n","Url":null,"Sort":{"$numberInt":"0"},"TextType":{"$numberInt":"1"},"ThemeType":{"$numberInt":"2"}}]},"__v":{"$numberInt":"0"}}
{"_id":{"$oid":"5c9de62a741fc5434c7798fe"},"Key":"THEME_HEADER","Value":{"Name":"Header","Slug":"THEME_HEADER","ThemeType":{"$numberInt":"0"},"Data":[{"Name":"Giờ mở cửa","Slug":null,"ThemeType":{"$numberInt":"4"},"Sort":{"$numberInt":"0"},"Data":[{"Sort":{"$numberInt":"0"},"TextList":[{"Name":"Nội dung","Value":"MON – SAT: 7.00–18.00","Url":null,"Sort":{"$numberInt":"0"},"TextType":{"$numberInt":"0"},"ThemeType":{"$numberInt":"2"}}],"ImageList":[]},{"Sort":{"$numberInt":"1"},"TextList":[{"Name":"Nội dung","Value":"SUNDAY: CLOSED","Url":null,"Sort":{"$numberInt":"0"},"TextType":{"$numberInt":"0"},"ThemeType":{"$numberInt":"2"}}],"ImageList":[]}],"Template":{"ImageList":[],"TextList":[{"Name":"Nội dung","TextType":{"$numberInt":"0"}}]}}]},"__v":{"$numberInt":"0"}}