{"_id":{"$oid":"5c91f4d5d151e13dc428184f"},"Key":"THEME_HOME","Value":{"Name":"Trang chủ","Slug":"THEME_HOME","ThemeType":{"$numberInt":"0"},"Data":[{"Name":"Slider","Slug":null,"ThemeType":{"$numberInt":"0"},"Data":[{"Name":"Ds slide","Slug":null,"ThemeType":{"$numberInt":"3"},"Sort":{"$numberInt":"0"},"Data":[{"Name":null,"Url":null,"Src":"/statics/resources/uploads/banners/1542525147-royal-07-jpg-18.jpg","Alt":null,"Sort":{"$numberInt":"0"},"ThemeType":{"$numberInt":"1"},"IsChecked":false},{"Name":null,"Url":null,"Src":"/statics/resources/uploads/banners/1542769557-passion-18.jpg","Alt":null,"Sort":{"$numberInt":"1"},"ThemeType":{"$numberInt":"1"},"IsChecked":false},{"Name":null,"Url":null,"Src":"/statics/resources/uploads/banners/1542858743-untitled-22-20.jpg","Alt":null,"Sort":{"$numberInt":"2"},"ThemeType":{"$numberInt":"1"},"IsChecked":false}]}]},{"Name":"Testimonials","Slug":null,"ThemeType":{"$numberInt":"0"},"Data":[{"Name":"Hình đại diện","Url":null,"Src":"/statics/resources/uploads/banners/1554717011707img-index2.jpg","Alt":"TESTIMONIALS","Sort":{"$numberInt":"0"},"ThemeType":{"$numberInt":"1"}},{"Name":"Testimonials List","Slug":null,"ThemeType":{"$numberInt":"4"},"Sort":{"$numberInt":"0"},"Data":[{"Sort":{"$numberInt":"0"},"TextList":[{"Name":"Tên","Value":"Hannah Torres","Url":null,"Sort":{"$numberInt":"0"},"TextType":{"$numberInt":"0"},"ThemeType":{"$numberInt":"2"}},{"Name":"Chức vụ","Value":"CEO Spa Center","Url":null,"Sort":{"$numberInt":"0"},"TextType":{"$numberInt":"0"},"ThemeType":{"$numberInt":"2"}},{"Name":"Mô tả","Value":"<p>Their services and staff are super amazing</p>\n","Url":null,"Sort":{"$numberInt":"0"},"TextType":{"$numberInt":"1"},"ThemeType":{"$numberInt":"2"}}],"ImageList":[]},{"Sort":{"$numberInt":"1"},"TextList":[{"Name":"Tên","Value":"Ruby Nelson","Url":null,"Sort":{"$numberInt":"0"},"TextType":{"$numberInt":"0"},"ThemeType":{"$numberInt":"2"}},{"Name":"Chức vụ","Value":"CEO Spa Center","Url":null,"Sort":{"$numberInt":"0"},"TextType":{"$numberInt":"0"},"ThemeType":{"$numberInt":"2"}},{"Name":"Mô tả","Value":"<p>I love everything about this salon</p>\n","Url":null,"Sort":{"$numberInt":"0"},"TextType":{"$numberInt":"1"},"ThemeType":{"$numberInt":"2"}}],"ImageList":[]},{"Sort":{"$numberInt":"2"},"TextList":[{"Name":"Tên","Value":"Karen Smith","Url":null,"Sort":{"$numberInt":"0"},"TextType":{"$numberInt":"0"},"ThemeType":{"$numberInt":"2"}},{"Name":"Chức vụ","Value":"CEO Spa Center","Url":null,"Sort":{"$numberInt":"0"},"TextType":{"$numberInt":"0"},"ThemeType":{"$numberInt":"2"}},{"Name":"Mô tả","Value":"<p>The best salon in town</p>\n","Url":null,"Sort":{"$numberInt":"0"},"TextType":{"$numberInt":"1"},"ThemeType":{"$numberInt":"2"}}],"ImageList":[]}],"Template":{"ImageList":[],"TextList":[{"Name":"Tên","TextType":{"$numberInt":"0"}},{"Name":"Chức vụ","TextType":{"$numberInt":"0"}},{"Name":"Mô tả","TextType":{"$numberInt":"1"}}]}}]},{"Name":"About Us","Slug":null,"ThemeType":{"$numberInt":"0"},"Data":[{"Name":"Hình đại diện","Url":null,"Src":"/statics/resources/uploads/banners/1542290797-stylish-beauty-20.png","Alt":null,"Sort":{"$numberInt":"0"},"ThemeType":{"$numberInt":"1"}},{"Name":"Tiêu đề","Value":"  <h2 class=\"h0 m-bot-2\">Why Our Clients <br />\n                        <div class=\"decorate\"></div> Choose Us\n                    </h2>","Url":null,"Sort":{"$numberInt":"0"},"TextType":{"$numberInt":"0"},"ThemeType":{"$numberInt":"2"}},{"Name":"Mô tả","Value":"<p>Our salon aims to deliver the best nail design experience and top-notch customer service.</p>\n\n<p>We use all-natural, organic body products, hard-to-find polish brands and colors, iPads at every seat, and a drink menu featuring fresh-pressed juices and hand-crafted coffees.</p>\n","Url":null,"Sort":{"$numberInt":"0"},"TextType":{"$numberInt":"1"},"ThemeType":{"$numberInt":"2"}}]},{"Name":"Service","Slug":null,"ThemeType":{"$numberInt":"0"},"Data":[{"Name":"Hình đại diện","Url":null,"Src":"/statics/resources/uploads/banners/1540889377-servicebg.jpg","Alt":null,"Sort":{"$numberInt":"0"},"ThemeType":{"$numberInt":"1"}}]}]},"__v":{"$numberInt":"0"}}
{"_id":{"$oid":"5c9853b19b7f6e3ec45a7312"},"Key":"BOOKING_SETTING","Value":{"Key":"BOOKING_SETTING","DayOff":[{"element":"2019-10-01T17:00:00.000Z","IsChecked":false}],"DaySpecial":[{"Day":"2020-01-14T17:00:00.000Z","Open":"07:00","Close":"12:00","IsChecked":false}],"DayWork":[{"Day":"Monday","Open":"07:00","Close":"20:00","IsActive":true,"DayIndex":{"$numberInt":"1"}},{"Day":"Tuesday","Open":"07:00","Close":"20:00","IsActive":true,"DayIndex":{"$numberInt":"2"}},{"Day":"Wednesday","Open":"07:00","Close":"20:00","IsActive":true,"DayIndex":{"$numberInt":"3"}},{"Day":"Thursday","Open":"07:00","Close":"20:00","IsActive":true,"DayIndex":{"$numberInt":"4"}},{"Day":"Friday","Open":"07:00","Close":"20:00","IsActive":true,"DayIndex":{"$numberInt":"5"}},{"Day":"Saturday","Open":"07:00","Close":"20:00","IsActive":true,"DayIndex":{"$numberInt":"6"}},{"Day":"Sunday","Open":"07:00","Close":"20:00","IsActive":false,"DayIndex":{"$numberInt":"0"}}],"TimeBook":{"$numberInt":"20"}},"__v":{"$numberInt":"0"}}
{"_id":{"$oid":"5c9c8928c8d9074b90825d5e"},"Key":"SEO_SETTING","Value":{"Key":"SEO_SETTING","SeoAdvancedConfig":{"Robot":"rot","SiteMap":"sitemap"},"SeoBasicConfig":{"Title":"WebNails & DK Mobility","MetaTitle":"WebNails & DK Mobility","Keyword":"WebNails & DK Mobility","GoogleAnalytics":"UA-136823597-1","WebmasterTool":"UA-136823597-1"},"WebConfig":{"WebsiteINFO":{"WebsiteTitle":"WebNails & DK Mobility","WebsiteURL":"https://www.webnails.money/","WebsiteEmail":"info@dkmobility.com","WebsiteNotification":"webnails@gmail.com","WebsitePhone":"+1-888-264-2764","WebsiteAddress":"12685 Old Plantation Ln, Orlando, FL 32824","WebsiteGoogleMap":" <iframe src=\"https://www.google.com/maps/embed?pb=!1m18!1m12!1m3!1d3724.020016297093!2d105.8524770149327!3d21.031885085996713!2m3!1f0!2f0!3f0!3m2!1i1024!2i768!4f13.1!3m3!1m2!1s0x3135abc0462d982f%3A0x6ddde94c2316ef89!2zODUgTmd1eeG7hW4gSOG7r3UgSHXDom4sIEjDoG5nIELhuqFjLCBIb8OgbiBLaeG6v20sIEjDoCBO4buZaQ!5e0!3m2!1svi!2s!4v1533779347721\" width=\"600\" height=\"450\" frameborder=\"0\" style=\"border:0\" allowfullscreen class=\"section-body\"></iframe>","WebsiteFacebook":"Facebook","WebsiteYoutube":"Youtube","WebsiteInstagram":"Instagram","WebsiteGoogle":"Google","WebsitePinterest":"Pinterest","WebsiteTwitter":"Twitter","WebsiteLicense":"Copyright © 2018 WebNails & DK Mobility LLC, All Rights Reserved","Opening":"Open hours: 8.00-18.00 Mon-Frip"},"WebsiteConfig":{"CSS":"css","Javascript":"javascript"},"SystemConfig":{"PathDefault":"css","DateTime":"dd/MM/yyyy HH:mm:ss"}}},"__v":{"$numberInt":"0"}}
{"_id":{"$oid":"5c9c89c4e239db3c80ad8f5e"},"Key":"THEME_LOGO","Value":{"Name":"Logo","Slug":"THEME_LOGO","ThemeType":{"$numberInt":"0"},"Data":[{"Name":"Logo","Url":null,"Src":"/statics/resources/uploads/banners/1541132308-logo-04vvv-01.png","Alt":null,"Sort":{"$numberInt":"0"},"ThemeType":{"$numberInt":"1"}}]},"__v":{"$numberInt":"0"}}
{"_id":{"$oid":"5c9d879214c6fd1cbc079ad4"},"Key":"THEME_ADS","Value":{"Name":"Banner quảng cáo","Slug":"THEME_ADS","ThemeType":{"$numberInt":"0"},"Data":[{"Name":"Ads side bar","Url":null,"Src":"/statics/resources/uploads/banners/1544689304-03d24269086aeb34b27b.jpg","Alt":null,"Sort":{"$numberInt":"0"},"ThemeType":{"$numberInt":"1"}}]},"__v":{"$numberInt":"0"}}
{"_id":{"$oid":"5c9d90b00d7ff70e00ae3e2e"},"Key":"THEME_FOOTER","Value":{"Name":"Footer","Slug":"THEME_FOOTER","ThemeType":{"$numberInt":"0"},"Data":[{"Name":"Giờ mở cửa","Value":"<p>Mon-Fri: 7:00 AM to 7:00 PM</p>\n\n<p>Saturday: 7:00 AM to 4:00 PM</p>\n\n<p>Sunday : CLOSED</p>\n","Url":null,"Sort":{"$numberInt":"0"},"TextType":{"$numberInt":"1"},"ThemeType":{"$numberInt":"2"}}]},"__v":{"$numberInt":"0"}}
{"_id":{"$oid":"5c9de62a741fc5434c7798fe"},"Key":"THEME_HEADER","Value":{"Name":"Header","Slug":"THEME_HEADER","ThemeType":{"$numberInt":"0"},"Data":[{"Name":"Giờ mở cửa","Slug":null,"ThemeType":{"$numberInt":"4"},"Sort":{"$numberInt":"0"},"Data":[{"Sort":{"$numberInt":"0"},"TextList":[{"Name":"Nội dung","Value":"MON – SAT: 7.00–18.00","Url":null,"Sort":{"$numberInt":"0"},"TextType":{"$numberInt":"0"},"ThemeType":{"$numberInt":"2"}}],"ImageList":[]},{"Sort":{"$numberInt":"1"},"TextList":[{"Name":"Nội dung","Value":"SUNDAY: CLOSED","Url":null,"Sort":{"$numberInt":"0"},"TextType":{"$numberInt":"0"},"ThemeType":{"$numberInt":"2"}}],"ImageList":[]}],"Template":{"ImageList":[],"TextList":[{"Name":"Nội dung","TextType":{"$numberInt":"0"}}]}}]},"__v":{"$numberInt":"0"}}
