{"_id":{"$oid":"5c8875bbbb81182d0448d4cb"},"ParentId":null,"CategoryLevel":{"$numberInt":"0"},"Sort":{"$numberInt":"1"},"Url":"our-services","Name":"Our services","Description":"<p>Vampy Varnish was one of the first nail polish blogs on the Internet back in 2008. Kelly, the author of Vampy Varnish, doesn’t accept free samples, so her reviews are some of the most unbiased of any nail polish blog. She has since expanded her content to cover topics other than nail polish, such as jewelry.</p>\n","MetaTitle":"Our services","MetaDescription":"Vampy Varnish was one of the first nail polish blogs on the Internet back in 2008","MetaKeyword":"services","Avatar":"/statics/resources/uploads/banners/15529618881131539626778-bg-cat.jpg","__v":{"$numberInt":"0"}}
{"_id":{"$oid":"5c9054667cdcc81abc163ca4"},"ParentId":"5c8875bbbb81182d0448d4cb","CategoryLevel":{"$numberInt":"1"},"Sort":{"$numberInt":"1"},"Url":"eyelash-extensions","Name":"Eyelash extensions","Description":null,"MetaTitle":"Eyelash extensions","MetaDescription":null,"MetaKeyword":null,"Avatar":"/statics/resources/uploads/banners/1541778731-shutterstock_496314877.jpg","__v":{"$numberInt":"0"}}
{"_id":{"$oid":"5c9054837cdcc81abc163ca5"},"ParentId":"5c8875bbbb81182d0448d4cb","CategoryLevel":{"$numberInt":"1"},"Sort":{"$numberInt":"1"},"Url":"facial","Name":"Facial","Description":null,"MetaTitle":"Facial","MetaDescription":null,"MetaKeyword":null,"Avatar":"/statics/resources/uploads/banners/15529629799451541778782-shutterstock_615581297.jpg","__v":{"$numberInt":"0"}}
{"_id":{"$oid":"5c9054a57cdcc81abc163ca6"},"ParentId":"5c8875bbbb81182d0448d4cb","CategoryLevel":{"$numberInt":"1"},"Sort":{"$numberInt":"3"},"Url":"waxing","Name":"Waxing","Description":null,"MetaTitle":"Waxing","MetaDescription":null,"MetaKeyword":null,"Avatar":"/statics/resources/uploads/banners/15529629727841541778901-shutterstock_183164630.jpg","__v":{"$numberInt":"0"}}
{"_id":{"$oid":"5c9054c37cdcc81abc163ca7"},"ParentId":"5c8875bbbb81182d0448d4cb","CategoryLevel":{"$numberInt":"1"},"Sort":{"$numberInt":"2"},"Url":"manicure","Name":"Manicure","Description":null,"MetaTitle":"Manicure","MetaDescription":null,"MetaKeyword":null,"Avatar":"/statics/resources/uploads/banners/1542625374-lll.jpg","__v":{"$numberInt":"0"}}
{"_id":{"$oid":"5c90a3163e947c1738f93c92"},"ParentId":"5c8875bbbb81182d0448d4cb","CategoryLevel":{"$numberInt":"1"},"Sort":{"$numberInt":"0"},"Url":"pedicure","Name":"Pedicure","Description":null,"MetaTitle":"Pedicure","MetaDescription":null,"MetaKeyword":null,"Avatar":"/statics/resources/uploads/banners/1542625393-ll.jpg","__v":{"$numberInt":"0"}}
{"_id":{"$oid":"5c90a95e31277c0f289afb9b"},"ParentId":null,"CategoryLevel":{"$numberInt":"0"},"Sort":{"$numberInt":"2"},"Url":"add-on-services","Name":"Add on services","Description":null,"MetaTitle":"Add on services","MetaDescription":null,"MetaKeyword":null,"Avatar":"/statics/resources/uploads/banners/15529844111961539626778-bg-cat.jpg","__v":{"$numberInt":"0"}}
