{"_id":{"$oid":"5c88b1ca965459212c20af20"},"ListAlbum":[{"Src":"/statics/resources/uploads/banners/15530508874371542291220-royal-beauty-23.png","Sort":{"$numberInt":"0"},"IsChecked":false},{"Src":"/statics/resources/uploads/banners/1542291269-royal-beauty-24.png","Sort":{"$numberInt":"1"},"IsChecked":false},{"Src":"/statics/resources/uploads/banners/1542291304-royal-beauty-25.png","Sort":{"$numberInt":"2"},"IsChecked":false},{"Src":"/statics/resources/uploads/banners/15530508874511542291341-royal-beauty-26.png","Sort":{"$numberInt":"3"},"IsChecked":false},{"Src":"/statics/resources/uploads/banners/1542439013-1537957015gallery1.jpg","Sort":{"$numberInt":"4"},"IsChecked":false}],"Url":"gallery-1","Title":"Gallery 1","ShortDescription":"Need manicure inspiration? We know you want to be on top of every nail polish trend out there.","CategoryId":"5c73b818203fef46c09b1076","CategoryName":"Album cate 1","MetaTitle":"Gallery 1","MetaDescription":null,"MetaKeyword":null,"IsHtml":false,"PageContent":"<p><b>These revelations of nail salon workers will make you think more carefully and pay attention before the page Hoang set his nails and legs.</b></p>\n\n<p>Today, nail making seems to be so familiar to girls - like brushing teeth and combing hair. But nail work also has a secret block that you need to master to avoid trouble for yourself.</p>\n\n<h3>1. Tools - must be used separately</h3>\n\n<p><img alt=\"\" src=\"https://kenh14cdn.com/2018/5/13/nail1z-1526196894432844220260.jpg\" /></p>\n\n<p>Although never desirable, sometimes nail salon work at low-quality nail salons can make you infected.</p>\n\n<p>Because of sharing nail clippers and trimmers, this is said to be an intermediary that transmits hepatitis B, C or HIV virus or is simply a common fungus.</p>\n\n<p>To avoid infection, experts recommend that you purchase your own nail trimmer. Do not be afraid to bring this kit every time you do a nail, clean them carefully before and after use - after all, it is something you protect your health.</p>\n\n<h3>2. Remove calluses, exfoliate feet - don't!</h3>\n\n<p><img alt=\"\" src=\"https://kenh14cdn.com/2018/5/13/nail2z-15261968944361910029366.jpg\" /></p>\n\n<p>Experts recommend that even if there is a callus on the leg, it should not be removed at the nail salon.</p>\n\n<p>Especially if you own thin skin, the technician doesn't know it can accidentally scratch, creating the chance of wound infection. To avoid getting pinched, do not wear shoes that are too tight, and remember to apply moisturizer to your feet to keep your feet soft and smooth.</p>\n\n<h3>3. Ingrown toenails - don't be foolish but treat them at a nail salon</h3>\n\n<p><img alt=\"\" src=\"https://kenh14cdn.com/2018/5/13/nail3z-15261968944381158956986.jpg\" /></p>\n\n<p>MIngrown nails mainly occur in the toenails. The reason is often because we cut our toenails too often, cut deeply, cut incorrectly ...</p>\n\n<p>When cut close to the two sides of the nail, it will irritate the remaining nail, causing the nail to grow back inside, piercing deep into the flesh ... The treatment of ingrown nails requires a professional doctor, but \"artists\" in nail salons can make the situation even more serious.</p>\n\n<p>The wrong treatment of ingrown nails can make the foot become infected, severe and even remove the entire nail. So do not delay coming to the doctor when there are signs of swelling, nail swelling.</p>\n","Avatar":"/statics/resources/uploads/banners/1542291220-royal-beauty-23.png","CreatedDate":{"$date":{"$numberLong":"1552462282313"}},"EcsUserId":"111","UpdatedDate":{"$date":{"$numberLong":"1553826027715"}},"__v":{"$numberInt":"0"},"CategoryAvatar":"/statics/resources/uploads/banners/15530505267341539626778-bg-cat.jpg","CategoryUrl":"album-cate-1","EcsUserName":"Admin"}
{"_id":{"$oid":"5c91adac1d357e04d8249c99"},"ListAlbum":[{"Src":"/statics/resources/uploads/banners/15530510470761542291220-royal-beauty-23.png","Sort":{"$numberInt":"0"},"IsChecked":false},{"Src":"/statics/resources/uploads/banners/15530510470861542291269-royal-beauty-24.png","Sort":{"$numberInt":"1"},"IsChecked":false},{"Src":"/statics/resources/uploads/banners/15530510470941542291304-royal-beauty-25.png","Sort":{"$numberInt":"2"},"IsChecked":false},{"Src":"/statics/resources/uploads/banners/15530510470991542291341-royal-beauty-26.png","Sort":{"$numberInt":"3"},"IsChecked":false},{"Src":"/statics/resources/uploads/banners/15530510471011542439013-1537957015gallery1.jpg","Sort":{"$numberInt":"4"},"IsChecked":false}],"Url":"gallery-2","Title":"Gallery 2","ShortDescription":null,"CategoryId":"5c73b7c65817a655a80c1bf7","CategoryName":"Album cate 2","MetaTitle":"Gallery 2","MetaDescription":null,"MetaKeyword":null,"IsHtml":false,"PageContent":null,"Avatar":"/statics/resources/uploads/banners/15530510402341542291269-royal-beauty-24.png","CreatedDate":{"$date":{"$numberLong":"1553051052112"}},"EcsUserId":"111","UpdatedDate":{"$date":{"$numberLong":"1553826021152"}},"__v":{"$numberInt":"0"},"CategoryAvatar":"/statics/resources/uploads/banners/15530507271991539626778-bg-cat.jpg","CategoryUrl":"album-cate-2","EcsUserName":"Admin"}
{"_id":{"$oid":"5c91adb91d357e04d8249c9a"},"ListAlbum":[{"Src":"/statics/resources/uploads/banners/15530510632931542291220-royal-beauty-23.png","Sort":{"$numberInt":"0"},"IsChecked":false},{"Src":"/statics/resources/uploads/banners/15530510632991542291269-royal-beauty-24.png","Sort":{"$numberInt":"1"},"IsChecked":false},{"Src":"/statics/resources/uploads/banners/15530510633041542291304-royal-beauty-25.png","Sort":{"$numberInt":"2"},"IsChecked":false},{"Src":"/statics/resources/uploads/banners/15530510633071542291341-royal-beauty-26.png","Sort":{"$numberInt":"3"},"IsChecked":false},{"Src":"/statics/resources/uploads/banners/15530510633101542439013-1537957015gallery1.jpg","Sort":{"$numberInt":"4"},"IsChecked":false}],"Url":"gallery-3","Title":"Gallery 3","ShortDescription":null,"CategoryId":"5c73b85ed0a2485b980ce975","CategoryName":"Album cate 3","MetaTitle":"Gallery 3","MetaDescription":null,"MetaKeyword":null,"IsHtml":false,"PageContent":null,"Avatar":"/statics/resources/uploads/banners/15530510577741542291304-royal-beauty-25.png","CreatedDate":{"$date":{"$numberLong":"1553051065980"}},"EcsUserId":"111","UpdatedDate":{"$date":{"$numberLong":"1553826016095"}},"__v":{"$numberInt":"0"},"CategoryAvatar":"/statics/resources/uploads/banners/15530507741641539626778-bg-cat.jpg","CategoryUrl":"album-cate-3","EcsUserName":"Admin"}
{"_id":{"$oid":"5c91adc81d357e04d8249c9b"},"ListAlbum":[{"Src":"/statics/resources/uploads/banners/15530510782561542291220-royal-beauty-23.png","Sort":{"$numberInt":"0"},"IsChecked":false},{"Src":"/statics/resources/uploads/banners/15530510782631542291269-royal-beauty-24.png","Sort":{"$numberInt":"1"},"IsChecked":false},{"Src":"/statics/resources/uploads/banners/15530510782671542291304-royal-beauty-25.png","Sort":{"$numberInt":"2"},"IsChecked":false},{"Src":"/statics/resources/uploads/banners/15530510782721542291341-royal-beauty-26.png","Sort":{"$numberInt":"3"},"IsChecked":false},{"Src":"/statics/resources/uploads/banners/15530510782771542439013-1537957015gallery1.jpg","Sort":{"$numberInt":"4"},"IsChecked":false}],"Url":"gallery-4","Title":"Gallery 4","ShortDescription":null,"CategoryId":"5c73b818203fef46c09b1076","CategoryName":"Album cate 1","MetaTitle":"Gallery 4","MetaDescription":null,"MetaKeyword":null,"IsHtml":false,"PageContent":null,"Avatar":"/statics/resources/uploads/banners/15530510728131542291341-royal-beauty-26.png","CreatedDate":{"$date":{"$numberLong":"1553051080679"}},"EcsUserId":"111","UpdatedDate":{"$date":{"$numberLong":"1553826011119"}},"__v":{"$numberInt":"0"},"CategoryAvatar":"/statics/resources/uploads/banners/15530505267341539626778-bg-cat.jpg","CategoryUrl":"album-cate-1","EcsUserName":"Admin"}
{"_id":{"$oid":"5c91add61d357e04d8249c9c"},"ListAlbum":[{"Src":"/statics/resources/uploads/banners/15530510917601542291220-royal-beauty-23.png","Sort":{"$numberInt":"0"},"IsChecked":false},{"Src":"/statics/resources/uploads/banners/15530510917671542291269-royal-beauty-24.png","Sort":{"$numberInt":"1"},"IsChecked":false},{"Src":"/statics/resources/uploads/banners/15530510917721542291304-royal-beauty-25.png","Sort":{"$numberInt":"2"},"IsChecked":false},{"Src":"/statics/resources/uploads/banners/15530510917761542291341-royal-beauty-26.png","Sort":{"$numberInt":"3"},"IsChecked":false},{"Src":"/statics/resources/uploads/banners/15530510917811542439013-1537957015gallery1.jpg","Sort":{"$numberInt":"4"},"IsChecked":false}],"Url":"gallery-5","Title":"Gallery 5","ShortDescription":null,"CategoryId":"5c73b818203fef46c09b1076","CategoryName":"Album cate 1","MetaTitle":"Gallery 5","MetaDescription":null,"MetaKeyword":null,"IsHtml":false,"PageContent":null,"Avatar":"/statics/resources/uploads/banners/15530510884391542439013-1537957015gallery1.jpg","CreatedDate":{"$date":{"$numberLong":"1553051094370"}},"EcsUserId":"111","UpdatedDate":{"$date":{"$numberLong":"1553826006180"}},"__v":{"$numberInt":"0"},"CategoryAvatar":"/statics/resources/uploads/banners/15530505267341539626778-bg-cat.jpg","CategoryUrl":"album-cate-1","EcsUserName":"Admin"}
