{"_id":{"$oid":"5c89cca5c814282654763037"},"Url":"supermoon-lacquer-2019-bias-birthday-duo-sope","Title":"Supermoon Lacquer - 2019 Bias Birthday Duo & #SOPE ","ShortDescription":"Hiya guys! I am so freaking excited I feel like I am bouncing up and down even as I type this post up. I have such big news to share that I have been dying to tell, but it's been a rough few days since I caught a cold","CategoryId":"5c89c9efb738c83a240c5a81","CategoryName":"Beauty","MetaTitle":"Supermoon Lacquer - 2019 Bias Birthday Duo & #SOPE ","MetaDescription":"Hiya guys! I am so freaking excited I feel like I am bouncing up and down even as I type this post up","MetaKeyword":"supermoon","IsHtml":false,"PageContent":"<p>Hiya guys! I am so freaking excited I feel like I am bouncing up and down even as I type this post up. I have such big news to share that I have been dying to tell, but it's been a rough few days since I caught a cold. But not even that can dull my shine as not only did I get BTS tickets for the upcoming concerts for both days, but I managed to snag floor seats near the stage. Like how is this real life? I probably spent over an hour full-on ugly crying especially since the first concert date includes soundcheck. Words cannot describe how much this all means to me. The concerts are in mid-May and I have the perfect polish to wear for the occasion. Or actually the perfect ten polishes to choose from, haha. For today I'm sharing swatches for the&nbsp;<strong>2019 Bias Birthday Duo &amp; #SOPE</strong>&nbsp;by&nbsp;<span style=\"color:#EE82EE;\">Supermoon Lacquer</span>, which are part of a bunch of new BTS related releases. Tomorrow I will be sharing a mega-post that includes the full Wings collection based on the namesake era for BTS. So much pretty and it's all limited time, let's not waste any more time and get right into the swatches!</p>\n\n<p><img alt=\"\" src=\"https://3.bp.blogspot.com/-1Dv1OHHebvE/XH_0zoQ6aNI/AAAAAAABDq8/p5jeN0ih-4scgyh9dE4ACpwnqGyYKM2CQCLcBGAs/s640/collage-4.jpg\" /></p>\n\n<p>The&nbsp;<strong>2019 Bias Birthday Duo &amp; #SOPE</strong>&nbsp;by&nbsp;<span style=\"color:#EE82EE;\">Supermoon Lacquer</span>&nbsp;will be available for pre-order Thursday, March 7th @ 6:00pm CST through Friday, March 15th @ 11:59pm CST. Each full-size 12mL shade in the duo will retail for $11 or you can pick up both in the duo for $21. #SOPE will also retail for $11. There is also a New Release Bundle available that includes the entire Wings collection, #SOPE, and the Bias Birthday Duo for $99.</p>\n\n<p style=\"text-align: center;\"><strong>Supermoon Lacquer - #SOPE</strong></p>\n\n<p><img alt=\"\" src=\"https://1.bp.blogspot.com/-S3nF1U5lL9w/XH_04XjRrRI/AAAAAAABDrg/g4AFBgAk3WwQ3CwV5zfKh-uNvUUuAl4-wCLcBGAs/s640/sml-sope.jpg\" /></p>\n\n<p><strong>#SOPE</strong> can be described as a red-violet based purple-to-red multichrome filled with matching color shifting aurora pigment, violet-to-gold color shifting shimmer, violet sparks, and purple pearl microflakies. We're kicking off this review with the LE shade in this collection. My photos could not begin to do the color shifting any justice whatsoever and I can feel the shame. The colors shift effortlessly under direct sunlight and the depth created by the shimmer comes to life. And there is certainly SO much depth and dimension to the base. Absolutely gorgeous. The tone of the purple is also right up my alley, very rich and heavily pigmented. The color brings out some warmth from my skin-tone, but it's not enough to be overwhelming.</p>\n\n<p>Dedicated to Emily Kelly-Hollier as a small way of saying 'thanks' for taking Mardi to see BTS's Love Yourself Tour on September 15th, 2018. Her bias is Hoseok (or Hobi) and Mardi's Yoongi (she's the Hobi to Mardi's Yoongi and vice versa) and their sub-unit/ship/pairing name is SOPE - Suga (Yoongi's stage name) + J-Hope (Hobi's stage name).</p>\n\n<p>The formula has a really good opacity, but not quite to be considered a one coater. It self-levels well and I didn't have any issues layering the coats. Consistency wise it's well balanced throughout, not too thick or too thin. There are very minimal brush strokes in the finish but they end up blending out completely out as the polish dries. It dries down to a smooth high-shine finish on its own, but I did use a topcoat to top it off. I'd like to note that I didn't experience any staining on removal to my cuticles or nail beds. Shown in two coats and sealed with a glossy topcoat.</p>\n\n<p><img alt=\"\" src=\"https://3.bp.blogspot.com/-b5eCXvzNU4E/XH_036x3pjI/AAAAAAABDrc/6gfg0ljj2roPBNmL5CQmRlHoTF2WDtw1wCLcBGAs/s640/sml-sope-macro.JPG\" /></p>\n\n<p><img alt=\"\" src=\"https://1.bp.blogspot.com/-MMuvWZeBmao/XH_03dtGCFI/AAAAAAABDrY/iFMIlKMNZggs7zg7D-vTnp50BYGgQ9WggCLcBGAs/s640/sml-sope-2.jpg\" /></p>\n\n<p style=\"text-align: center;\"><strong>Supermoon Lacquer - Never Mind</strong></p>\n\n<p><img alt=\"\" src=\"https://2.bp.blogspot.com/-qC_-5bxbdSg/XH_01iAszkI/AAAAAAABDrE/9wfvdJsHrP4qJgd4Ro1ntGBQWAWKVikKwCLcBGAs/s640/sml-nevermind.jpg\" /></p>\n\n<p><strong>Never Mind</strong> can be described as a holographic pale mint base filled with green-to-blue multichrome pigment, teal-to-aqua color shifting aurora pigment, green-to-blue color shifting shimmer, turquoise shimmer, green sparks, and iridescent teal/blue microglitter. The tone of this shade is everything and color wise it's probably one of my favorites of all time. It hits a very unique tone of mint that not only nails the inspiration, but feels perfect for Spring time. The shimmer comes across as very subtle in photos, but it's slightly more noticeable in person. I also wasn't expecting the color to look as good as it does against my skin-tone. It brings out some warmth, but not enough to cause any clashing against the color.</p>\n\n<p>Inspired by Yoongi's iconic mint colored hair that he sported in the music video for Run, the title track from BTS's 2015 EP The Most Beautiful Moment in Life, Pt. 2, as well as the promotions and live performances during that era. 'Never Mind' is named after he first song on the album titled Intro: Never Mind, in which Yoongi is prominently featured. The song with English translation can be watched/listened to here and a live performance can be watched/listened to here.</p>\n\n<p>The formula has a bit of a sheer application that builds-up well for full coverage. If you do thicker coats you can get away with fewer coats, but it tends to pull as it layers messing with the self leveling. The consistency leans a little on the thick side, but it's manageable and didn't cause any trouble during the application. It dries down to a gritty finish that smooths out perfectly after topcoat. I didn't experience any staining on removal to either my cuticles or nail beds. Shown in two to three coats and sealed with a glossy topcoat.</p>\n\n<p><img alt=\"\" src=\"https://1.bp.blogspot.com/-mdJ8jGa6O0A/XH_01qY4x-I/AAAAAAABDrI/iTJqGCsMh2wSFYpzZMMSst9n-9V_CZLgwCLcBGAs/s640/sml-nevermind-macro.JPG\" /></p>\n\n<p><img alt=\"\" src=\"https://1.bp.blogspot.com/-UqbOm2afX90/XH_01qBCRKI/AAAAAAABDrA/sQ4dKdYYB0MxQolGRxqEe8zKf4nOQoJ8QCLcBGAs/s640/sml-nevermind-2.jpg\" /></p>\n\n<p style=\"text-align: center;\">Supermoon Lacquer - Seesaw</p>\n\n<p><img alt=\"\" src=\"https://1.bp.blogspot.com/-V8An46mFlI8/XH_02-iCwVI/AAAAAAABDrU/FMLBi75g_Rgf588xEeEmcXUDxY4tGmNYACLcBGAs/s640/sml-seesaw.jpg\" /></p>\n\n<p><strong>Seesaw</strong> can be described as a holographic wine-red base filled with red/bronze/copper multichrome pigment, red-to-gold color shifting aurora pigment, red-to-yellow color shifting shimmer, red sparks, rose pearl microflakies, and red holographic and metallic microglitter. You guys know if there is anything I love more than life itself it's a good red polish. And this right here happens to be a really great one! It's again another very rich base and the holographic frame is so strong. Especially once sunlight manages to hit the base, it simply comes to life! The color - as most reds do - looks great against my skin-tone and gives me a perfect glow. Definitely one my favorites among this release and has my stamp of must-have.</p>\n\n<p>Inspired by the outfit Yoongi wears for his performance of Seesaw, his solo track from BTS's 2018 album Love Yourself: Answer, during their 2018 - 2019 Love Yourself World Tour. The song with English translation can be watched/listened to here and a live performance, in which he's wearing said outfit, can be watched/listened to here.</p>\n\n<p>The formula has a very opaque application and can be considered a one coater. I personally always like adding a second thin coat just to add more sparkle and holo flair. But if you do a thick enough coat it's definitely not needed. As I mentioned before, the holographic finish is very strong and even more so under sunlight. Consistency wise it's well balanced and doesn't lean neither thick or thin. It dries down to a smooth high-shine finish on it's own, but I did top it off with topcoat as well. I did experience some minor staining to my cuticles on removal, but none to my actual nail beds. Shown in two coats and sealed with a glossy topcoat.</p>\n\n<p><img alt=\"\" src=\"https://1.bp.blogspot.com/-JEho3aLxKaQ/XH_02g1jvjI/AAAAAAABDrQ/ZNCeNddCcAoXWCl_o7ypGWjmfJLVaTqhQCLcBGAs/s640/sml-seesaw-macro.JPG\" /></p>\n\n<p><img alt=\"\" src=\"https://2.bp.blogspot.com/-s70FgMxPW9Y/XH_02oaR1OI/AAAAAAABDrM/jST2TOolues1sYrWpL7qhW8vIKlgR2fJwCLcBGAs/s640/sml-seesaw-2.jpg\" /></p>\n\n<p>To recap, the&nbsp;<strong>2019 Bias Birthday Duo &amp; #SOPE</strong>&nbsp;by&nbsp;Supermoon Lacquer&nbsp;will be available for pre-order Thursday, March 7th @ 6:00pm CST through Friday, March 15th @ 11:59pm CST. Each full-size 12mL shade in the duo will retail for $11 or you can pick up both in the duo for $21. #SOPE will also retail for $11. There is also a New Release Bundle available that includes the entire Wings collection, #SOPE, and the Bias Birthday Duo for $99.</p>\n","Avatar":"/statics/resources/uploads/banners/collage-4.jpg","CreatedDate":{"$date":{"$numberLong":"1552534693937"}},"EcsUserId":null,"UpdatedDate":{"$date":{"$numberLong":"1553825995729"}},"__v":{"$numberInt":"0"},"LikeCount":{"$numberInt":"0"},"CategoryAvatar":"/statics/resources/uploads/banners/15525339774911539626778-bg-cat.jpg","CategoryUrl":"beauty","EcsUserName":"Admin"}
{"_id":{"$oid":"5c89cd55b789a03b8cdec6d6"},"Url":"supermoon-lacquer-polish-pick-up-march-2018","Title":"Supermoon Lacquer - Polish Pick Up March 2018","ShortDescription":"Hiya guys! Can you believe it's almost the end of the month? Like I know February is a short one, but time has seriously just flown by for me.","CategoryId":"5c89c9efb738c83a240c5a81","CategoryName":"Beauty","MetaTitle":"Supermoon Lacquer - Polish Pick Up March 2018","MetaDescription":"Hiya guys! Can you believe it's almost the end of the month? Like I know February is a short one, but time has seriously just flown by for me","MetaKeyword":"nail","IsHtml":false,"PageContent":"<p>Hiya guys! Can you believe it's almost the end of the month? Like I know February is a short one, but time has seriously just flown by for me. And I don't like it one bit! And to make things just a little bit worse... I caught a cold from my boyfriend. Again. The light at the end of the tunnel is that this Friday tickets for BTS will go on sale and hopefully I will be able to score some. Fingers crossed. Also happening this Friday....&nbsp;<strong>Polish Pick Up!</strong>&nbsp;Even though I have not been blogging a whole lot for the last few months I have by no means stopped buying polish. If nothing else I think that PPU is the one time a month I allow my wallet to be wrecked. For today I'm sharing swatches for&nbsp;<strong>Love Yourself</strong>&nbsp;by&nbsp;Supermoon Lacquer,&nbsp;which is the March contribution to the&nbsp;Polish Pickup&nbsp;Collaboration. I cannot begin to tell you how excited I am that Mardi decided to create this shade as the inspiration is near and dear to my heart. More on that in a bit, first let's take a look at the swatches!</p>\n","Avatar":"/statics/resources/uploads/banners/collage.jpg","CreatedDate":{"$date":{"$numberLong":"1552534869308"}},"EcsUserId":null,"UpdatedDate":{"$date":{"$numberLong":"1553825989669"}},"__v":{"$numberInt":"0"},"LikeCount":{"$numberInt":"0"},"CategoryAvatar":"/statics/resources/uploads/banners/15525339774911539626778-bg-cat.jpg","CategoryUrl":"beauty","EcsUserName":"Admin"}
{"_id":{"$oid":"5c8b28352a93e1366c511b34"},"Url":"madam-glam-thunder-gel-polish","Title":"Madam Glam Thunder Gel Polish","ShortDescription":null,"CategoryId":"5c89c9efb738c83a240c5a81","CategoryName":"Beauty","MetaTitle":"Madam Glam Thunder Gel Polish","MetaDescription":null,"MetaKeyword":null,"IsHtml":false,"PageContent":null,"Avatar":"/statics/resources/uploads/banners/madam-glam-thunder-gel-polish.jpg","CreatedDate":{"$date":{"$numberLong":"1552623669511"}},"EcsUserId":null,"UpdatedDate":{"$date":{"$numberLong":"1553825984245"}},"__v":{"$numberInt":"0"},"CategoryAvatar":"/statics/resources/uploads/banners/15525339774911539626778-bg-cat.jpg","CategoryUrl":"beauty","EcsUserName":"Admin","LikeCount":{"$numberInt":"0"}}
{"_id":{"$oid":"5c8b28502a93e1366c511b35"},"Url":"poison-apple-nail-art","Title":"Poison Apple Nail Art","ShortDescription":null,"CategoryId":"5c89c9efb738c83a240c5a81","CategoryName":"Beauty","MetaTitle":"Poison Apple Nail Art","MetaDescription":null,"MetaKeyword":null,"IsHtml":false,"PageContent":null,"Avatar":"/statics/resources/uploads/banners/poison-apple-nail-art.jpg","CreatedDate":{"$date":{"$numberLong":"1552623696434"}},"EcsUserId":null,"UpdatedDate":{"$date":{"$numberLong":"1553825978754"}},"__v":{"$numberInt":"0"},"CategoryAvatar":"/statics/resources/uploads/banners/15525339774911539626778-bg-cat.jpg","CategoryUrl":"beauty","EcsUserName":"Admin","LikeCount":{"$numberInt":"0"}}
{"_id":{"$oid":"5c8b28652a93e1366c511b36"},"Url":"moon-and-stars-nail-art","Title":"Moon and Stars Nail Art","ShortDescription":null,"CategoryId":"5c89c9efb738c83a240c5a81","CategoryName":"Beauty","MetaTitle":"Moon and Stars Nail Art","MetaDescription":null,"MetaKeyword":null,"IsHtml":false,"PageContent":null,"Avatar":"/statics/resources/uploads/banners/moon-and-stars-nail-art.jpg","CreatedDate":{"$date":{"$numberLong":"1552623717971"}},"EcsUserId":null,"UpdatedDate":{"$date":{"$numberLong":"1553825973239"}},"__v":{"$numberInt":"0"},"CategoryAvatar":"/statics/resources/uploads/banners/15525339774911539626778-bg-cat.jpg","CategoryUrl":"beauty","EcsUserName":"Admin","LikeCount":{"$numberInt":"0"}}
{"_id":{"$oid":"5c8b287b2a93e1366c511b37"},"Url":"rwby-inspired-nail-art","Title":"RWBY Inspired Nail Art","ShortDescription":null,"CategoryId":"5c89c9efb738c83a240c5a81","CategoryName":"Beauty","MetaTitle":"RWBY Inspired Nail Art","MetaDescription":null,"MetaKeyword":null,"IsHtml":false,"PageContent":null,"Avatar":"/statics/resources/uploads/banners/rwby-inspired-nail-art.jpg","CreatedDate":{"$date":{"$numberLong":"1552623739220"}},"EcsUserId":null,"UpdatedDate":{"$date":{"$numberLong":"1553825968029"}},"__v":{"$numberInt":"0"},"CategoryAvatar":"/statics/resources/uploads/banners/15525339774911539626778-bg-cat.jpg","CategoryUrl":"beauty","EcsUserName":"Admin","LikeCount":{"$numberInt":"0"}}
{"_id":{"$oid":"5c8b28932a93e1366c511b38"},"Url":"kiara-sky-gel-polish-review","Title":"Kiara Sky Gel Polish Review","ShortDescription":null,"CategoryId":"5c89c9efb738c83a240c5a81","CategoryName":"Beauty","MetaTitle":"Kiara Sky Gel Polish Review","MetaDescription":null,"MetaKeyword":null,"IsHtml":false,"PageContent":null,"Avatar":"/statics/resources/uploads/banners/kiara-sky-gel-polish-1.jpg","CreatedDate":{"$date":{"$numberLong":"1552623763963"}},"EcsUserId":null,"UpdatedDate":{"$date":{"$numberLong":"1553825960168"}},"__v":{"$numberInt":"0"},"CategoryAvatar":"/statics/resources/uploads/banners/15525339774911539626778-bg-cat.jpg","CategoryUrl":"beauty","EcsUserName":"Admin","LikeCount":{"$numberInt":"0"}}
{"_id":{"$oid":"5c8b28a92a93e1366c511b39"},"Url":"beautybigbang-aurora-chameleon-holo-flake-review","Title":"BeautyBigBang Aurora Chameleon Holo Flake Review","ShortDescription":null,"CategoryId":"5c89c9efb738c83a240c5a81","CategoryName":"Beauty","MetaTitle":"BeautyBigBang Aurora Chameleon Holo Flake Review","MetaDescription":null,"MetaKeyword":null,"IsHtml":false,"PageContent":null,"Avatar":"/statics/resources/uploads/banners/beautybigbang-aurora-holo-flakes.jpg","CreatedDate":{"$date":{"$numberLong":"1552623785610"}},"EcsUserId":null,"UpdatedDate":{"$date":{"$numberLong":"1553825954472"}},"__v":{"$numberInt":"0"},"CategoryAvatar":"/statics/resources/uploads/banners/15525339774911539626778-bg-cat.jpg","CategoryUrl":"beauty","EcsUserName":"Admin","LikeCount":{"$numberInt":"0"}}
{"_id":{"$oid":"5c8b28e02a93e1366c511b3a"},"Url":"hamster-nail-art","Title":"Hamster Nail Art","ShortDescription":null,"CategoryId":"5c89c9efb738c83a240c5a81","CategoryName":"Beauty","MetaTitle":"Hamster Nail Art","MetaDescription":null,"MetaKeyword":null,"IsHtml":false,"PageContent":null,"Avatar":"/statics/resources/uploads/banners/hamster-nail-art.jpg","CreatedDate":{"$date":{"$numberLong":"1552623840599"}},"EcsUserId":null,"UpdatedDate":{"$date":{"$numberLong":"1553825949047"}},"__v":{"$numberInt":"0"},"CategoryAvatar":"/statics/resources/uploads/banners/15525339774911539626778-bg-cat.jpg","CategoryUrl":"beauty","EcsUserName":"Admin","LikeCount":{"$numberInt":"0"}}
{"_id":{"$oid":"5c8b29312a93e1366c511b3b"},"Url":"opi-lisbon-collection","Title":"OPI Lisbon Collection","ShortDescription":null,"CategoryId":"5c89c9efb738c83a240c5a81","CategoryName":"Beauty","MetaTitle":"OPI Lisbon Collection","MetaDescription":null,"MetaKeyword":null,"IsHtml":false,"PageContent":null,"Avatar":"/statics/resources/uploads/banners/opi-lisbon-collection-swatch.jpg","CreatedDate":{"$date":{"$numberLong":"1552623921812"}},"EcsUserId":null,"UpdatedDate":{"$date":{"$numberLong":"1553825938664"}},"__v":{"$numberInt":"0"},"CategoryAvatar":"/statics/resources/uploads/banners/15525339774911539626778-bg-cat.jpg","CategoryUrl":"beauty","EcsUserName":"Admin","LikeCount":{"$numberInt":"0"}}
{"_id":{"$oid":"5c8b29472a93e1366c511b3c"},"Url":"kiara-sky-ice-cream-parlour-collection","Title":"Kiara Sky Ice Cream Parlour Collection","ShortDescription":null,"CategoryId":"5c89c8bd3c439c3decb6976e","CategoryName":"Lifestyle","MetaTitle":"Kiara Sky Ice Cream Parlour Collection","MetaDescription":null,"MetaKeyword":null,"IsHtml":false,"PageContent":null,"Avatar":"/statics/resources/uploads/banners/kiara-sky-ice-cream-parlour-collection.jpg","CreatedDate":{"$date":{"$numberLong":"1552623943704"}},"EcsUserId":null,"UpdatedDate":{"$date":{"$numberLong":"1553825934066"}},"__v":{"$numberInt":"0"},"LikeCount":{"$numberInt":"0"},"CategoryAvatar":"/statics/resources/uploads/banners/1539626778-bg-cat.jpg","CategoryUrl":"lifestyle","EcsUserName":"Admin"}
