{"_id":{"$oid":"5c73b7c65817a655a80c1bf7"},"Sort":{"$numberInt":"2"},"Url":"album-cate-2","Name":"Album cate 2","Description":null,"ParentId":null,"MetaTitle":"Album cate 2","MetaDescription":null,"MetaKeyword":null,"CategoryLevel":null,"Avatar":"/statics/resources/uploads/banners/15530507271991539626778-bg-cat.jpg","__v":{"$numberInt":"0"}}
{"_id":{"$oid":"5c73b818203fef46c09b1076"},"Sort":{"$numberInt":"1"},"Url":"album-cate-1","Name":"Album cate 1","Description":"<p>Need manicure inspiration? We know you want to be on top of every nail polish trend out there, so we will help you follow the best blogs on the niche, and never miss out a hot trend. We gathered these top nail polish blogs to help you draw inspiration and find nail art stylish and unique ideas to surprise your friends!</p>\n","ParentId":null,"MetaTitle":"Album cate 1","MetaDescription":"Need manicure inspiration? We know you want to be on top of every nail polish trend out there","MetaKeyword":"gallery","CategoryLevel":null,"Avatar":"/statics/resources/uploads/banners/15530505267341539626778-bg-cat.jpg","__v":{"$numberInt":"0"}}
{"_id":{"$oid":"5c73b85ed0a2485b980ce975"},"Url":"album-cate-3","Name":"Album cate 3","Description":null,"ParentId":null,"MetaTitle":"Album cate 3","MetaDescription":null,"MetaKeyword":null,"CategoryLevel":null,"Avatar":"/statics/resources/uploads/banners/15530507741641539626778-bg-cat.jpg","Sort":{"$numberInt":"3"},"__v":{"$numberInt":"0"}}
{"_id":{"$oid":"5c91b255a199d734f0dce049"},"Sort":{"$numberInt":"9999"},"Url":"all-gallery","Name":"Album cate 4","Description":null,"ParentId":null,"MetaTitle":"Album cate 4","MetaDescription":null,"MetaKeyword":null,"CategoryLevel":null,"Avatar":"/statics/resources/uploads/banners/15530522426331539626778-bg-cat.jpg","__v":{"$numberInt":"0"}}
