{"_id":{"$oid":"5c9bb024b161aa4688adca57"},"ParentId":null,"CategoryLevel":{"$numberInt":"0"},"Sort":{"$numberInt":"0"},"Url":null,"UrlAuto":null,"Name":"Menu Header","Position":"Menu Left","Avatar":null,"__v":{"$numberInt":"0"}}
{"_id":{"$oid":"5c9c3077de091b25546b088b"},"ParentId":"5c9bb024b161aa4688adca57","CategoryLevel":{"$numberInt":"1"},"Sort":{"$numberInt":"3"},"Url":"/service-category/our-services","UrlAuto":"our-services","Name":"Service","Position":null,"Avatar":null,"__v":{"$numberInt":"0"},"Key":"service"}
{"_id":{"$oid":"5c9c3089de091b25546b088c"},"ParentId":"5c9bb024b161aa4688adca57","CategoryLevel":{"$numberInt":"1"},"Sort":{"$numberInt":"2"},"Url":"/booking","UrlAuto":"booking","Name":"Booking","Position":null,"Avatar":null,"__v":{"$numberInt":"0"},"Key":"booking"}
{"_id":{"$oid":"5c9c309cde091b25546b088d"},"ParentId":"5c9bb024b161aa4688adca57","CategoryLevel":{"$numberInt":"1"},"Sort":{"$numberInt":"4"},"Url":"/gallery-category","UrlAuto":"gallery-category","Name":"Gallery","Position":null,"Avatar":null,"__v":{"$numberInt":"0"},"Key":"gallery"}
{"_id":{"$oid":"5cab1c6c8723684ff40a050d"},"ParentId":null,"CategoryLevel":{"$numberInt":"0"},"Sort":{"$numberInt":"0"},"Url":null,"UrlAuto":null,"Name":"Menu Header","Position":"Menu Right","Avatar":null,"Key":"menu-header","__v":{"$numberInt":"0"}}
{"_id":{"$oid":"5cab1ca18723684ff40a050e"},"ParentId":"5cab1c6c8723684ff40a050d","CategoryLevel":{"$numberInt":"1"},"Sort":{"$numberInt":"0"},"Url":null,"UrlAuto":null,"Name":"Gift cards","Position":null,"Avatar":null,"Key":"gift-cards","__v":{"$numberInt":"0"}}
{"_id":{"$oid":"5cab1cc68723684ff40a050f"},"ParentId":"5cab1c6c8723684ff40a050d","CategoryLevel":{"$numberInt":"1"},"Sort":{"$numberInt":"0"},"Url":"/blog","UrlAuto":null,"Name":"Blogs","Position":null,"Avatar":null,"Key":"blogs","__v":{"$numberInt":"0"}}
{"_id":{"$oid":"5cab1ce38723684ff40a0510"},"ParentId":"5cab1c6c8723684ff40a050d","CategoryLevel":{"$numberInt":"1"},"Sort":{"$numberInt":"0"},"Url":"/contact-us","UrlAuto":null,"Name":"Contact us","Position":null,"Avatar":null,"Key":"contact-us","__v":{"$numberInt":"0"}}
{"_id":{"$oid":"5cab1e869205c33284d8d4ee"},"ParentId":null,"CategoryLevel":{"$numberInt":"0"},"Sort":{"$numberInt":"0"},"Url":null,"UrlAuto":null,"Name":"Menu Header","Position":"Menu Header","Avatar":null,"Key":"menu-header","__v":{"$numberInt":"0"}}
{"_id":{"$oid":"5cab1ebd9f00b22e64df0acb"},"ParentId":"5cab1e869205c33284d8d4ee","CategoryLevel":{"$numberInt":"1"},"Sort":{"$numberInt":"0"},"Url":"/service","UrlAuto":null,"Name":"Service","Position":null,"Avatar":null,"Key":"service","__v":{"$numberInt":"0"}}
{"_id":{"$oid":"5cab1ec79f00b22e64df0acc"},"ParentId":"5cab1e869205c33284d8d4ee","CategoryLevel":{"$numberInt":"1"},"Sort":{"$numberInt":"0"},"Url":"/booking","UrlAuto":null,"Name":"Booking","Position":null,"Avatar":null,"Key":"booking","__v":{"$numberInt":"0"}}
{"_id":{"$oid":"5cab1ed69f00b22e64df0acd"},"ParentId":"5cab1e869205c33284d8d4ee","CategoryLevel":{"$numberInt":"1"},"Sort":{"$numberInt":"0"},"Url":"/galleries","UrlAuto":null,"Name":"Gallery","Position":null,"Avatar":null,"Key":"gallery","__v":{"$numberInt":"0"}}
{"_id":{"$oid":"5cab1f209f00b22e64df0ace"},"ParentId":"5cab1e869205c33284d8d4ee","CategoryLevel":{"$numberInt":"1"},"Sort":{"$numberInt":"0"},"Url":"/","UrlAuto":null,"Name":"Home","Position":null,"Avatar":null,"Key":"home","__v":{"$numberInt":"0"}}
{"_id":{"$oid":"5cab1fd1a13a3b1c74802e5a"},"ParentId":"5cab1e869205c33284d8d4ee","CategoryLevel":{"$numberInt":"1"},"Sort":{"$numberInt":"0"},"Url":"/blog","UrlAuto":null,"Name":"Blogs","Position":null,"Avatar":null,"Key":"blogs","__v":{"$numberInt":"0"}}
{"_id":{"$oid":"5cab1feea13a3b1c74802e5b"},"ParentId":"5cab1e869205c33284d8d4ee","CategoryLevel":{"$numberInt":"1"},"Sort":{"$numberInt":"0"},"Url":"/contact-us","UrlAuto":null,"Name":"Contact us","Position":null,"Avatar":null,"Key":"contact-us","__v":{"$numberInt":"0"}}
{"_id":{"$oid":"5cad74312df93e314ca49bbe"},"ParentId":null,"CategoryLevel":{"$numberInt":"0"},"Sort":{"$numberInt":"0"},"Url":null,"UrlAuto":null,"Name":"Menu Footer","Position":"Menu Footer","Avatar":null,"Key":"menu-footer","__v":{"$numberInt":"0"}}
{"_id":{"$oid":"5cad744d2df93e314ca49bbf"},"ParentId":"5cad74312df93e314ca49bbe","CategoryLevel":{"$numberInt":"1"},"Sort":{"$numberInt":"0"},"Url":null,"UrlAuto":null,"Name":"About","Position":null,"Avatar":null,"Key":"about","__v":{"$numberInt":"0"}}
{"_id":{"$oid":"5cad74572df93e314ca49bc0"},"ParentId":"5cad74312df93e314ca49bbe","CategoryLevel":{"$numberInt":"1"},"Sort":{"$numberInt":"0"},"Url":null,"UrlAuto":null,"Name":"Terms & Conditions","Position":null,"Avatar":null,"Key":"terms-conditions","__v":{"$numberInt":"0"}}
{"_id":{"$oid":"5cad74612df93e314ca49bc1"},"ParentId":"5cad74312df93e314ca49bbe","CategoryLevel":{"$numberInt":"1"},"Sort":{"$numberInt":"0"},"Url":null,"UrlAuto":null,"Name":"Privacy Policy","Position":null,"Avatar":null,"Key":"privacy-policy","__v":{"$numberInt":"0"}}
{"_id":{"$oid":"5cad746a2df93e314ca49bc2"},"ParentId":"5cad74312df93e314ca49bbe","CategoryLevel":{"$numberInt":"1"},"Sort":{"$numberInt":"0"},"Url":null,"UrlAuto":null,"Name":"Contact","Position":null,"Avatar":null,"Key":"contact","__v":{"$numberInt":"0"}}
