<svg width="20" height="20" viewBox="0 0 20 20" fill="none" xmlns="http://www.w3.org/2000/svg">
<path d="M15.0259 13.8475L18.5951 17.4158L17.4159 18.595L13.8476 15.0258C12.5199 16.0902 10.8684 16.6691 9.16675 16.6667C5.02675 16.6667 1.66675 13.3067 1.66675 9.16666C1.66675 5.02666 5.02675 1.66666 9.16675 1.66666C13.3067 1.66666 16.6667 5.02666 16.6667 9.16666C16.6692 10.8683 16.0903 12.5198 15.0259 13.8475ZM13.3542 13.2292C14.4118 12.1416 15.0025 10.6837 15.0001 9.16666C15.0001 5.94332 12.3892 3.33332 9.16675 3.33332C5.94341 3.33332 3.33341 5.94332 3.33341 9.16666C3.33341 12.3892 5.94341 15 9.16675 15C10.6838 15.0024 12.1417 14.4118 13.2292 13.3542L13.3542 13.2292Z" fill="black"/>
</svg>
