<svg width="30" height="30" viewBox="0 0 30 30" fill="none" xmlns="http://www.w3.org/2000/svg">
<path fill-rule="evenodd" clip-rule="evenodd" d="M14.9157 21.1081C16.4981 21.1081 18.0156 20.4835 19.1345 19.3718C20.2534 18.2601 20.882 16.7523 20.882 15.1801C20.882 13.6079 20.2534 12.1001 19.1345 10.9884C18.0156 9.8767 16.4981 9.25214 14.9157 9.25214C13.3333 9.25214 11.8158 9.8767 10.6969 10.9884C9.57801 12.1001 8.94942 13.6079 8.94942 15.1801C8.94942 16.7523 9.57801 18.2601 10.6969 19.3718C11.8158 20.4835 13.3333 21.1081 14.9157 21.1081ZM14.9157 30C6.67776 30 0 23.3651 0 15.1801C0 6.99507 6.67776 0.360207 14.9157 0.360207C23.1536 0.360207 29.8314 6.99507 29.8314 15.1801C29.8314 23.3651 23.1536 30 14.9157 30Z" fill="#87D4FF"/>
</svg>
