<svg width="15" height="15" viewBox="0 0 15 15" fill="none" xmlns="http://www.w3.org/2000/svg">
<path d="M0.363281 7.27273C0.363281 3.25611 3.61939 0 7.63601 0C11.6526 0 14.9087 3.25611 14.9087 7.27273C14.9087 11.2893 11.6526 14.5455 7.63601 14.5455C3.61939 14.5455 0.363281 11.2893 0.363281 7.27273Z" fill="#2785C5"/>
</svg>
