
==NEWFRAME==13988==
-1063.1132,818.4434,1947.0;-1018.82904,804.9919,1915.0;-975.4409,791.5403,1883.0;
==NEWFRAME==14214==
-1677.9387,1291.7703,3073.0;-1606.1853,1269.0707,3019.0;-1524.0294,1236.7029,2942.0;
