{
  "icon-social-black": {
    "background-image": "icon-social-black.png"
  },
  "icon-ic_cake": {
    "background-position": [ -32, -0 ],
    "width": 32,
    "height": 32
  },
  "icon-ic_domain": {
    "background-position": [ -96, -96 ],
    "width": 32,
    "height": 32
  },
  "icon-ic_group_add": {
    "background-position": [ -0, -32 ],
    "width": 32,
    "height": 32
  },
  "icon-ic_group": {
    "background-position": [ -32, -32 ],
    "width": 32,
    "height": 32
  },
  "icon-ic_location_city": {
    "background-position": [ -64, -0 ],
    "width": 32,
    "height": 32
  },
  "icon-ic_mood_bad": {
    "background-position": [ -64, -32 ],
    "width": 32,
    "height": 32
  },
  "icon-ic_mood": {
    "background-position": [ -0, -64 ],
    "width": 32,
    "height": 32
  },
  "icon-ic_notifications_active": {
    "background-position": [ -32, -64 ],
    "width": 32,
    "height": 32
  },
  "icon-ic_notifications": {
    "background-position": [ -64, -64 ],
    "width": 32,
    "height": 32
  },
  "icon-ic_notifications_none": {
    "background-position": [ -96, -0 ],
    "width": 32,
    "height": 32
  },
  "icon-ic_notifications_off": {
    "background-position": [ -96, -32 ],
    "width": 32,
    "height": 32
  },
  "icon-ic_notifications_paused": {
    "background-position": [ -96, -64 ],
    "width": 32,
    "height": 32
  },
  "icon-ic_pages": {
    "background-position": [ -0, -96 ],
    "width": 32,
    "height": 32
  },
  "icon-ic_party_mode": {
    "background-position": [ -32, -96 ],
    "width": 32,
    "height": 32
  },
  "icon-ic_people": {
    "background-position": [ -64, -96 ],
    "width": 32,
    "height": 32
  },
  "icon-ic_people_outline": {
    "background-position": [ -0, -0 ],
    "width": 32,
    "height": 32
  },
  "icon-ic_person_add": {
    "background-position": [ -128, -0 ],
    "width": 32,
    "height": 32
  },
  "icon-ic_person": {
    "background-position": [ -128, -32 ],
    "width": 32,
    "height": 32
  },
  "icon-ic_person_outline": {
    "background-position": [ -128, -64 ],
    "width": 32,
    "height": 32
  },
  "icon-ic_plus_one": {
    "background-position": [ -128, -96 ],
    "width": 32,
    "height": 32
  },
  "icon-ic_poll": {
    "background-position": [ -0, -128 ],
    "width": 32,
    "height": 32
  },
  "icon-ic_public": {
    "background-position": [ -32, -128 ],
    "width": 32,
    "height": 32
  },
  "icon-ic_school": {
    "background-position": [ -64, -128 ],
    "width": 32,
    "height": 32
  },
  "icon-ic_sentiment_dissatisfied": {
    "background-position": [ -96, -128 ],
    "width": 32,
    "height": 32
  },
  "icon-ic_sentiment_neutral": {
    "background-position": [ -128, -128 ],
    "width": 32,
    "height": 32
  },
  "icon-ic_sentiment_satisfied": {
    "background-position": [ -160, -0 ],
    "width": 32,
    "height": 32
  },
  "icon-ic_sentiment_very_dissatisfied": {
    "background-position": [ -160, -32 ],
    "width": 32,
    "height": 32
  },
  "icon-ic_sentiment_very_satisfied": {
    "background-position": [ -160, -64 ],
    "width": 32,
    "height": 32
  },
  "icon-ic_share": {
    "background-position": [ -160, -96 ],
    "width": 32,
    "height": 32
  },
  "icon-ic_whatshot": {
    "background-position": [ -160, -128 ],
    "width": 32,
    "height": 32
  }
}
