<?xml version="1.0" encoding="UTF-8"?>
<!DOCTYPE svg PUBLIC "-//W3C//DTD SVG 1.1//EN" "http://www.w3.org/Graphics/SVG/1.1/DTD/svg11.dtd">
<!-- Creator: CorelDRAW X8 -->
<svg xmlns="http://www.w3.org/2000/svg" xml:space="preserve" width="40px" height="40px" version="1.1" style="shape-rendering:geometricPrecision; text-rendering:geometricPrecision; image-rendering:optimizeQuality; fill-rule:evenodd; clip-rule:evenodd"
viewBox="0 0 1031 1031"
 xmlns:xlink="http://www.w3.org/1999/xlink">
 <defs>
  <style type="text/css">
   <![CDATA[
    .fil0 {fill:none}
    .fil1 {fill:#4D4D4D}
   ]]>
  </style>
 </defs>
 <g id="Layer_x0020_1">
  <metadata id="CorelCorpID_0Corel-Layer"/>
  <g id="_2838604715664">
   <circle class="fil0" cx="516" cy="516" r="516"/>
   <path class="fil1" d="M538 268l7 7 4 8c2,5 3,7 3,15l0 106c0,22 0,45 0,66l0 9 181 0c9,0 11,1 15,3l8 4 7 7 3 5c1,3 5,11 4,19 0,9 -3,16 -9,22 -5,7 -12,11 -20,13 -5,1 -13,0 -17,0 -57,-1 -115,0 -172,0 0,57 -1,115 0,172 1,13 1,25 -13,37 -4,4 -10,7 -15,8 -6,1 -13,1 -18,0l-6 -3 -7 -3 -6 -7 -4 -6 1 0 -1 -1c-2,-3 -3,-6 -3,-9 -4,-58 -1,-128 -1,-188 -60,0 -129,4 -188,-1 -3,0 -6,-1 -9,-2l-7 -4 -7 -7 -3 -6c0,-1 0,0 0,0 -1,-2 -2,-4 -3,-7 -1,-5 -2,-11 0,-17 1,-6 4,-12 7,-16 12,-14 24,-13 38,-13 57,1 115,0 172,0 0,-57 1,-115 0,-171 0,-5 -1,-12 0,-17 2,-9 6,-16 12,-21 6,-5 14,-8 23,-9 9,0 18,4 20,5l4 2z"/>
  </g>
 </g>
</svg>
