{
	"info": {
		"_postman_id": "91b54841-4c63-4bc4-a5c6-90675bce875f",
		"name": "PrivyBackendTest",
		"schema": "https://schema.getpostman.com/json/collection/v2.1.0/collection.json",
		"_exporter_id": "23388535"
	},
	"item": [
		{
			"name": "Auth",
			"item": [
				{
					"name": "Register",
					"request": {
						"method": "POST",
						"header": [],
						"body": {
							"mode": "raw",
							"raw": "{\n    \"username\": \"Test User\",\n    \"email\": \"test.user@gmail.com\",\n    \"password\": \"111111\"\n}",
							"options": {
								"raw": {
									"language": "json"
								}
							}
						},
						"url": {
							"raw": "localhost:8080/register",
							"host": [
								"localhost"
							],
							"port": "8080",
							"path": [
								"register"
							]
						}
					},
					"response": [
						{
							"name": "Register",
							"originalRequest": {
								"method": "POST",
								"header": [],
								"body": {
									"mode": "raw",
									"raw": "{\n    \"username\": \"Test User\",\n    \"email\": \"test.user@gmail.com\",\n    \"password\": \"111111\"\n}",
									"options": {
										"raw": {
											"language": "json"
										}
									}
								},
								"url": {
									"raw": "localhost:8080/register",
									"host": [
										"localhost"
									],
									"port": "8080",
									"path": [
										"register"
									]
								}
							},
							"status": "Created",
							"code": 201,
							"_postman_previewlanguage": "json",
							"header": [
								{
									"key": "Content-Type",
									"value": "application/json"
								},
								{
									"key": "Date",
									"value": "Tue, 13 Dec 2022 00:07:12 GMT"
								},
								{
									"key": "Content-Length",
									"value": "288"
								}
							],
							"cookie": [],
							"body": "{\n    \"id\": 5,\n    \"username\": \"Test User\",\n    \"email\": \"test.user@gmail.com\",\n    \"password\": \"$2a$10$LSjeL4Uv4MlL2fTT7mtksedO2v/crUOvku8MyygUQPzlESrQFGWja\",\n    \"pin\": 540554,\n    \"account_number\": 77131847,\n    \"status\": 1,\n    \"created_at\": \"2022-12-13T07:07:11.929156309+07:00\",\n    \"updated_at\": \"2022-12-13T07:07:11.929156391+07:00\"\n}"
						}
					]
				},
				{
					"name": "Login",
					"request": {
						"method": "POST",
						"header": [],
						"body": {
							"mode": "raw",
							"raw": "{\n    \"email\": \"messi@gmail.com\",\n    \"password\": \"password\"\n}",
							"options": {
								"raw": {
									"language": "json"
								}
							}
						},
						"url": {
							"raw": "localhost:8080/login",
							"host": [
								"localhost"
							],
							"port": "8080",
							"path": [
								"login"
							]
						}
					},
					"response": [
						{
							"name": "Login",
							"originalRequest": {
								"method": "POST",
								"header": [],
								"body": {
									"mode": "raw",
									"raw": "{\n    \"email\": \"messi@gmail.com\",\n    \"password\": \"password\"\n}",
									"options": {
										"raw": {
											"language": "json"
										}
									}
								},
								"url": {
									"raw": "localhost:8080/login",
									"host": [
										"localhost"
									],
									"port": "8080",
									"path": [
										"login"
									]
								}
							},
							"status": "OK",
							"code": 200,
							"_postman_previewlanguage": "json",
							"header": [
								{
									"key": "Content-Type",
									"value": "application/json"
								},
								{
									"key": "Date",
									"value": "Tue, 13 Dec 2022 00:07:20 GMT"
								},
								{
									"key": "Content-Length",
									"value": "148"
								}
							],
							"cookie": [],
							"body": "\"eyJhbGciOiJIUzI1NiIsInR5cCI6IkpXVCJ9.eyJhdXRob3JpemVkIjp0cnVlLCJleHAiOjE2NzA4OTM2NDAsInVzZXJfaWQiOjJ9.uVeVq5v_8YXnWxaQV-BraesVOsb1MOM5726JXJi6erg\""
						}
					]
				}
			]
		},
		{
			"name": "Transaction",
			"item": [
				{
					"name": "List Transaction",
					"request": {
						"method": "GET",
						"header": [],
						"url": {
							"raw": "localhost:8080/transaction",
							"host": [
								"localhost"
							],
							"port": "8080",
							"path": [
								"transaction"
							]
						}
					},
					"response": [
						{
							"name": "List Transaction",
							"originalRequest": {
								"method": "GET",
								"header": [],
								"url": {
									"raw": "localhost:8080/transaction",
									"host": [
										"localhost"
									],
									"port": "8080",
									"path": [
										"transaction"
									]
								}
							},
							"status": "OK",
							"code": 200,
							"_postman_previewlanguage": "json",
							"header": [
								{
									"key": "Content-Type",
									"value": "application/json"
								},
								{
									"key": "Date",
									"value": "Mon, 12 Dec 2022 23:34:32 GMT"
								},
								{
									"key": "Content-Length",
									"value": "142"
								}
							],
							"cookie": [],
							"body": "[\n    {\n        \"id\": 1,\n        \"from_user_id\": 2,\n        \"to_user_id\": 1,\n        \"amount\": 5000000,\n        \"created_at\": \"2022-12-13T06:34:29+07:00\",\n        \"updated_at\": \"2022-12-13T06:34:29+07:00\"\n    }\n]"
						}
					]
				},
				{
					"name": "Create Transaction",
					"request": {
						"method": "POST",
						"header": [],
						"body": {
							"mode": "raw",
							"raw": "{\n    \"account_number\": 11111111,\n    \"pin\": 113344,\n    \"amount\": 5000000\n}",
							"options": {
								"raw": {
									"language": "json"
								}
							}
						},
						"url": {
							"raw": "localhost:8080/transaction",
							"host": [
								"localhost"
							],
							"port": "8080",
							"path": [
								"transaction"
							]
						}
					},
					"response": [
						{
							"name": "Create Transaction",
							"originalRequest": {
								"method": "POST",
								"header": [],
								"body": {
									"mode": "raw",
									"raw": "{\n    \"account_number\": 11111111,\n    \"pin\": 113344,\n    \"amount\": 5000000\n}",
									"options": {
										"raw": {
											"language": "json"
										}
									}
								},
								"url": {
									"raw": "localhost:8080/transaction",
									"host": [
										"localhost"
									],
									"port": "8080",
									"path": [
										"transaction"
									]
								}
							},
							"status": "Created",
							"code": 201,
							"_postman_previewlanguage": "json",
							"header": [
								{
									"key": "Content-Type",
									"value": "application/json"
								},
								{
									"key": "Date",
									"value": "Mon, 12 Dec 2022 23:52:37 GMT"
								},
								{
									"key": "Content-Length",
									"value": "125"
								}
							],
							"cookie": [],
							"body": "{\n    \"id\": 0,\n    \"from_user_id\": 1,\n    \"to_user_id\": 2,\n    \"amount\": 20,\n    \"created_at\": \"0001-01-01T00:00:00Z\",\n    \"updated_at\": \"0001-01-01T00:00:00Z\"\n}"
						}
					]
				}
			],
			"auth": {
				"type": "bearer",
				"bearer": [
					{
						"key": "token",
						"value": "eyJhbGciOiJIUzI1NiIsInR5cCI6IkpXVCJ9.eyJhdXRob3JpemVkIjp0cnVlLCJleHAiOjE2NzA4OTE2NTIsInVzZXJfaWQiOjJ9.hFEzvzePEx9SxJgzp06yyffv5ZYWcbBJ-sOgKO9BhpI",
						"type": "string"
					}
				]
			},
			"event": [
				{
					"listen": "prerequest",
					"script": {
						"type": "text/javascript",
						"exec": [
							""
						]
					}
				},
				{
					"listen": "test",
					"script": {
						"type": "text/javascript",
						"exec": [
							""
						]
					}
				}
			]
		}
	]
}