<?xml version="1.0" encoding="UTF-8" standalone="no"?>
<!-- Created with Inkscape (http://www.inkscape.org/) -->

<svg
   width="99.114609mm"
   height="99.283218mm"
   viewBox="0 0 99.114609 99.283218"
   version="1.1"
   id="svg1"
   xmlns="http://www.w3.org/2000/svg"
   xmlns:svg="http://www.w3.org/2000/svg">
  <defs
     id="defs1" />
  <g
     id="layer1"
     transform="translate(-49.844548,-75.518659)">
    <ellipse
       class="st1"
       cx="99.401848"
       cy="125.16027"
       id="circle6"
       style="fill:#cc1417;stroke-width:0.0799994"
       rx="47.958675"
       ry="48.040272" />
    <path
       class="st2"
       d="m 99.401855,173.20054 c 26.489175,0 47.958675,-21.50603 47.958675,-48.04028 H 51.44317 c 0,26.53425 21.469502,48.04028 47.958685,48.04028 z"
       id="path7"
       style="fill:#ffffff;stroke-width:0.0799994" />
    <path
       d="m 148.93518,123.55892 c -0.19184,-6.13314 -1.49472,-12.09013 -3.86866,-17.71884 -2.49386,-5.90896 -6.06679,-11.217408 -10.62286,-15.781232 -4.54808,-4.555824 -9.84751,-8.13482 -15.75442,-10.640917 -6.10675,-2.586169 -12.59716,-3.89927 -19.287385,-3.89927 -6.69024,0 -13.180648,1.313101 -19.287389,3.89927 -5.898917,2.498088 -11.198351,6.077094 -15.754424,10.640917 -4.548082,4.555816 -8.121004,9.864262 -10.622849,15.781232 -2.373954,5.62871 -3.676832,11.5857 -3.868667,17.71884 h -0.02398 v 1.60134 c 0,6.70163 1.310871,13.20308 3.892646,19.3202 2.493852,5.90896 6.066773,11.21741 10.622849,15.78124 4.548081,4.55581 9.847515,8.13481 15.754424,10.6409 6.106739,2.58618 12.597149,3.89928 19.287381,3.89928 6.690234,0 13.180644,-1.3131 19.287384,-3.89928 5.89893,-2.49809 11.19835,-6.07708 15.75443,-10.6409 4.55607,-4.56383 8.12101,-9.86427 10.62285,-15.78124 2.58177,-6.11712 3.89264,-12.61857 3.89264,-19.3202 v -1.60134 z m -92.248528,-16.4778 c 2.33399,-5.53265 5.675111,-10.496801 9.93544,-14.764383 4.26033,-4.267576 9.21606,-7.61438 14.739301,-9.95234 5.707082,-2.418023 11.78185,-3.643052 18.040462,-3.643052 6.258605,0 12.333375,1.225029 18.048445,3.65106 5.52324,2.33796 10.47897,5.684764 14.73931,9.95234 4.26033,4.267574 7.60145,9.231735 9.93544,14.764385 2.21408,5.23638 3.42105,10.76901 3.61288,16.4778 H 53.065772 c 0.191834,-5.70879 1.406788,-11.24943 3.62088,-16.48581 z m 75.494958,50.91467 c -4.26033,4.26759 -9.21606,7.61438 -14.73929,9.95235 -5.71509,2.41802 -11.78186,3.65105 -18.048469,3.65105 -6.266594,0 -12.333369,-1.22502 -18.048444,-3.65105 -5.523242,-2.33797 -10.478972,-5.68476 -14.739301,-9.95235 -4.26033,-4.26758 -7.601451,-9.23173 -9.935439,-14.76437 -0.07193,-0.16814 -0.143876,-0.3443 -0.215815,-0.51243 -0.02397,-0.0561 -0.04796,-0.11209 -0.07193,-0.16814 -0.04796,-0.1121 -0.09592,-0.2322 -0.135882,-0.34429 -0.02398,-0.0721 -0.05596,-0.13612 -0.07993,-0.20817 l -0.119898,-0.31227 c -0.03198,-0.0721 -0.05596,-0.14412 -0.07993,-0.2242 -0.03997,-0.10408 -0.07193,-0.20016 -0.111904,-0.30424 -0.03196,-0.0801 -0.05596,-0.15214 -0.07993,-0.2322 -0.03198,-0.0961 -0.07193,-0.20016 -0.10391,-0.29625 -0.02397,-0.0801 -0.05596,-0.15212 -0.07993,-0.2322 -0.03197,-0.0961 -0.06395,-0.19215 -0.103911,-0.29624 -0.02397,-0.0801 -0.05596,-0.16013 -0.07993,-0.23219 -0.03198,-0.0961 -0.06394,-0.19216 -0.09592,-0.29625 -0.02397,-0.0801 -0.04796,-0.16014 -0.07993,-0.23219 -0.03196,-0.0961 -0.06395,-0.20017 -0.09591,-0.29626 -0.02397,-0.0801 -0.04796,-0.15212 -0.07193,-0.23219 l -0.09591,-0.31226 c -0.02397,-0.0721 -0.04796,-0.14412 -0.06395,-0.22418 -0.03198,-0.1121 -0.06395,-0.2322 -0.09591,-0.34429 -0.01599,-0.064 -0.03997,-0.12811 -0.05596,-0.19217 l -0.143876,-0.52844 c -0.01599,-0.048 -0.02397,-0.10409 -0.03997,-0.15213 l -0.09591,-0.38432 c -0.01599,-0.0721 -0.03997,-0.15213 -0.05596,-0.2242 -0.02398,-0.10407 -0.05596,-0.20816 -0.07993,-0.31224 -0.01599,-0.0801 -0.03997,-0.16015 -0.05596,-0.2402 -0.02397,-0.0961 -0.04796,-0.20018 -0.07193,-0.29625 -0.01599,-0.0801 -0.03997,-0.16816 -0.05596,-0.24822 -0.02397,-0.0961 -0.03997,-0.19216 -0.06395,-0.28825 -0.01599,-0.0881 -0.03997,-0.16813 -0.05595,-0.2562 -0.02398,-0.0961 -0.03997,-0.19217 -0.06394,-0.28825 -0.01599,-0.0881 -0.03196,-0.16814 -0.04796,-0.25622 -0.01599,-0.0961 -0.03997,-0.19215 -0.05596,-0.28823 -0.01599,-0.0881 -0.03196,-0.16815 -0.04796,-0.25622 -0.01599,-0.0961 -0.03198,-0.19216 -0.05596,-0.28825 -0.01599,-0.0881 -0.03196,-0.16813 -0.04796,-0.2562 -0.01599,-0.0961 -0.03196,-0.20017 -0.04796,-0.29625 -0.01599,-0.0801 -0.02398,-0.16814 -0.03997,-0.24821 l -0.04796,-0.31227 c -0.01599,-0.0801 -0.02398,-0.15212 -0.03997,-0.23219 l -0.04796,-0.3603 -0.02397,-0.19216 c -0.02398,-0.18416 -0.04796,-0.36029 -0.07193,-0.54446 l -0.02398,-0.19216 c -0.01599,-0.1201 -0.03197,-0.2402 -0.03997,-0.35229 -0.008,-0.0801 -0.01599,-0.16014 -0.02397,-0.2322 -0.008,-0.10409 -0.02398,-0.21617 -0.03196,-0.32026 -0.008,-0.0801 -0.01599,-0.16014 -0.02397,-0.24821 -0.008,-0.10409 -0.01599,-0.20818 -0.03197,-0.31226 -0.008,-0.0801 -0.01599,-0.16814 -0.02398,-0.24821 l -0.02397,-0.31227 c -0.008,-0.0801 -0.01599,-0.16813 -0.01599,-0.2482 l -0.02397,-0.31227 c -0.008,-0.0801 -0.008,-0.16813 -0.01599,-0.2482 -0.008,-0.1041 -0.008,-0.20818 -0.01599,-0.31227 -0.008,-0.0801 -0.008,-0.16813 -0.01599,-0.24821 -0.008,-0.10409 -0.008,-0.21617 -0.01599,-0.32026 0,-0.0801 -0.008,-0.16014 -0.008,-0.2402 v -0.0801 h 92.664179 v 0.0801 c 0,0.0801 -0.008,0.16014 -0.008,0.2402 -0.008,0.10409 -0.008,0.21617 -0.0161,0.32026 0,0.0801 -0.008,0.16815 -0.016,0.24821 -0.008,0.10409 -0.008,0.20817 -0.0161,0.31227 -0.008,0.0801 -0.008,0.16813 -0.016,0.2482 l -0.0239,0.31227 c -0.008,0.0801 -0.008,0.16813 -0.0161,0.2482 l -0.024,0.31227 c -0.008,0.0801 -0.0161,0.16813 -0.0239,0.24821 -0.008,0.10408 -0.016,0.20817 -0.032,0.31226 l -0.0239,0.2402 c -0.008,0.1121 -0.0239,0.21618 -0.032,0.32827 -0.008,0.0721 -0.0161,0.15213 -0.0239,0.22419 -0.016,0.1201 -0.032,0.24821 -0.0399,0.36831 -0.008,0.064 -0.016,0.1201 -0.024,0.18415 -0.0239,0.18417 -0.048,0.3603 -0.0719,0.54446 l -0.0239,0.16814 c -0.016,0.1281 -0.032,0.25622 -0.056,0.37631 -0.008,0.0721 -0.0239,0.15214 -0.032,0.22419 -0.0161,0.1041 -0.0319,0.21619 -0.048,0.32027 -0.0161,0.0801 -0.0239,0.16014 -0.04,0.2402 -0.016,0.10409 -0.032,0.20018 -0.048,0.30426 -0.016,0.0801 -0.032,0.16814 -0.048,0.2482 -0.0161,0.0961 -0.032,0.20018 -0.056,0.29625 -0.016,0.0801 -0.032,0.16815 -0.048,0.24821 -0.0161,0.0961 -0.0399,0.20017 -0.056,0.29624 -0.0161,0.0801 -0.032,0.16816 -0.048,0.24822 -0.0239,0.0961 -0.0399,0.19216 -0.0639,0.29625 -0.0161,0.0801 -0.032,0.16814 -0.056,0.24821 -0.0239,0.0961 -0.0399,0.20017 -0.064,0.29624 -0.016,0.0801 -0.0399,0.16015 -0.056,0.24822 -0.0239,0.10408 -0.048,0.20016 -0.0719,0.30426 -0.0161,0.0801 -0.0399,0.16013 -0.056,0.23219 -0.0239,0.10408 -0.056,0.21618 -0.0799,0.32025 -0.016,0.0721 -0.032,0.14413 -0.056,0.2162 -0.032,0.12809 -0.064,0.26421 -0.1039,0.39232 -0.016,0.048 -0.024,0.0961 -0.0399,0.14413 l -0.14388,0.52843 c -0.016,0.064 -0.032,0.12009 -0.056,0.18416 -0.032,0.12011 -0.0638,0.23219 -0.10391,0.3523 -0.0239,0.0721 -0.0399,0.14412 -0.0639,0.21617 l -0.0959,0.31226 c -0.0239,0.0721 -0.048,0.15214 -0.0719,0.22419 -0.032,0.10409 -0.0639,0.20018 -0.0959,0.30426 -0.0239,0.0801 -0.048,0.15213 -0.0719,0.2322 -0.032,0.0961 -0.0639,0.20017 -0.0959,0.29624 -0.024,0.0801 -0.056,0.15213 -0.0799,0.2322 -0.032,0.0961 -0.0639,0.20016 -0.10392,0.29624 -0.0239,0.0801 -0.056,0.15213 -0.0799,0.23221 -0.032,0.0961 -0.0719,0.20016 -0.10392,0.29623 -0.0239,0.0801 -0.056,0.15214 -0.0799,0.23221 -0.04,0.10407 -0.0719,0.20016 -0.1119,0.30424 -0.0239,0.072 -0.056,0.14412 -0.0799,0.22421 l -0.1199,0.31225 c -0.0239,0.0721 -0.056,0.13612 -0.0799,0.20817 -0.048,0.11209 -0.0959,0.23219 -0.13588,0.34429 -0.0239,0.0561 -0.048,0.11209 -0.0719,0.16815 -0.0719,0.17614 -0.14387,0.34429 -0.21581,0.51242 -2.318,5.54866 -5.65912,10.51281 -9.91946,14.78039 z"
       id="path8"
       style="stroke-width:0.0799994" />
    <path
       class="st2"
       d="m 99.401855,145.17704 c -5.339406,0 -10.35908,-2.08173 -14.131829,-5.86091 -3.772752,-3.77916 -5.850959,-8.80738 -5.850959,-14.15587 0,-5.34849 2.078207,-10.37669 5.850959,-14.15586 3.772749,-3.77915 8.792423,-5.86091 14.131829,-5.86091 5.339395,0 10.359065,2.08176 14.131815,5.86091 3.77277,3.77917 5.85097,8.80737 5.85097,14.15586 0,5.34849 -2.0782,10.37671 -5.85097,14.15587 -3.77275,3.77918 -8.79242,5.86091 -14.131815,5.86091 z"
       id="path9"
       style="fill:#ffffff;stroke-width:0.0799994" />
    <path
       class="st2"
       d="m 99.401855,145.17704 c -5.339406,0 -10.35908,-2.08173 -14.131829,-5.86091 -3.772752,-3.77916 -5.850959,-8.80738 -5.850959,-14.15587 0,-5.34849 2.078207,-10.37669 5.850959,-14.15586 3.772749,-3.77915 8.792423,-5.86091 14.131829,-5.86091 5.339395,0 10.359065,2.08176 14.131815,5.86091 3.77277,3.77917 5.85097,8.80737 5.85097,14.15586 0,5.34849 -2.0782,10.37671 -5.85097,14.15587 -3.77275,3.77918 -8.79242,5.86091 -14.131815,5.86091 z"
       id="path10"
       style="fill:#ffffff;stroke-width:0.0799994" />
    <path
       class="st2"
       d="m 99.401855,145.17704 c -5.339406,0 -10.35908,-2.08173 -14.131829,-5.86091 -3.772752,-3.77916 -5.850959,-8.80738 -5.850959,-14.15587 0,-5.34849 2.078207,-10.37669 5.850959,-14.15586 3.772749,-3.77915 8.792423,-5.86091 14.131829,-5.86091 5.339395,0 10.359065,2.08176 14.131815,5.86091 3.77277,3.77917 5.85097,8.80737 5.85097,14.15586 0,5.34849 -2.0782,10.37671 -5.85097,14.15587 -3.77275,3.77918 -8.79242,5.86091 -14.131815,5.86091 z"
       id="path11"
       style="fill:#ffffff;stroke-width:0.0799994" />
    <path
       d="m 99.401855,146.77839 c -5.76304,0 -11.182371,-2.24989 -15.258859,-6.33331 -4.076488,-4.08342 -6.322552,-9.51197 -6.322552,-15.28482 0,-5.77283 2.246064,-11.20137 6.322552,-15.2848 4.076488,-4.08342 9.495819,-6.33332 15.258859,-6.33332 5.763025,0 11.182365,2.2499 15.258845,6.33332 4.0765,4.08343 6.32257,9.51197 6.32257,15.2848 0,5.77285 -2.24607,11.2014 -6.32257,15.28482 -4.07648,4.08342 -9.49582,6.33331 -15.258845,6.33331 z m 0,-40.03354 c -4.907777,0 -9.527795,1.9136 -12.996807,5.3965 -3.477003,3.47491 -5.38736,8.1028 -5.38736,13.01891 0,4.91612 1.910357,9.54401 5.38736,13.01893 3.469012,3.47491 8.08903,5.39652 12.996807,5.39652 4.907775,0 9.527785,-1.9136 12.996795,-5.39652 3.46901,-3.47492 5.38737,-8.10281 5.38737,-13.01893 0,-4.91611 -1.91037,-9.544 -5.38737,-13.01891 -3.46901,-3.4829 -8.08902,-5.3965 -12.996795,-5.3965 z"
       id="path12"
       style="stroke-width:0.0799994" />
  </g>
</svg>
