﻿"代號","名稱","市場","股價日期","成交","漲跌價","漲跌幅","面值(元)","股本(億)","發行量(萬張)","市值(億)","成立年數","上市年數","股票期貨","選擇權","權證","公司債","私募股","特別股","產業別","董事長","總經理"
="1260","富味鄉","興","11/27","17.25","+0.05","+0.29","10","10.2","10.2","17.6","37.1","8","","","","","","","食品工業","陳昶宏","劉兆華"
="1269","乾杯","興","11/27","73","0","0","10","1.86","1.86","13.6","21.1","4.3","","","","","","","觀光事業","平出莊司","平出莊司"
="1563","巧新","興","11/27","56.2","+4.1","+7.87","10","19.9","19.9","112","26.4","14.1","","","","","","","電機機械","黃聰榮","黃聰榮"
="1585","鎧鉅","興","11/27","13.35","-3.15","-19.1","10","5.4","5.4","7.2","20.1","13.6","","","","","","","電子零組件業","林柄達","林柄達"
="1594","日高","興","11/27","13.6","0","0","10","2.92","2.92","3.97","46.7","10.1","","","","","","","電機機械","王嘉慶","王嘉慶"
="1780","立弘","興","11/27","17.45","+0.35","+2.05","10","9.52","9.52","16.6","18.9","10.6","","","","","","","生技醫療業","楊正利","林清輝"
="2071","震南鐵","興","11/27","20.7","0","0","10","4.2","4.2","8.69","28.9","1.2","","","","","","","鋼鐵工業","黃錦榮","余金珠"
="2211","長榮鋼","興","11/27","44.95","+0.35","+0.78","10","39.9","39.9","180","47.8","0.9","","","","","","","鋼鐵工業","林耿立","劉邦恩"
="2237","華德動能","興","11/27","21","+1","+5","10","8.49","8","16.8","15.7","5.9","","","","","有","","電機機械","蔡裕慶","楊誌榮"
="2245","詠勝昌","興","11/27","22.8","0","0","10","1.35","1.35","3.08","22","4","","","","","","","電機機械","吳書杰","吳明星"
="2246","凱勝綠能","興","11/27","20","-0.1","-0.5","10","5.87","4.95","9.9","8.7","3.3","","","","","有","","電機機械","陳怡仁","陳怡仁"
="2248","華勝-KY","興","11/27","29","0","0","10","4.2","4.2","12.2","3.6","2.2","","","","","","","電機機械","陳鏗勝","陳鏗勝"
="2249","湧盛","興","11/27","53","0","0","10","2","2","10.6","12.3","1","","","","","","","電機機械","萬正在","萬正在"
="2599","樂揚","興","11/27","16.4","+0.4","+2.5","10","10","10","16.4","27.5","12.4","","","","","","","建材營造業","段幼龍","王弘垚"
="2721","楷捷-KY","興","11/27","6.82","+0.22","+3.33","10","10.5","10.5","7.13","12.2","11","","","","","","","觀光事業","蘇建維","蘇建維"
="2730","美麗信","興","11/27","4.93","-0.07","-1.4","10","3.73","3.73","1.84","16.8","9.1","","","","","","","觀光事業","徐明潭","黃安迪"
="2733","維格","興","11/27","14.45","+0.55","+3.96","10","1.66","1.66","2.4","17.4","7.9","","","","","","","觀光事業","孫國華","何萬誠"
="2741","老四川","興","11/27","41.7","+0.2","+0.48","10","2.14","2.14","8.91","12.9","6.1","","","","","","","觀光事業","宇辰投資有限公司","吳明翰"
="2750","桃禧","興","11/27","9.3","-0.02","-0.21","10","4.6","4.6","4.28","11.6","2.3","","","","","","","觀光事業","李三蓮","李弘信"
="2753","八方雲集","興","11/27","160","-2","-1.23","10","6","6","96.1","20.9","0.2","","","","","","","觀光事業","林欣怡","張瑞蓮"
="2755","揚秦","興","11/27","88","-1.1","-1.23","10","1.8","1.8","15.8","5.3","1.4","","","","","","","觀光事業","卓元裕","卓元裕"
="2938","床的世界","興","11/27","38.35","0","0","10","2.01","2.01","7.72","16.8","4.2","","","","","","","貿易百貨業","陳燕飛","陳俊傑"
="2942","京站","興","11/27","47.2","+1","+2.16","10","6","6","28.3","13.2","2.7","","","","","","","貿易百貨業","林怡均","柯愫吟"
="2945","三商家購","興","11/27","92.5","0","0","10","6","6","55.5","7.8","2","","","","","","","貿易百貨業","陳翔玢","邱光隆"
="2947","振宇五金","興","11/27","119","+4","+3.48","10","1.73","1.73","20.5","12.5","0.2","","","","","","","貿易百貨業","曾善","洪國展"
="3097","拍檔","興","11/27","15.15","0","0","10","7.51","7.51","11.4","30.8","18.3","","","","","","","電腦及週邊設備業","陳其宏","王保鋅"
="3117","年程","興","11/27","3.57","-0.13","-3.51","10","2.28","3.83","1.37","25.6","8.3","","","","","","","電子零組件業","薛維進","薛維進"
="3138","耀登","興","11/27","82.9","-0.4","-0.48","10","4.12","4.12","34.2","30.8","16.2","","","","","","","通信網路業","張玉斌","張玉斌"
="3150","鈺寶","興","11/27","16.9","+2","+13.4","10","3.86","3.86","6.52","22.9","10.2","","","","","","","半導體業","蔡玲君","黃良駿"
="3158","嘉實","興","11/27","47.9","+0.1","+0.21","10","2.63","2.63","12.6","21.7","2.7","","","","","","","資訊服務業","徐文伯","李政霖"
="3168","眾福科","興","11/27","23.5","-0.2","-0.84","10","6.94","4.94","11.6","23","16.6","","","","","有","","光電業","黃漢州","俞思平"
="3184","微邦","興","11/27","17.8","-0.3","-1.66","10","8.03","5.06","9","23.6","7.6","","","","","有","","生技醫療業","孟憲鎧","謝淑品"
="3349","寶德","興","11/27","18.6","0","0","10","3.3","3.3","6.13","23.6","16.2","","","","","","","電腦及週邊設備業","盧賀隆","蔡明勳"
="3357","臺慶科","興","11/27","101","-3","-2.88","10","9.1","9.1","91.9","28.1","9.7","","","","","","","電子零組件業","謝明諺","謝明良"
="3391","佳得","興","11/27","10.3","-0.05","-0.48","10","6.89","6.89","7.09","30.2","4.9","","","","","","","通信網路業","黃兆南","黃兆南"
="3429","彥陽","興","11/27","6.8","-0.05","-0.73","10","4.25","4.25","2.89","25.9","13.1","","","","","","","電子通路業","吳銘雄","吳銘雄"
="3430","奇鈦科","興","11/27","21.8","-0.75","-3.33","10","2.92","2.92","6.36","22.9","10.2","","","","","","","化學工業","龍筱芬","盧玉華"
="3485","敘豐","興","11/27","25.7","-0.2","-0.77","10","3.2","3.2","8.21","26.4","8.2","","","","","","","光電業","周坤麟","周坤麟"
="3585","聯致","興","11/27","4.97","-0.06","-1.19","10","11.8","11.8","5.84","22.2","13.1","","","","","","","電子零組件業","李長明","陳福龍"
="3592","瑞鼎","興","11/27","93","-0.3","-0.32","10","6.69","6.69","62.3","17.1","13.1","","","","","","","半導體業","黃裕國","黃裕國"
="3595","山太士","興","11/27","25.25","-0.2","-0.79","10","2.3","2.3","5.8","25.2","13","","","","","","","光電業","吳學宗","吳家宗"
="3603","建祥國際","興","11/27","5.95","+0.35","+6.25","10","2.48","1.18","0.7","18.4","12.9","","","","","有","","電子通路業","陳銘銓","陳銘銓"
="3627","華信科","興","11/27","21.85","+0.4","+1.86","10","2.82","2.82","6.16","13.7","7.7","","","","","","","光電業","許英朗","許英朗(代理)"
="3633","云光","興","11/27","39.9","+0.1","+0.25","10","3.4","3.4","13.6","23","12.3","","","","","","","光電業","許家滂","許家滂"
="3659","百辰","興","11/27","13.5","0","0","10","4.92","4.92","6.64","17.4","11.1","","","","","","","光電業","賴孟修","林百祁"
="3674","康訊","興","11/27","3.95","+0.1","+2.6","10","1.78","1.78","0.7","33.3","10.5","","","","","","","通信網路業","藍明傳","藍明傳"
="3678","聯享","興","11/27","7.08","0","0","10","2.8","2.8","1.98","19.7","11.1","","","","","","","光電業","賴俊光","賴俊光"
="3688","華立捷","興","11/27","39.95","+0.15","+0.38","10","9.39","8.27","33","19.9","6.6","","","","","","","光電業","賴力弘","賴力弘"
="4117","普生","興","11/27","56","+0.5","+0.9","10","5.98","4.98","27.9","36.5","18.4","","","","","有","","生技醫療業","林宗慶","林孟德"
="4132","國鼎","興","11/27","47.5","-0.45","-0.94","10","13.2","11.2","53.3","18.2","10.5","","","","","有","","生技醫療業","劉勝勇","蘇經天"
="4136","太和-KY","興","11/27","25.2","0","0","10","2.83","2.83","7.13","12.9","4.8","","","","","","","生技醫療業","郭靖凱","郭靖凱"
="4150","優你康","興","11/27","10.05","-0.25","-2.43","10","17.2","17.2","17.3","28.5","10.2","","","","","","","生技醫療業","王江全","林明政"
="4151","明躍","興","11/27","25","+0.5","+2.04","10","5","5","12.5","20.5","10","","","","","","","生技醫療業","吳樹曜","吳樹曜"
="4166","友霖","興","11/27","14.9","0","0","10","18.7","18.7","27.9","12.8","8.5","","","","","","","生技醫療業","蔡正弘","羅麗珠"
="4169","泰宗","興","11/27","37.15","+0.4","+1.09","10","4.76","4.76","17.7","22.8","8.6","","","","","","","生技醫療業","徐煥清","王雅俊"
="4172","因華","興","11/27","17.05","-0.65","-3.67","10","7.65","7.65","13.1","15.1","8.2","","","","","","","生技醫療業","林智暉","郝為華"
="4186","尖端醫","興","11/27","26.9","+1","+3.86","10","8","8","21.5","20.5","8","","","","","","","生技醫療業","蘇文龍","蘇文龍"
="4191","法德藥","興","11/27","42.5","0","0","10","6.72","6.49","27.6","12.7","7.4","","","","","有","","生技醫療業","詹惠如","詹惠如"
="4194","禾生技","興","11/27","25.35","+6.15","+32","10","12.3","12.3","31.1","19.9","7","","","","","","","生技醫療業","唐錦榮","吳宗忠"
="4195","基米","興","11/27","20","+0.2","+1.01","10","5.79","5.79","11.6","19.1","7","","","","","","","生技醫療業","周孟賢","周孟賢"
="4197","暐世","興","11/27","15.6","-0.2","-1.27","10","3.05","3.05","4.76","15","7.1","","","","","","","生技醫療業","戴鏗碩","戴鏗碩"
="4431","敏成","興","11/27","88.6","-0.8","-0.89","10","2.11","2.11","18.7","30.3","9.3","","","","","","","其他業","古思明","楊文仁"
="4440","宜新實業","興","11/27","35.9","0","0","10","4.32","4.32","15.5","7.4","1.2","","","","","","","紡織纖維","邱倉沛","邱倉沛"
="4537","旭東","興","11/27","17.65","+0.25","+1.44","10","7.88","7.88","13.9","37.5","8.6","","","","","","","光電業","莊添財","莊添財"
="4544","春日","興","11/27","21.9","0","0","10","6.03","6.03","13.2","46.7","7.9","","","","","","","電機機械","陳其泰","孫正耀"
="4546","長亨","興","11/27","61.1","-1.7","-2.71","10","3.39","3.39","20.7","33.1","7.3","","","","","","","電機機械","紀一珍","陳愛多"
="4553","盛復","興","11/27","18","0","0","10","3.1","3.1","5.59","36.9","6.2","","","","","","","電機機械","廖述源","呂學耕"
="4558","寶緯","興","11/27","19.45","+0.15","+0.78","10","4.41","4.41","8.58","31.7","6","","","","","","","電機機械","詹勲霖","詹勲國"
="4559","久裕興","興","11/27","9.95","+0.02","+0.2","10","5.8","5.8","5.77","39.1","6","","","","","","","電機機械","陳世偉","陳世偉"
="4565","宏偉","興","11/27","51.5","-0.3","-0.58","10","4.41","4.41","22.7","41.8","4.2","","","","","","","電機機械","黃埮城","陳顯堂"
="4573","高明鐵","興","11/27","27.45","+2.65","+10.7","10","3.26","3.27","8.98","25.8","2.4","","","","","","","電機機械","張朝凱","陳志鑫"
="4575","銓寶","興","11/27","28","-0.2","-0.71","10","3.92","3.92","11","39","2","","","","","","","電機機械","謝樹林","謝樹林"
="4577","達航","興","11/27","30.5","0","0","10","4.43","4.43","13.5","29.8","0.1","","","","","","","其他電子業","翁榮隨","陳柏棋"
="4578","總格精密","興","11/27","61","0","0","10","2.04","2.04","12.4","30.2","2.1","","","","","","","電機機械","廖文嘉","侯建富"
="4582","聚恆","興","11/27","57","+1.8","+3.26","10","5","5","28.5","22.6","1.2","","","","","","","光電業","周恒豪","周恒豪"
="4730","通用","興","11/27","12","-0.05","-0.41","10","2.89","2.89","3.47","49.7","9","","","","","","","橡膠工業","林永彬","林永彬"
="4732","彥臣","興","11/27","28.5","+0.1","+0.35","10","4.65","4.65","13.3","19.9","12.9","","","","","","","生技醫療業","黃中洋","董事長暫代"
="4738","尚化","興","11/27","2.83","+0.06","+2.17","10","7.76","7.76","2.2","40.7","11.2","","","","","","","化學工業","吳永從","吳永從"
="4765","磐采","興","11/27","26.75","0","0","10","3.21","3.21","8.6","22","4","","","","","","","化學工業","李忠訓","沈文昌"
="4768","晶呈科技","興","11/27","144","+2","+1.41","10","3","3","43.3","10","1","","","","","","","化學工業","陳亞理","陳亞理"
="4770","上品","興","11/27","134","-0.5","-0.37","10","6.88","6.88","92.2","39.1","0.2","","","","","","","化學工業","侯嘉生","侯嘉生"
="4923","力士","興","11/27","22.5","-0.1","-0.44","10","2.5","2.5","5.62","13.5","10.4","","","","","","","半導體業","張晉誠","鍾明道"
="4925","智微","興","11/27","79","-5.3","-6.29","10","4.88","4.88","38.6","19.2","10.1","","","","","","","半導體業","劉立國","劉立國"
="4951","精拓科","興","11/27","23.15","+0.1","+0.43","10","3.02","3.02","6.99","18.6","10.4","","","","","","","半導體業","陳神寶","黃德燻"
="4980","佐臻","興","11/27","21","+0.3","+1.45","10","3.32","3.32","6.97","23.7","10","","","","","","","電子零組件業","梁文隆","梁文隆"
="5222","全訊","興","11/27","102","0","0","10","3.78","3.78","38.5","22.5","7.9","","","","","","","半導體業","張全生","張全生"
="5228","鈺鎧","興","11/27","13.55","0","0","10","3.36","3.36","4.55","28.5","5.7","","","","","","","電子零組件業","黃其集","黃其集"
="5233","有量","興","11/27","21.2","+0.1","+0.47","10","14.7","14.7","31.2","20.6","9.4","","","","","","","其他電子業","林松青","(冰-水+余)維弘(代理)"
="5236","凌陽創新","興","11/27","88.9","+0.7","+0.79","10","5.25","5.15","45.7","14","0.2","","","","","","","半導體業","黃洲杰","龔執豪"
="5240","建騰","興","11/27","3.99","+0.09","+2.31","10","3.71","3.71","1.48","17.3","9.4","","","","","","","光電業","朱伯倫","朱伯倫"
="5244","弘凱","興","11/27","24.85","-0.15","-0.6","10","6.04","6.04","15","15.3","8.9","","","","","","","光電業","黃建中","黃建中"
="5248","景傳","興","11/27","25.15","0","0","10","1.91","1.91","4.8","21.9","9.2","","","","","","","光電業","翁世豪","顏志明"
="5254","欣訊科技","興","11/27","16.3","0","0","10","2.06","2.06","3.35","28.4","1.9","","","","","","","電子零組件業","黃道明","黃道明"
="5262","立達","興","11/27","6.35","-0.07","-1.09","10","5.07","5.07","3.22","10.8","7.1","","","","","","","半導體業","王立民","王立民"
="5267","龍翩","興","11/27","31.6","+0.75","+2.43","10","2.55","2.55","8.06","16.4","8.8","","","","","","","光電業","主吉投資有限公司代表人楊吉祥","陳景龍"
="5271","紘通","興","11/27","8.63","-0.01","-0.12","10","4.72","4.72","4.07","22.3","8.7","","","","","","","電子零組件業","闕壯練","黃俊華"
="5277","葳天","興","11/27","17.1","+1.1","+6.88","10","6.81","4.71","8.05","16.1","6.2","","","","","有","","光電業","陳峰明","邢陳震崙"
="5292","華懋","興","11/27","48","-0.5","-1.03","10","2.68","2.68","12.9","31.2","0.9","","","","","","","其他業","鄭石治","鄭石治"
="5297","廣化","興","11/27","10.05","0","0","10","2.35","2.35","2.36","22.8","3.8","","","","","","","半導體業","張維仲","魯碧華"
="5547","久舜","興","11/27","24.2","+0.6","+2.54","10","2.22","2.22","5.37","27.2","0.9","","","","","","","建材營造業","林世貞","蔡長榮"
="5859","遠壽","興","11/27","7.2","+0.1","+1.41","10","124","124","89.5","27","5.6","","","","","","","保險業","孟嘉仁","趙學欣"
="5863","瑞興銀","興","11/27","10.15","0","0","10","31.4","31.4","31.9","13.4","13","","","","","","","銀行業","郭釧溥","陳建豪"
="6027","德信","興","11/27","4.8","-0.02","-0.41","10","13.9","13.9","6.66","31.3","5.1","","","","","","","證券業","孟慶蒞","張清榮"
="6028","公勝保經","興","11/27","46.8","+2.2","+4.93","10","2","2","9.36","27.7","1.7","","","","","","","保險業","蔡文俊","蔡聖威"
="6272","驊陞","興","11/27","6.94","-0.27","-3.74","10","6.67","6.67","4.63","30.9","17.9","","","","","","","電子零組件業","陳宏欽","陳正煌"
="6403","群登","興","11/27","8.22","0","0","10","3.66","2.15","1.76","11.6","8.1","","","","","有","","通信網路業","鍾依華","許佳榮"
="6407","相互","興","11/27","12.9","+1.45","+12.7","10","8.21","8.21","10.6","30.4","7.7","","","","","","","電子零組件業","陳旭東","張智明"
="6423","億而得","興","11/27","50.5","+0.1","+0.2","10","2.68","2.68","13.5","19.2","6.1","","","","","","","半導體業","黃文謙","黃文謙"
="6428","淘米","興","11/27","10","+0.08","+0.81","10","1.77","1.77","1.77","11","7.2","","","","","","","文化創意業","王俊博","黃信凱"
="6434","達輝光電","興","11/27","5.84","+0.24","+4.29","10","46.4","46.4","27.1","14.1","7.1","","","","","","","光電業","吳東昇","施火灶"
="6468","棒辣椒","興","11/27","79.6","-0.3","-0.38","10","1.21","1.21","9.61","8.3","6.2","","","","","","","文化創意業","李承元","林大鈞"
="6473","好玩家*","興","11/27","12.5","-0.3","-2.34","5","0.68","1.14","1.42","10.6","6","","","","","","","文化創意業","呂柏宏","呂柏宏"
="6474","華豫寧","興","11/27","27","0","0","10","3.58","3.58","9.66","27.9","2.8","","","","","","","電子通路業","連智民","黃炳順"
="6475","岱煒","興","11/27","53.2","+0.6","+1.14","10","3.6","3.02","16.1","19.2","6","","","","","有","","電子零組件業","林宜修","林宜修"
="6493","雷虎生","興","11/27","20.5","-0.1","-0.49","10","2.4","2.4","4.93","8.6","5.9","","","","","","","生技醫療業","陳冠如","蘇聖傑"
="6495","納諾*-KY","興","11/27","14.75","-0.3","-1.99","0.1","4.39","14.4","21.2","9.3","4.3","","","","","有","","化學工業","呂鴻圖","呂鴻圖"
="6498","久禾光","興","11/27","37.8","-0.2","-0.53","10","3.06","3.06","11.6","17.1","5.8","","","","","","","光電業","王世岳","王世岳"
="6515","穎崴","興","11/27","433","+1","+0.23","10","3.06","3.06","132","19.6","1","","","","","","","半導體業","王嘉煌","王嘉煌"
="6518","康科特","興","11/27","14.4","+0.35","+2.49","10","2.5","2.5","3.6","11.2","5.6","","","","","","","生技醫療業","劉靜怡","劉靜怡"
="6529","研鼎","興","11/27","6","-0.04","-0.66","10","2.23","2.23","1.34","12.4","5.4","","","","","","","資訊服務業","簡博彬","簡博彬"
="6534","正瀚","興","11/27","56.1","+0.1","+0.18","10","8.44","8.44","47.4","7","5.4","","","","","","","農業科技業","吳正邦","邱兆宗"
="6536","碩豐","興","11/27","16.35","+0.5","+3.15","10","2.63","2.63","4.3","12.2","5.5","","","","","","","資訊服務業","徐明哲","許尚毅"
="6539","麗彤","興","11/27","68.7","+0.1","+0.15","10","6.03","6.03","41.4","9.4","5.1","","","","","","","生技醫療業","張麗綺","李依芸"
="6543","普惠醫工","興","11/27","28.45","+0.05","+0.18","10","3.92","3.92","11.1","31.6","1.7","","","","","","","生技醫療業","東大發資產管理(股)公司 代表人:葉錫宜","陳宏仁"
="6545","擎力","興","11/27","6.81","-0.19","-2.71","10","2.2","2.2","1.5","16.9","5.3","","","","","","","半導體業","譚永禾","譚永禾"
="6546","正基","興","11/27","69.9","-0.4","-0.57","10","6.02","6.02","42.1","20","0.1","","","","","","","通信網路業","陳明哲","游俊賢"
="6549","景凱","興","11/27","14.05","+1.4","+11.1","10","7.52","7.52","10.6","9.6","5.1","","","","","","","生技醫療業","石英珠","袁鴻昌"
="6550","北極星藥業-KY","興","11/27","17.1","-0.15","-0.87","10","65.3","32.8","56","14.8","4.8","","","","有","有","","生技醫療業","陳鴻文","陳紹琛"
="6555","榮炭","興","11/27","19.65","0","0","10","12","4.53","8.9","10.9","4.9","","","","","有","","電子零組件業","周憲聰","吳玉祥"
="6559","研晶","興","11/27","9.89","+0.02","+0.2","10","2.32","2.32","2.29","15.5","5","","","","","","","光電業","魏志宏","魏志宏"
="6564","安特羅","興","11/27","44.8","-0.05","-0.11","10","6","6","26.9","6.9","2.2","","","","","","","生技醫療業","留忠正","張哲瑋"
="6565","物聯","興","11/27","15","0","0","10","2.6","2.6","3.9","12.4","3.9","","","","","","","資訊服務業","郭啟銘","郭啟銘"
="6566","創益","興","11/27","19.6","+0.1","+0.51","10","2.7","2.7","5.29","9.6","4.9","","","","","","","生技醫療業","屈志源","簡重光"
="6572","博錸","興","11/27","23.7","+0.2","+0.85","10","10.3","7.01","16.6","11","4.8","","","","","有","","生技醫療業","曹汀","曹汀"
="6575","心悅","興","11/27","46.2","-0.35","-0.75","10","11","10.2","47.3","7.7","4.8","","","","","有","","生技醫療業","蔡果荃","蔡果荃"
="6580","台睿","興","11/27","25.5","-0.45","-1.73","10","8.91","8.53","21.8","9.3","3.4","","","","","有","","生技醫療業","簡督憲","簡督憲"
="6583","友松","興","11/27","24.9","-0.6","-2.35","10","1.58","1.59","3.97","20.1","4.3","","","","","","","文化創意業","薛聖棻","陳財裕"
="6584","南俊國際","興","11/27","31.9","-0.1","-0.31","10","5.2","5.2","16.6","36.5","4.3","","","","","","","電子零組件業","李金蘭","吳仁山"
="6585","鼎基","興","11/27","45.35","0","0","10","6.15","6.15","27.9","39.7","4.2","","","","","","","其他業","林勳臺","林勳臺"
="6586","醣基","興","11/27","26.35","-0.15","-0.57","10","18.4","18.4","48.4","7.7","3.2","","","","","","","生技醫療業","陳肇隆","林鴻達"
="6595","光禹國際","興","11/27","9.79","0","0","10","2.88","2.88","2.82","7.6","1.9","","","","","","","文化創意業","字維新","謝宗耀"
="6597","立誠","興","11/27","18.4","+0.1","+0.55","10","2.09","2.09","3.85","9.9","2.9","","","","","","","電子零組件業","周萬順","李忠義"
="6599","普達系統","興","11/27","21.45","-0.4","-1.83","10","2.1","2.1","4.5","11.5","2.9","","","","","","","電腦及週邊設備業","胡木鎮","張洪瑞"
="6606","建德工業","興","11/27","24.8","-0.25","-1","10","9.76","9.76","24.2","54.7","0.9","","","","","","","電機機械","李金旆","李金旆"
="6610","安成生技","興","11/27","17","-0.15","-0.87","10","6.74","6.74","11.5","10.4","3.9","","","","","","","生技醫療業","吳怡君","翁竹君"
="6611","方舟","興","11/27","9.2","0","0","10","0.38","0.24","0.23","6.2","4.1","","","","","有","","文化創意業","鄧潤澤","楊淇鴻"
="6617","共信-KY","興","11/27","241","-8","-3.21","10","10.9","10.9","263","6.7","3.8","","","","","","","生技醫療業","吳崇漢","林懋元"
="6618","永虹先進","興","11/27","17.5","-0.85","-4.63","10","3.54","3.22","5.64","9.2","3.2","","","","","有","","化學工業","吳家幸","陳建勳"
="6620","漢達","興","11/27","26.8","-0.2","-0.74","10","11.6","11.6","31","6.6","3.9","","","","","","","生技醫療業","劉芳宇","陳俊良"
="6621","華宇藥","興","11/27","17.45","+0.05","+0.29","10","3.55","3.55","6.19","20.9","3.3","","","","","","","生技醫療業","陳正","林亮光"
="6622","百聿數碼","興","11/27","28.1","+0.1","+0.36","10","3","3","8.43","6","3.5","","","","","","","文化創意業","張承宏","張承宏"
="6626","唯數","興","11/27","21.2","0","0","10","2.76","2.76","5.86","6.9","3.7","","","","","","","文化創意業","許書綺","許書綺"
="6633","萊鎂醫","興","11/27","12.5","-0.35","-2.72","10","4.04","3.94","4.93","10.7","3.6","","","","","","有","生技醫療業","陳仲竹","陳仲竹"
="6634","欣耀","興","11/27","70.7","+0.6","+0.86","10","5.2","5.23","37","6.5","3.4","","","","","","","生技醫療業","朱凱民","朱凱民"
="6637","醫影","興","11/27","56.5","+0.5","+0.89","10","2.14","2.14","12.1","28.6","3.4","","","","","","","生技醫療業","謝穗徽","謝穗徽"
="6638","沅聖","興","11/27","106.5","+1","+0.95","10","3","3","32","17.3","3.4","","","","","","","電腦及週邊設備業","朱復銓","杜東勝"
="6639","源大環能","興","11/27","13.95","0","0","10","4.14","4.14","5.78","12.4","2.1","","","","","","","油電燃氣業","彭鴻俊","林燿輝"
="6645","金萬林","興","11/27","77.5","+3.2","+4.31","10","2.96","2.96","22.9","16.3","3.3","","","","","","","生技醫療業","陳惠娥","陳惠娥"
="6648","斯其大","興","11/27","75.8","+0.8","+1.07","10","3","3","22.7","21.7","3.2","","","","","","","其他電子業","吳端煇","吳端煇"
="6650","帝圖","興","11/27","65.6","+2.6","+4.13","10","1.79","1.79","11.7","11.8","3.2","","","","","","","文化創意業","劉熙海","劉熙海"
="6651","全宇昕","興","11/27","68.9","-1","-1.43","10","2.86","2.86","19.7","18.6","3.2","","","","","","","半導體業","李建慶","李徐華"
="6652","雅祥生醫","興","11/27","27.5","+0.15","+0.55","10","12.5","12.5","34.4","15.7","2.3","","","","","","","生技醫療業","張鴻仁","黃金鼎"
="6657","華安","興","11/27","61","-0.8","-1.29","10","5.89","4.94","30.2","8.3","2.3","","","","","有","","生技醫療業","邱壬乙","陳翰民"
="6661","威健生技","興","11/27","36.2","-0.1","-0.28","10","2.07","2.07","7.49","17.8","3.1","","","","","","","生技醫療業","陳富鈐","陳富鈐"
="6665","康聯生醫","興","11/27","56.1","-0.1","-0.18","10","4.55","4.56","25.6","11.9","3","","","","","","","生技醫療業","吳良襄","吳良襄"
="6673","和詮","興","11/27","10.75","+0.05","+0.47","10","2.64","2.64","2.83","13.3","2.7","","","","","","","光電業","陳明立","莊育祿"
="6677","瑩碩生技","興","11/27","30.5","+0.5","+1.67","10","4.59","4.59","14","17.6","2.4","","","","","","","生技醫療業","王建治","王建治"
="6682","碩鑽材料","興","11/27","12.1","+0.15","+1.26","10","9.38","9.38","11.4","4.9","2.6","","","","","","","光電業","陳繼明","陳逸舟"
="6684","安格","興","11/27","56.1","+0.1","+0.18","10","2.13","2.14","12","10.1","2.5","","","","","","","半導體業","胡漢良","藍世旻"
="6688","海樂影業","興","11/27","20.5","0","0","10","1.9","1.9","3.9","16.2","2.4","","","","","","","文化創意業","吳浩佑","吳智弘"
="6689","伊雲谷","興","11/27","167.5","0","0","10","4.92","4.92","82.5","7.2","2.4","","","","","","","其他電子業","林啟雄","蔡佳宏"
="6691","洋基工程","興","11/27","176.5","-2","-1.12","10","4.11","4.11","72.5","40.4","2.3","","","","","","","其他電子業","賴有忠","鄧玉星、劉士源"
="6692","進能服","興","11/27","46","-0.05","-0.11","10","3.25","3.26","15","6.1","2.2","","","","","","","光電業","黃舉昇","厲國欽"
="6693","廣閎科","興","11/27","43.35","+7.1","+19.6","10","4.06","4.06","17.6","13.1","1.9","","","","","","","半導體業","林明璋","林明璋"
="6695","芯鼎","興","11/27","20.15","0","0","10","7.36","7.36","14.8","10.9","1.9","","","","","","","半導體業","詹文雄","許英偉"
="6696","仁新","興","11/27","106.5","+0.5","+0.47","10","6.85","6.86","73.1","4.6","2.1","","","","","","","生技醫療業","林雨新","林雨新"
="6699","奇邑","興","11/27","70","-2","-2.78","10","2.77","2.77","19.4","18.6","1.1","","","","","","","半導體業","李欣欣","李欣欣"
="6705","振躍精密","興","11/27","28.2","0","0","10","1.7","1.7","4.81","24.2","2.1","","","","","","","電機機械","陳萬來","施惠珠"
="6708","天擎","興","11/27","52.5","-3.5","-6.25","10","2.44","2.44","12.8","19.8","0.9","","","","","","","半導體業","呂惠平","呂惠平"
="6709","昱厚生技","興","11/27","33.05","-0.3","-0.9","10","4.45","4.45","14.7","14.2","2","","","","","","","生技醫療業","陳璧榮","徐悠深"
="6712","長聖","興","11/27","187.5","-1","-0.53","10","5.6","5.63","106","4","2.1","","","","","","","生技醫療業","劉銖淇","黃文良"
="6717","智慧光","興","11/27","16.15","-0.05","-0.31","10","2.49","2.49","4.03","18.4","2","","","","","","","其他電子業","樵治管理顧問股份有限公司 代表人：歐仕邁","林李忠"
="6720","久昌","興","11/27","29","+0.6","+2.11","10","1.91","1.91","5.55","9.3","1.6","","","","","","","半導體業","葉錦祥","葉錦祥"
="6721","信實保全","興","11/27","53.2","0","0","10","2","2","10.6","12.3","1.7","","","","","","","其他業","陸耀祖","楊文榮"
="6723","傑智環境","興","11/27","30","0","0","10","2.05","2.05","6.15","14.7","1.9","","","","","","","其他業","張豐堂","張豐堂"
="6724","創王","興","11/27","11","+0.65","+6.28","10","4.62","4.26","4.69","4.4","1.9","","","","","有","","光電業","朱克泰","朱克泰"
="6727","亞泰金屬","興","11/27","69","-0.1","-0.14","10","1.81","1.81","12.5","47.1","1.5","","","","","","","電子零組件業","鄒貴銓","黃源財"
="6728","上洋","興","11/27","65.7","+0.2","+0.31","10","2","2","13.2","18.9","1.6","","","","","","","其他業","吳明富","吳國華"
="6729","機光科技","興","11/27","14.05","0","0","10","2.52","2.52","3.54","19.3","1.4","","","","","","","光電業","顏豐文","顏豐文"
="6730","常廣","興","11/27","38.4","-0.8","-2.04","10","3.2","3.2","12.3","16.7","1.1","","","","","","","生技醫療業","陳政宏","洪塗清"
="6731","啟坤","興","11/27","22.6","0","0","10","4.19","4.19","9.47","44.5","1.7","","","","","","","其他業","莊宇龍","黃振騰"
="6733","博晟生醫","興","11/27","39.55","+0.6","+1.54","10","9.2","9.2","36.4","4.4","1.5","","","","","","","生技醫療業","陳德禮","陳德禮"
="6734","安盛生","興","11/27","19.7","-0.2","-1.01","10","4.94","4.94","9.73","8.3","1.4","","","","","","","生技醫療業","Peter Fitzgerald","陳彥宇"
="6735","美達科技","興","11/27","90","0","0","10","3.52","3.52","31.7","18.6","1.1","","","","","","","其他電子業","陳林杰","陳林杰"
="6736","碩辣椒","興","11/27","56.9","0","0","10","1.17","1.17","6.65","7.7","1.3","","","","","","","文化創意業","鄧潤澤","葉樂天"
="6737","秀育","興","11/27","62.2","+0.6","+0.97","10","6.01","6.01","37.4","41.9","0.9","","","","","","","電腦及週邊設備業","梁徽彬","吳川仕"
="6738","鼎恒","興","11/27","53.5","-0.1","-0.19","10","1.95","1.91","10.2","7.4","1.3","","","","","","有","資訊服務業","簡士評","簡士評"
="6740","松果購物","興","11/27","31.25","-0.55","-1.73","10","1.58","1.58","4.93","4.7","1.1","","","","","","","電子商務","郭家齊","吳佩雯"
="6743","安普新","興","11/27","137","+4.5","+3.4","10","11","11","151","22.4","1","","","","","","","其他電子業","黃常青","黃常青"
="6744","豐技生技","興","11/27","33.5","-0.45","-1.33","10","1.54","1.54","5.16","28.6","1.2","","","","","","","生技醫療業","吳春成","張宏名"
="6747","亨泰光","興","11/27","138.5","-0.5","-0.36","10","2.2","2.2","30.5","44.6","1.2","","","","","","","生技醫療業","吳泰雄","吳泰雄"
="6750","泰創工程","興","11/27","20.15","0","0","10","2.82","2.82","5.68","27.4","1.1","","","","","","","其他電子業","陳萬富","陳萬富"
="6751","智聯服務","興","11/27","110.5","+5.5","+5.24","10","1.11","1.11","12.3","3.2","1","","","","","","","資訊服務業","施宣輝","韓政達"
="6752","叡揚資訊","興","11/27","68.1","+0.1","+0.15","10","2.42","2.42","16.5","33.7","0.9","","","","","","","資訊服務業","張培鏞","陳世安"
="6755","連鋐科技","興","11/27","86.5","-2.5","-2.81","10","3.41","3.41","29.5","15","1","","","","","","","電子零組件業","陳嘉輝","陳嘉輝"
="6756","威鋒電子","興","11/27","329","-20","-5.73","10","6","6","197","12.4","0.9","","","","","","","半導體業","陳文琦","林志峰"
="6757","台灣虎航","興","11/27","32.6","-0.45","-1.36","10","20","20","65.2","6.6","1","","","","","","","航運業","陳漢銘","張明瑋"
="6758","冠亞","興","11/27","59.4","-0.1","-0.17","10","1.35","1.35","8","19.5","0.9","","","","","","","生技醫療業","林延生","趙悅因"
="6761","穩得","興","11/27","54.5","+1.8","+3.42","10","2.13","2.13","11.6","41.4","0.9","","","","","","","電子零組件業","高治宏","高治宏"
="6762","達亞","興","11/27","318","-1","-0.31","10","1.84","1.84","58.6","16","1","","","","","","","生技醫療業","張有德","許雅雯"
="6763","綠界科技","興","11/27","347.5","+11","+3.27","10","1.29","1.29","44.8","24.5","0.6","","","","","","","電子商務","林雪慧","林雪慧"
="6764","亞洲教育","興","11/27","152","0","0","10","2.76","2.76","42","3.3","1","","","","","","","其他業","吳明錦","吳明錦"
="6767","台微醫","興","11/27","43","+1.2","+2.87","10","2.64","2.64","11.3","10.9","1","","","","","","","生技醫療業","梁晃千","梁晃千"
="6771","平和環保","興","11/27","71.3","-0.7","-0.97","10","2.92","2.92","20.8","14.3","0.9","","","","","","","其他業","吳明陽","洪銘仁"
="6775","穎台科技","興","11/27","74.2","+3.6","+5.1","10","7.25","7.25","53.8","5.1","0.5","","","","","","","光電業","王志鴻","林俊役"
="6776","展碁國際","興","11/27","39.05","-0.1","-0.26","10","7.37","7.37","28.8","42.9","0.7","","","","","","","電子通路業","陳俊聖","林佳璋"
="6780","學習王","興","11/27","46.2","0","0","10","1.37","1.37","6.32","8.9","0.4","","","","","","","文化創意業","郭英標","郭英標"
="6782","視陽","興","11/27","117","-0.5","-0.43","10","5.47","5.47","64","22.1","0.3","","","","","","","生技醫療業","李重儀","李重儀"
="6784","天凱科技","興","11/27","21.8","-1.2","-5.22","10","1.77","1.78","3.88","14.7","0","","","","","","","通信網路業","劉明湘","劉明湘"
="6785","昱展新藥","興","11/27","44.05","+0.5","+1.15","10","5.7","5.7","25.1","4.2","0.2","","","","","","","生技醫療業","林東和","文永順"
="6786","芯測","興","11/27","74","-1.5","-1.99","10","2.04","2.04","15.1","11","0.3","","","","","","","半導體業","陳冠豪","賴俊澤"
="6788","華景電","興","11/27","86.3","+0.1","+0.12","10","3.16","3.16","27.3","20.2","0.1","","","","","","","半導體業","陳榮華","羅宏輝"
="6790","永豐實","興","11/27","47.1","+0.25","+0.53","10","24.5","24.5","115","34.1","0.1","","","","","","","其他業","何奕達","徐志宏"
="6792","詠業","興","11/27","108","-0.5","-0.46","10","4.38","4.38","47.3","32.6","0","","","","","","","通信網路業","蘇開建","李瑞榮"
="6793","天力離岸","興","11/27","95.4","+9.6","+11.2","10","4.9","4.9","46.7","10.9","0.1","","","","","","","其他業","吳坤達","蕭維成"
="6797","圓點奈米","興","11/27","268.5","+9","+3.47","10","2.12","2.12","56.8","16.6","0.1","","","","","","","生技醫療業","章季芸","簡建興"
="6799","來頡","興","11/27","107","0","0","10","3.67","3.67","39.3","10.2","0","","","","","","","半導體業","陳燦榮","孟達"
="6805","富世達","興","11/27","118.5","-2","-1.66","10","3.82","3.82","45.2","19.5","0","","","","","","","電子零組件業","黃祖模","沈旻勳"
="7419","達勝","興","11/27","15.4","0","0","10","4","4","6.16","16.2","1.2","","","","","","","電子零組件業","孫德崢","白宗城"
="7443","凡事康","興","11/27","9.79","0","0","10","2.2","2.2","2.15","20.5","4.8","","","","","","","其他業","賴炎村","賴炎村"
="7507","環拓科技","興","11/27","19","+0.1","+0.53","10","10.2","10.2","19.4","15.1","0.7","","","","","","","其他業","袁連惟","吳俊耀"
="7516","清淨海","興","11/27","10","-0.4","-3.85","10","2.51","2.51","2.51","13.6","1.9","","","","","","","其他業","林世隆","林世隆"
="7551","知識科技","興","11/27","47.65","+0.65","+1.38","10","1.1","1.1","5.24","15.3","1","","","","","","","電子商務","任正偉","任正偉"
="7555","美萌","興","11/27","68.1","0","0","10","1.86","1.86","12.7","12.2","0","","","","","","","生技醫療業","魏聰哲","魏聰哲"
="7561","光晟生技","興","11/27","32","+0.5","+1.59","10","2.67","2.67","8.55","15.7","0.4","","","","","","","食品工業","呂春美","呂春美"
="7566","亞果遊艇","興","11/27","41.95","-0.35","-0.83","10","4.88","4.88","20.5","6.4","0.4","","","","","","","觀光事業","侯佑霖","張慶祥"
="8045","達運光電","興","11/27","10.7","-0.1","-0.93","10","8.15","8.15","8.72","28.1","3.5","","","","","","","通信網路業","陳碧霜","戴國源"
="8115","帝聞","興","11/27","18.15","+0.2","+1.11","10","7","7","12.7","49.2","14.5","","","","","","","電子零組件業","鄭行道","傅健順"
="8119","公信","興","11/27","16.75","+0.05","+0.3","10","6.36","6.36","10.7","37.6","3.4","","","","","","","電腦及週邊設備業","曾垂紀","吳惠瑜"
="8179","旭德","興","11/27","14.4","+0.1","+0.7","10","29","29.1","42","22.3","13.1","","","","","","","半導體業","曾子章","勞紹文"
="8281","歐普羅","興","11/27","5","0","0","10","3.25","3.25","1.63","27","5.5","","","","","","","光電業","張慶杉","張慶杉"
="8298","威睿","興","11/27","27.3","-1.2","-4.21","10","2.53","2.54","6.95","20.4","2.7","","","","","","","資訊服務業","繆德澤","繆德澤"
="8329","台視","興","11/27","7.51","+0.03","+0.4","10","28.1","28.1","21.1","58.6","13.2","","","","","","","文化創意業","黃崧","周法勛"
="8359","錢櫃","興","11/27","109","+0.5","+0.46","10","13.6","13.6","149","34.1","8.6","","","","","","","觀光事業","練台生","連福財"
="8438","昶昕","興","11/27","19.25","0","0","10","6.29","6.29","12.1","31.1","8.8","","","","","","","其他業","陳國金","陳彥亨"
="8458","影一","興","11/27","24.15","0","0","10","1.08","1.08","2.62","13.3","6.1","","","","","","","文化創意業","董俊仁","李烈"
="8465","德河","興","11/27","5.57","+0.17","+3.15","10","2.02","2.02","1.12","12.6","5.6","","","","","","","農業科技業","吳智謀","吳智謀"
="8487","愛爾達","興","11/27","20.55","-0.95","-4.42","10","2.1","2.1","4.32","20.7","5","","","","","","","文化創意業","陳怡君","陳怡君"
="8490","利得","興","11/27","11.05","0","0","10","4.5","4.5","4.97","14","4.9","","","","","","","農業科技業","維豪國際有限公司","林進忠"
="8491","真好玩","興","11/27","29.95","+0.8","+2.74","10","2.75","2.75","8.22","7.2","4.9","","","","","","","文化創意業","周玄昆","劉志成"
="8492","兔將","興","11/27","21.55","0","0","10","2.15","2.15","4.63","9.8","4.5","","","","","","","文化創意業","李昭樺","李昭樺"
="9957","燁聯","興","11/27","5.08","0","0","10","262","220","112","31.9","17.9","","","","","有","","鋼鐵工業","林義守","蘇裕崑"
