<?xml version="1.0"?>
<!-- Modified from Robotis Open Manipulator Description package -->
<robot xmlns:xacro="http://ros.org/wiki/xacro">

  <!-- Gazebo Reference macro -->
  <xacro:macro name="_GazeboRefLink" params="ref">
    <gazebo reference="${ref}">
      <kp>1000000.0</kp>
      <kd>100.0</kd>
      <mu1>30.0</mu1>
      <mu2>30.0</mu2>
      <maxVel>1.0</maxVel>
      <minDepth>0.001</minDepth>
      <material>Gazebo/DarkGrey</material>
    </gazebo>
  </xacro:macro>

  <!-- World -->
  <gazebo reference="world">
  </gazebo>

  <!-- ros_control plugin -->
  <xacro:macro name="GazeboPlugin" params="robot_name">
    <gazebo>
      <plugin name="gazebo_ros_control" filename="libgazebo_ros_control.so">
        <robotNamespace>${robot_name}</robotNamespace>
        <controlPeriod>0.001</controlPeriod>
        <robotSimType>gazebo_ros_control/DefaultRobotHWSim</robotSimType>
      </plugin>
    </gazebo>
  </xacro:macro>

</robot>
