﻿Observation_Number,Household_Exp_Food_Y,Household_Income_X
1,9.46,25.83
2,10.56,34.31
3,14.81,42.50
4,21.71,46.75
5,22.79,48.29
6,18.19,48.77
7,22.00,49.65
8,18.12,51.94
9,23.13,54.33
10,19.00,54.87
11,19.46,56.46
12,17.83,58.83
13,32.81,59.13
14,22.13,60.73
15,23.46,61.12
16,16.81,63.10
17,21.35,65.96
18,14.87,66.40
19,33.00,70.42
20,25.19,70.48
21,17.77,71.98
22,22.44,72.00
23,22.87,72.23
24,26.52,72.23
25,21.00,73.44
26,37.52,74.25
27,21.69,74.77
28,27.40,76.33
29,30.69,81.02
30,19.56,81.85
31,30.58,82.56
32,41.12,83.33
33,15.38,83.40
34,17.87,91.81
35,25.54,91.81
36,39.00,92.96
37,20.44,95.17
38,30.10,101.40
39,20.90,114.13
40,48.71,115.46