Personalbereich true true true true false false
Mitarbeiter true true true false false false
Admin true true true true true true
USERS
mitarbeiter PvwZtTZmemcoVQ01b9sgTA== Mitarbeiter 40 false 35.65555555555555 3.655555555555557 4 9 13/06/2018 Urlaub Urlaub 14/06/2018 Urlaub Urlaub 15/06/2018 Urlaub Urlaub 16/06/2018 Urlaub Urlaub 17/06/2018 Urlaub Urlaub 18/06/2018 08:20:00 16:45:00 19/06/2018 11:32:00 18:45:12 20/06/2018 06:33:00 17:33:48 21/06/2018 06:35:00 18:35:20 
admin euLUpj0cPhoYeh/Yn0ce9Q== Admin 40 false 50.15333333333334 -13.846666666666668 8 9 11/06/2018 07:15:00 16:00:00 12/06/2018 07:04:00 18:02:00 13/06/2018 08:12:00 18:03:00 14/06/2018 10:13:00 14:14:00 15/06/2018 07:19:00 19:23:00 26/06/2018 07:00:00 16:00:00 27/06/2018 Krankheit Krankheit 31/01/2023 04:06:57 04:07:06 14/02/2023 01:10:48 01:10:54 
muellerh e0HBvCaC0NjItw5NHbK7kg== Mitarbeiter 40 false 0.0 0.0 0 0 
webers 7foaQdR3Xz2F/KeFDcmGnQ== Personalbereich 30 false 32.266666666666666 -3.7333333333333334 6 15 18/06/2018 Krankheit Krankheit 19/06/2018 Krankheit Krankheit 20/06/2018 08:04:45 15:04:45 21/06/2018 09:10:00 15:00:00 22/06/2018 08:04:45 15:05:45 25/06/2018 08:05:00 13:00:00 26/06/2018 09:00:00 15:00:00 27/06/2018 11:00:00 17:00:00 02/07/2018 Urlaub Urlaub 03/07/2018 Urlaub Urlaub 04/07/2018 Urlaub Urlaub 05/07/2018 Urlaub Urlaub 06/07/2018 Urlaub Urlaub 07/07/2018 Urlaub Urlaub 08/07/2018 Urlaub Urlaub 
SYSTEM
Urlaub Krankheit 
07:00:00 09:00:00
15:00:00 18:00:00
12:00:00 12:45:00