PlaceId;PlaceName;PlaceType;Lat;Long
1;Place nr 1;Bar;51,2142802592831;4,41005959840717
2;Place nr 2;Park;51,2057184877188;4,40134066775682
3;Place nr 3;Restaurant;51,2201055811004;4,41085937696187
4;Place nr 4;Theater;51,2012784322647;4,39562916171029
5;Place nr 5;Grocery shop;51,2198263992361;4,40619455903767
6;Place nr 6;Bar;51,2025751837637;4,39925712946488
7;Place nr 7;Mall;51,2117309350807;4,40467022576248
8;Place nr 8;Hospital;51,2051254787834;4,39654628021567
9;Place nr 9;Bar;51,2192542506186;4,40705143916633
10;Place nr 10;Theater;51,2025783936069;4,39725094943679
11;Place nr 11;Grocery shop;51,2102153519108;4,40438080561702
12;Place nr 12;Theater;51,2081591867338;4,39671537601082
13;Place nr 13;Restaurant;51,2128585238011;4,41195187034309
14;Place nr 14;Grocery shop;51,2048657643596;4,39737954933808
15;Place nr 15;Hospital;51,2186351157729;4,41176621070764
16;Place nr 16;Park;51,2020824953527;4,39346776424509
17;Place nr 17;Hospital;51,2187149477057;4,40421272633189
18;Place nr 18;School;51,2055995556312;4,40221916658022
19;Place nr 19;Grocery shop;51,2153240652836;4,40541521702762
20;Place nr 20;Grocery shop;51,2083256124113;4,3998489347412
21;Place nr 21;Bar;51,2189448405108;4,40490934496556
22;Place nr 22;Restaurant;51,2002601922707;4,39924178282709
23;Place nr 23;School;51,216469759424;4,41227575982517
24;Place nr 24;Mall;51,2101574847046;4,40048539201855
25;Place nr 25;Hospital;51,2103133601983;4,40528946380068
26;Place nr 26;School;51,2016852495955;4,39282220623054
27;Place nr 27;Grocery shop;51,2125115182613;4,40418802302706
28;Place nr 28;Hospital;51,2014356164892;4,39595380341187
29;Place nr 29;Theater;51,2135249746069;4,40801094625972
30;Place nr 30;Hospital;51,2085723502977;4,39720111431078
31;Place nr 31;School;51,2157363393351;4,40868323075506
32;Place nr 32;Park;51,2066049584649;4,39445422592996
33;Place nr 33;Park;51,2117350706879;4,40510359036241
34;Place nr 34;Bar;51,2044186189367;4,40087366437707
35;Place nr 35;Bar;51,2175254364649;4,408727209869
36;Place nr 36;Grocery shop;51,202916072705;4,39921450058858
37;Place nr 37;Restaurant;51,2175380104579;4,41007882287456
38;Place nr 38;Restaurant;51,2024967707301;4,39821951235344
39;Place nr 39;Hospital;51,217432759905;4,40367414524476
40;Place nr 40;Hospital;51,2054707416657;4,39370222745878
41;Place nr 41;School;51,2162315275548;4,40826724369586
42;Place nr 42;Grocery shop;51,2059586201284;4,40025151402937
43;Place nr 43;Grocery shop;51,2113545851028;4,40452197079991
44;Place nr 44;Theater;51,2070035568556;4,4023667686246
45;Place nr 45;Grocery shop;51,2162342313391;4,40747339625506
46;Place nr 46;Grocery shop;51,2041623173111;4,39506647415139
47;Place nr 47;Grocery shop;51,2137463277693;4,40907898844801
48;Place nr 48;Grocery shop;51,2099026180217;4,40201374065011
49;Place nr 49;Restaurant;51,2141290822177;4,40915114100085
50;Place nr 50;Theater;51,2097604188272;4,39335092929634
51;Place nr 51;Restaurant;51,2170678208719;4,40552356768956
52;Place nr 52;Bar;51,2062521178206;4,39967590140951
53;Place nr 53;Grocery shop;51,2144060889786;4,41026866313438
54;Place nr 54;Park;51,2065952671603;4,39449957339492
55;Place nr 55;School;51,2116678475053;4,40651112328848
56;Place nr 56;Hospital;51,2064752291962;4,39281297838592
57;Place nr 57;Hospital;51,2174470976368;4,40393093307013
58;Place nr 58;Mall;51,2015897985362;4,39907893414414
59;Place nr 59;School;51,2187516016345;4,41027591756468
60;Place nr 60;Mall;51,2009976805255;4,4011124915301
61;Place nr 61;Restaurant;51,2162216457752;4,40757601305501
62;Place nr 62;Restaurant;51,2005916166602;4,40030703491034
63;Place nr 63;School;51,219772957472;4,40740781605526
64;Place nr 64;Park;51,2075019587074;4,39820339725352
65;Place nr 65;Mall;51,2123511805974;4,40423067133536
66;Place nr 66;Hospital;51,2032919124943;4,40238245744468
67;Place nr 67;Theater;51,2196313424099;4,40526112864228
68;Place nr 68;Bar;51,2028485105106;4,39937420916923
69;Place nr 69;Grocery shop;51,2176274107961;4,40329388734135
70;Place nr 70;Grocery shop;51,2089340453691;4,39474540258218
71;Place nr 71;Mall;51,2192670815566;4,40709290676775
72;Place nr 72;Bar;51,2038178872036;4,39308805216409
73;Place nr 73;School;51,214075434276;4,41149284371828
74;Place nr 74;School;51,2083849446329;4,39438594343675
75;Place nr 75;Theater;51,2140576025508;4,40413878860433
76;Place nr 76;Hospital;51,2096265060095;4,39861748420501
77;Place nr 77;Bar;51,2170974822828;4,40878822018985
78;Place nr 78;Restaurant;51,2016770655206;4,40060052878932
79;Place nr 79;Hospital;51,2140685442396;4,40870139294904
80;Place nr 80;Hospital;51,2029085928327;4,40244088919402
81;Place nr 81;Mall;51,2104965304425;4,4091521533712
82;Place nr 82;Grocery shop;51,2028065259841;4,39953034686464
83;Place nr 83;Grocery shop;51,2145905190287;4,40842169497951
84;Place nr 84;Theater;51,2037965795736;4,40014808095961
85;Place nr 85;School;51,217926251663;4,40716956430649
86;Place nr 86;Hospital;51,2086718386013;4,39706398127022
87;Place nr 87;Park;51,2122268197411;4,40820912165503
88;Place nr 88;Grocery shop;51,2009868064773;4,39563575965296
89;Place nr 89;Restaurant;51,2147838181981;4,41063931679089
90;Place nr 90;Hospital;51,2092126665686;4,39852971460933
91;Place nr 91;Mall;51,2180786362057;4,40516105784359
92;Place nr 92;Restaurant;51,2061240232224;4,39686570720824
93;Place nr 93;Restaurant;51,2144719370979;4,41051806949336
94;Place nr 94;Mall;51,2023659673524;4,40117319446172
95;Place nr 95;School;51,2160757653954;4,40316661216994
96;Place nr 96;Grocery shop;51,2030056520973;4,3931350038294
97;Place nr 97;Restaurant;51,2178935118561;4,40817155938355
98;Place nr 98;School;51,2022824818452;4,39497763783063
99;Place nr 99;Mall;51,2172987991683;4,40663714223318
100;Place nr 100;School;51,2069694307819;4,39379170161191
101;Rik's Local grocery shop;Grocery shop;51,2052588410869;4,39854214739502
