info face="Segoe UI" size=18 bold=1 italic=0 charset="unicode" stretchH=100 smooth=1 aa=2 padding=0,0,0,0 spacing=2,2 
common lineHeight=18 base=15 scaleW=1024 scaleH=512 pages=1
char id=32   x=725   y=12    width=2     height=1     xoffset=0     yoffset=17    xadvance=3     page=0  
char id=33   x=910   y=0     width=3     height=10    xoffset=0     yoffset=5     xadvance=4     page=0  
char id=34   x=621   y=12    width=5     height=4     xoffset=1     yoffset=5     xadvance=6     page=0  
char id=35   x=161   y=14    width=8     height=9     xoffset=0     yoffset=5     xadvance=7     page=0  
char id=36   x=248   y=0     width=7     height=12    xoffset=0     yoffset=4     xadvance=7     page=0  
char id=37   x=546   y=0     width=12    height=10    xoffset=0     yoffset=5     xadvance=11    page=0  
char id=38   x=612   y=0     width=11    height=10    xoffset=0     yoffset=5     xadvance=11    page=0  
char id=39   x=1020  y=0     width=2     height=4     xoffset=1     yoffset=5     xadvance=4     page=0  
char id=40   x=257   y=0     width=5     height=12    xoffset=0     yoffset=5     xadvance=5     page=0  
char id=41   x=264   y=0     width=5     height=12    xoffset=0     yoffset=5     xadvance=5     page=0  
char id=42   x=604   y=12    width=6     height=6     xoffset=0     yoffset=5     xadvance=6     page=0  
char id=43   x=462   y=12    width=7     height=7     xoffset=1     yoffset=7     xadvance=9     page=0  
char id=44   x=669   y=12    width=3     height=3     xoffset=0     yoffset=13    xadvance=3     page=0  
char id=45   x=688   y=12    width=5     height=2     xoffset=0     yoffset=10    xadvance=5     page=0  
char id=46   x=663   y=12    width=4     height=3     xoffset=0     yoffset=12    xadvance=3     page=0  
char id=47   x=409   y=0     width=7     height=11    xoffset=0     yoffset=5     xadvance=6     page=0  
char id=48   x=701   y=0     width=8     height=10    xoffset=0     yoffset=5     xadvance=7     page=0  
char id=49   x=890   y=0     width=5     height=10    xoffset=1     yoffset=5     xadvance=7     page=0  
char id=50   x=824   y=0     width=7     height=10    xoffset=0     yoffset=5     xadvance=7     page=0  
char id=51   x=779   y=0     width=7     height=10    xoffset=0     yoffset=5     xadvance=7     page=0  
char id=52   x=711   y=0     width=8     height=10    xoffset=0     yoffset=5     xadvance=7     page=0  
char id=53   x=797   y=0     width=7     height=10    xoffset=0     yoffset=5     xadvance=7     page=0  
char id=54   x=770   y=0     width=7     height=10    xoffset=0     yoffset=5     xadvance=7     page=0  
char id=55   x=691   y=0     width=8     height=10    xoffset=0     yoffset=5     xadvance=7     page=0  
char id=56   x=681   y=0     width=8     height=10    xoffset=0     yoffset=5     xadvance=7     page=0  
char id=57   x=671   y=0     width=8     height=10    xoffset=0     yoffset=5     xadvance=7     page=0  
char id=58   x=479   y=12    width=4     height=7     xoffset=0     yoffset=8     xadvance=3     page=0  
char id=59   x=393   y=13    width=4     height=8     xoffset=0     yoffset=8     xadvance=3     page=0  
char id=60   x=569   y=12    width=7     height=6     xoffset=1     yoffset=8     xadvance=9     page=0  
char id=61   x=612   y=12    width=7     height=4     xoffset=1     yoffset=9     xadvance=9     page=0  
char id=62   x=578   y=12    width=7     height=6     xoffset=1     yoffset=8     xadvance=9     page=0  
char id=63   x=874   y=0     width=6     height=10    xoffset=0     yoffset=5     xadvance=5     page=0  
char id=64   x=297   y=0     width=12    height=11    xoffset=0     yoffset=5     xadvance=12    page=0  
char id=91   x=285   y=0     width=4     height=12    xoffset=1     yoffset=5     xadvance=5     page=0  
char id=92   x=400   y=0     width=7     height=11    xoffset=0     yoffset=5     xadvance=5     page=0  
char id=93   x=291   y=0     width=4     height=12    xoffset=0     yoffset=5     xadvance=5     page=0  
char id=94   x=587   y=12    width=7     height=6     xoffset=1     yoffset=5     xadvance=9     page=0  
char id=95   x=679   y=12    width=7     height=2     xoffset=0     yoffset=15    xadvance=5     page=0  
char id=96   x=695   y=12    width=4     height=2     xoffset=0     yoffset=5     xadvance=4     page=0  
char id=123  x=271   y=0     width=5     height=12    xoffset=0     yoffset=5     xadvance=5     page=0  
char id=124  x=6     y=0     width=3     height=14    xoffset=1     yoffset=4     xadvance=4     page=0  
char id=125  x=278   y=0     width=5     height=12    xoffset=0     yoffset=5     xadvance=5     page=0  
char id=126  x=633   y=12    width=7     height=3     xoffset=1     yoffset=9     xadvance=9     page=0  
char id=65 x=628   y=12    width=3     height=4     xoffset=0     yoffset=11    xadvance=3     page=0  
char id=66 x=842   y=0     width=6     height=10    xoffset=0     yoffset=5     xadvance=6     page=0  
char id=67 x=701   y=12    width=4     height=2     xoffset=0     yoffset=7     xadvance=4     page=0  
char id=68 x=642   y=12    width=6     height=3     xoffset=0     yoffset=6     xadvance=4     page=0  
char id=69 x=707   y=12    width=4     height=2     xoffset=0     yoffset=15    xadvance=4     page=0  
char id=70 x=719   y=12    width=4     height=1     xoffset=0     yoffset=8     xadvance=4     page=0  
char id=71 x=657   y=12    width=4     height=3     xoffset=0     yoffset=6     xadvance=4     page=0  
char id=72 x=713   y=12    width=4     height=1     xoffset=0     yoffset=15    xadvance=4     page=0  
char id=73 x=650   y=12    width=5     height=3     xoffset=0     yoffset=6     xadvance=4     page=0  
char id=74 x=674   y=12    width=3     height=3     xoffset=0     yoffset=6     xadvance=4     page=0  
char id=75 x=596   y=12    width=6     height=6     xoffset=0     yoffset=9     xadvance=5     page=0  
char id=76 x=98    y=0     width=5     height=13    xoffset=-1    yoffset=2     xadvance=3     page=0  
char id=77 x=91    y=0     width=5     height=13    xoffset=-1    yoffset=2     xadvance=3     page=0  
char id=78 x=11    y=0     width=3     height=14    xoffset=0     yoffset=1     xadvance=3     page=0  
char id=79 x=0     y=0     width=4     height=14    xoffset=0     yoffset=1     xadvance=3     page=0  
char id=80 x=83    y=0     width=6     height=13    xoffset=0     yoffset=5     xadvance=6     page=0  
char id=81 x=26    y=0     width=8     height=13    xoffset=0     yoffset=5     xadvance=6     page=0  
char id=82 x=111   y=0     width=3     height=13    xoffset=0     yoffset=5     xadvance=3     page=0  
char id=83 x=105   y=0     width=4     height=13    xoffset=0     yoffset=5     xadvance=3     page=0  
char id=84 x=650   y=0     width=9     height=10    xoffset=0     yoffset=6     xadvance=10    page=0  
char id=85 x=54    y=15    width=11    height=9     xoffset=0     yoffset=7     xadvance=11    page=0  
char id=86 x=897   y=0     width=5     height=10    xoffset=0     yoffset=5     xadvance=4     page=0  
char id=87 x=866   y=0     width=6     height=10    xoffset=0     yoffset=5     xadvance=4     page=0  
char id=88 x=920   y=0     width=2     height=10    xoffset=0     yoffset=5     xadvance=3     page=0  
char id=89 x=915   y=0     width=3     height=10    xoffset=0     yoffset=5     xadvance=3     page=0  
char id=90 x=261   y=14    width=11    height=8     xoffset=0     yoffset=9     xadvance=12    page=0  
char id=97 x=247   y=14    width=12    height=8     xoffset=0     yoffset=9     xadvance=12    page=0  
char id=98 x=387   y=13    width=4     height=8     xoffset=0     yoffset=9     xadvance=4     page=0  
char id=99 x=349   y=13    width=6     height=8     xoffset=0     yoffset=9     xadvance=4     page=0  
char id=100 x=858   y=0     width=6     height=10    xoffset=0     yoffset=5     xadvance=6     page=0  
char id=101 x=833   y=0     width=7     height=10    xoffset=0     yoffset=5     xadvance=6     page=0  
char id=102 x=41    y=15    width=11    height=9     xoffset=0     yoffset=6     xadvance=12    page=0  
char id=103 x=0     y=16    width=12    height=9     xoffset=0     yoffset=6     xadvance=12    page=0  
char id=104 x=216   y=14    width=6     height=9     xoffset=0     yoffset=6     xadvance=4     page=0  
char id=105 x=208   y=14    width=6     height=9     xoffset=0     yoffset=6     xadvance=4     page=0  
char id=106 x=325   y=0     width=11    height=11    xoffset=0     yoffset=4     xadvance=12    page=0  
char id=107 x=311   y=0     width=12    height=11    xoffset=0     yoffset=4     xadvance=12    page=0  
char id=108 x=427   y=0     width=6     height=11    xoffset=0     yoffset=4     xadvance=4     page=0  
char id=109 x=435   y=0     width=6     height=11    xoffset=0     yoffset=4     xadvance=4     page=0  
char id=110 x=788   y=0     width=7     height=10    xoffset=0     yoffset=8     xadvance=7     page=0  
char id=111 x=721   y=0     width=8     height=10    xoffset=0     yoffset=8     xadvance=7     page=0  
char id=112 x=320   y=13    width=9     height=8     xoffset=-1    yoffset=9     xadvance=7     page=0  
char id=113 x=298   y=13    width=9     height=8     xoffset=-1    yoffset=9     xadvance=7     page=0  
char id=114 x=815   y=0     width=7     height=10    xoffset=0     yoffset=8     xadvance=7     page=0  
char id=115 x=741   y=0     width=8     height=10    xoffset=0     yoffset=8     xadvance=7     page=0  
char id=116 x=548   y=12    width=9     height=6     xoffset=-1    yoffset=9     xadvance=7     page=0  
char id=117 x=537   y=12    width=9     height=6     xoffset=-1    yoffset=9     xadvance=7     page=0  
char id=118 x=239   y=0     width=7     height=12    xoffset=0     yoffset=6     xadvance=7     page=0  
char id=119 x=229   y=0     width=8     height=12    xoffset=0     yoffset=6     xadvance=7     page=0  
char id=120 x=309   y=13    width=9     height=8     xoffset=-1    yoffset=7     xadvance=7     page=0  
char id=121 x=287   y=14    width=9     height=8     xoffset=-1    yoffset=7     xadvance=7     page=0  
char id=122 x=471   y=12    width=6     height=7     xoffset=0     yoffset=8     xadvance=6     page=0  
char id=172 x=453   y=12    width=7     height=7     xoffset=0     yoffset=8     xadvance=6     page=0  
char id=174 x=882   y=0     width=6     height=10    xoffset=0     yoffset=5     xadvance=6     page=0  
char id=175 x=761   y=0     width=7     height=10    xoffset=0     yoffset=5     xadvance=6     page=0  
char id=176 x=373   y=13    width=5     height=8     xoffset=0     yoffset=10    xadvance=5     page=0  
char id=177 x=331   y=13    width=7     height=8     xoffset=0     yoffset=10    xadvance=5     page=0  
char id=178 x=443   y=0     width=5     height=11    xoffset=0     yoffset=7     xadvance=5     page=0  
char id=179 x=382   y=0     width=7     height=11    xoffset=0     yoffset=7     xadvance=5     page=0  
char id=180 x=958   y=0     width=14    height=9     xoffset=0     yoffset=9     xadvance=15    page=0  
char id=181 x=924   y=0     width=15    height=9     xoffset=0     yoffset=9     xadvance=15    page=0  
char id=182 x=500   y=12    width=11    height=6     xoffset=-1    yoffset=9     xadvance=11    page=0  
char id=183 x=485   y=12    width=13    height=6     xoffset=-1    yoffset=9     xadvance=11    page=0  
char id=184 x=171   y=0     width=14    height=12    xoffset=0     yoffset=6     xadvance=15    page=0  
char id=185 x=154   y=0     width=15    height=12    xoffset=0     yoffset=6     xadvance=15    page=0  
char id=186 x=28    y=15    width=11    height=9     xoffset=-1    yoffset=6     xadvance=11    page=0  
char id=187 x=990   y=0     width=13    height=9     xoffset=-1    yoffset=6     xadvance=11    page=0  
char id=188 x=470   y=0     width=16    height=10    xoffset=0     yoffset=8     xadvance=17    page=0  
char id=189 x=450   y=0     width=18    height=10    xoffset=0     yoffset=8     xadvance=17    page=0  
char id=190 x=416   y=13    width=14    height=7     xoffset=-1    yoffset=8     xadvance=13    page=0  
char id=191 x=399   y=13    width=15    height=7     xoffset=-1    yoffset=8     xadvance=13    page=0  
char id=192 x=136   y=0     width=16    height=12    xoffset=0     yoffset=6     xadvance=17    page=0  
char id=193 x=116   y=0     width=18    height=12    xoffset=0     yoffset=6     xadvance=17    page=0  
char id=194 x=974   y=0     width=14    height=9     xoffset=-1    yoffset=6     xadvance=13    page=0  
char id=195 x=941   y=0     width=15    height=9     xoffset=-1    yoffset=6     xadvance=13    page=0  
char id=196 x=625   y=0     width=11    height=10    xoffset=0     yoffset=5     xadvance=11    page=0  
char id=197 x=532   y=0     width=12    height=10    xoffset=0     yoffset=5     xadvance=11    page=0  
char id=198 x=586   y=0     width=11    height=10    xoffset=-1    yoffset=5     xadvance=11    page=0  
char id=199 x=503   y=0     width=13    height=10    xoffset=-1    yoffset=5     xadvance=11    page=0  
char id=200 x=573   y=0     width=11    height=10    xoffset=0     yoffset=5     xadvance=11    page=0  
char id=201 x=518   y=0     width=12    height=10    xoffset=0     yoffset=5     xadvance=11    page=0  
char id=202 x=560   y=0     width=11    height=10    xoffset=-1    yoffset=5     xadvance=11    page=0  
char id=203 x=488   y=0     width=13    height=10    xoffset=-1    yoffset=5     xadvance=11    page=0  
char id=204 x=418   y=0     width=7     height=11    xoffset=0     yoffset=7     xadvance=6     page=0  
char id=205 x=731   y=0     width=8     height=10    xoffset=0     yoffset=8     xadvance=7     page=0  
char id=206 x=443   y=13    width=8     height=7     xoffset=-1    yoffset=8     xadvance=7     page=0  
char id=207 x=432   y=13    width=9     height=7     xoffset=0     yoffset=8     xadvance=7     page=0  
char id=208 x=74    y=0     width=7     height=13    xoffset=0     yoffset=5     xadvance=6     page=0  
char id=209 x=36    y=0     width=8     height=13    xoffset=0     yoffset=5     xadvance=7     page=0  
char id=210 x=151   y=14    width=8     height=9     xoffset=-1    yoffset=6     xadvance=7     page=0  
char id=211 x=100   y=15    width=9     height=9     xoffset=0     yoffset=6     xadvance=7     page=0  
char id=212 x=14    y=16    width=12    height=9     xoffset=0     yoffset=6     xadvance=13    page=0  
char id=213 x=1005  y=0     width=13    height=9     xoffset=0     yoffset=6     xadvance=13    page=0  
char id=214 x=199   y=14    width=7     height=9     xoffset=-1    yoffset=6     xadvance=6     page=0  
char id=215 x=141   y=14    width=8     height=9     xoffset=-1    yoffset=6     xadvance=6     page=0  
char id=216 x=361   y=0     width=9     height=11    xoffset=0     yoffset=7     xadvance=10    page=0  
char id=217 x=338   y=0     width=10    height=11    xoffset=0     yoffset=7     xadvance=10    page=0  
char id=218 x=190   y=14    width=7     height=9     xoffset=-1    yoffset=6     xadvance=6     page=0  
char id=219 x=131   y=14    width=8     height=9     xoffset=-1    yoffset=6     xadvance=6     page=0  
char id=220 x=638   y=0     width=10    height=10    xoffset=0     yoffset=5     xadvance=11    page=0  
char id=221 x=599   y=0     width=11    height=10    xoffset=0     yoffset=5     xadvance=11    page=0  
char id=222 x=391   y=0     width=7     height=11    xoffset=-1    yoffset=4     xadvance=6     page=0  
char id=223 x=372   y=0     width=8     height=11    xoffset=-1    yoffset=4     xadvance=6     page=0  
char id=224 x=209   y=0     width=8     height=12    xoffset=0     yoffset=5     xadvance=8     page=0  
char id=225 x=198   y=0     width=9     height=12    xoffset=0     yoffset=5     xadvance=8     page=0  
char id=226 x=904   y=0     width=4     height=10    xoffset=0     yoffset=5     xadvance=4     page=0  
char id=227 x=850   y=0     width=6     height=10    xoffset=0     yoffset=5     xadvance=4     page=0  
char id=228 x=181   y=14    width=7     height=9     xoffset=0     yoffset=9     xadvance=7     page=0  
char id=229 x=121   y=14    width=8     height=9     xoffset=0     yoffset=9     xadvance=7     page=0  
char id=230 x=559   y=12    width=8     height=6     xoffset=-1    yoffset=9     xadvance=7     page=0  
char id=231 x=526   y=12    width=9     height=6     xoffset=-1    yoffset=9     xadvance=7     page=0  
char id=232 x=111   y=15    width=8     height=9     xoffset=0     yoffset=9     xadvance=8     page=0  
char id=233 x=89    y=15    width=9     height=9     xoffset=0     yoffset=9     xadvance=8     page=0  
char id=234 x=240   y=14    width=5     height=9     xoffset=0     yoffset=6     xadvance=4     page=0  
char id=235 x=224   y=14    width=6     height=9     xoffset=0     yoffset=6     xadvance=4     page=0  
char id=236 x=357   y=13    width=6     height=8     xoffset=0     yoffset=7     xadvance=6     page=0  
char id=237 x=340   y=13    width=7     height=8     xoffset=0     yoffset=7     xadvance=6     page=0  
char id=238 x=78    y=15    width=9     height=9     xoffset=-1    yoffset=6     xadvance=8     page=0  
char id=239 x=661   y=0     width=8     height=10    xoffset=-1    yoffset=8     xadvance=6     page=0  
char id=240 x=232   y=14    width=6     height=9     xoffset=0     yoffset=9     xadvance=6     page=0  
char id=241 x=171   y=14    width=8     height=9     xoffset=0     yoffset=9     xadvance=6     page=0  
char id=242 x=67    y=15    width=9     height=9     xoffset=0     yoffset=7     xadvance=10    page=0  
char id=243 x=513   y=12    width=11    height=6     xoffset=0     yoffset=10    xadvance=11    page=0  
char id=244 x=350   y=0     width=9     height=11    xoffset=0     yoffset=7     xadvance=10    page=0  
char id=245 x=274   y=14    width=11    height=8     xoffset=0     yoffset=10    xadvance=11    page=0  
char id=246 x=380   y=13    width=5     height=8     xoffset=0     yoffset=9     xadvance=4     page=0  
char id=247 x=365   y=13    width=6     height=8     xoffset=0     yoffset=9     xadvance=4     page=0  
char id=248 x=219   y=0     width=8     height=12    xoffset=-1    yoffset=3     xadvance=7     page=0  
char id=249 x=187   y=0     width=9     height=12    xoffset=-1    yoffset=3     xadvance=7     page=0  
char id=250 x=65    y=0     width=7     height=13    xoffset=0     yoffset=2     xadvance=7     page=0  
char id=251 x=16    y=0     width=8     height=13    xoffset=0     yoffset=2     xadvance=7     page=0  
char id=252 x=56    y=0     width=7     height=13    xoffset=0     yoffset=5     xadvance=7     page=0  
char id=253 x=46    y=0     width=8     height=13    xoffset=0     yoffset=5     xadvance=7     page=0  
char id=254 x=806   y=0     width=7     height=10    xoffset=0     yoffset=5     xadvance=7     page=0  
char id=255 x=751   y=0     width=8     height=10    xoffset=0     yoffset=5     xadvance=7     page=0  
