info face="KacstOne" size=30 bold=1 italic=0 charset="unicode" stretchH=100 smooth=1 aa=2 padding=2,2,2,2 spacing=1,1 
common lineHeight=30 base=20 scaleW=1024 scaleH=512 pages=1
char id=32   x=414   y=33    width=6     height=5     xoffset=-2    yoffset=27    xadvance=4     page=0  
char id=33   x=171   y=20    width=8     height=15    xoffset=-1    yoffset=7     xadvance=5     page=0  
char id=34   x=316   y=34    width=11    height=9     xoffset=-1    yoffset=7     xadvance=8     page=0  
char id=35   x=864   y=0     width=13    height=15    xoffset=-2    yoffset=7     xadvance=7     page=0  
char id=36   x=281   y=0     width=12    height=18    xoffset=-2    yoffset=6     xadvance=7     page=0  
char id=37   x=727   y=0     width=17    height=15    xoffset=-1    yoffset=7     xadvance=15    page=0  
char id=38   x=817   y=0     width=16    height=15    xoffset=-2    yoffset=7     xadvance=13    page=0  
char id=39   x=1016  y=16    width=7     height=9     xoffset=-1    yoffset=7     xadvance=4     page=0  
char id=40   x=320   y=0     width=9     height=18    xoffset=-2    yoffset=7     xadvance=5     page=0  
char id=41   x=360   y=0     width=9     height=18    xoffset=-2    yoffset=7     xadvance=5     page=0  
char id=42   x=15    y=38    width=11    height=11    xoffset=-2    yoffset=7     xadvance=8     page=0  
char id=43   x=853   y=16    width=14    height=13    xoffset=-2    yoffset=10    xadvance=10    page=0  
char id=44   x=307   y=34    width=8     height=10    xoffset=-2    yoffset=15    xadvance=4     page=0  
char id=45   x=382   y=34    width=9     height=7     xoffset=-2    yoffset=13    xadvance=5     page=0  
char id=46   x=392   y=34    width=7     height=7     xoffset=-2    yoffset=15    xadvance=4     page=0  
char id=47   x=678   y=0     width=10    height=16    xoffset=-2    yoffset=7     xadvance=4     page=0  
char id=48   x=65    y=21    width=12    height=15    xoffset=-2    yoffset=7     xadvance=7     page=0  
char id=49   x=114   y=20    width=11    height=15    xoffset=-2    yoffset=7     xadvance=7     page=0  
char id=50   x=997   y=0     width=12    height=15    xoffset=-2    yoffset=7     xadvance=7     page=0  
char id=51   x=1010  y=0     width=12    height=15    xoffset=-2    yoffset=7     xadvance=7     page=0  
char id=52   x=0     y=22    width=12    height=15    xoffset=-2    yoffset=7     xadvance=7     page=0  
char id=53   x=13    y=22    width=12    height=15    xoffset=-2    yoffset=7     xadvance=7     page=0  
char id=54   x=984   y=0     width=12    height=15    xoffset=-2    yoffset=7     xadvance=7     page=0  
char id=55   x=26    y=21    width=12    height=15    xoffset=-2    yoffset=7     xadvance=7     page=0  
char id=56   x=39    y=21    width=12    height=15    xoffset=-2    yoffset=7     xadvance=7     page=0  
char id=57   x=52    y=21    width=12    height=15    xoffset=-2    yoffset=7     xadvance=7     page=0  
char id=58   x=1007  y=16    width=8     height=12    xoffset=-1    yoffset=10    xadvance=5     page=0  
char id=59   x=162   y=20    width=8     height=15    xoffset=-1    yoffset=10    xadvance=5     page=0  
char id=60   x=625   y=17    width=14    height=14    xoffset=-2    yoffset=9     xadvance=10    page=0  
char id=61   x=217   y=35    width=14    height=10    xoffset=-2    yoffset=11    xadvance=10    page=0  
char id=62   x=670   y=17    width=14    height=14    xoffset=-2    yoffset=9     xadvance=10    page=0  
char id=63   x=90    y=20    width=11    height=15    xoffset=-2    yoffset=7     xadvance=7     page=0  
char id=64   x=508   y=0     width=16    height=16    xoffset=-1    yoffset=7     xadvance=14    page=0  
char id=91   x=340   y=0     width=9     height=18    xoffset=-2    yoffset=7     xadvance=5     page=0  
char id=92   x=667   y=0     width=10    height=16    xoffset=-2    yoffset=7     xadvance=4     page=0  
char id=93   x=330   y=0     width=9     height=18    xoffset=-2    yoffset=7     xadvance=5     page=0  
char id=94   x=275   y=34    width=11    height=10    xoffset=-1    yoffset=7     xadvance=9     page=0  
char id=95   x=400   y=33    width=13    height=6     xoffset=-2    yoffset=19    xadvance=7     page=0  
char id=123  x=370   y=0     width=9     height=18    xoffset=-2    yoffset=7     xadvance=6     page=0  
char id=124  x=719   y=0     width=7     height=16    xoffset=-2    yoffset=7     xadvance=3     page=0  
char id=125  x=350   y=0     width=9     height=18    xoffset=-2    yoffset=7     xadvance=6     page=0  
char id=126  x=369   y=34    width=12    height=7     xoffset=-2    yoffset=13    xadvance=8     page=0  
char id=65 x=298   y=34    width=8     height=10    xoffset=-2    yoffset=13    xadvance=4     page=0  
char id=66 x=78    y=21    width=11    height=15    xoffset=-2    yoffset=7     xadvance=7     page=0  
char id=67 x=94    y=36    width=9     height=11    xoffset=-2    yoffset=-1    xadvance=4     page=0  
char id=68 x=27    y=37    width=11    height=11    xoffset=-3    yoffset=1     xadvance=4     page=0  
char id=69 x=84    y=37    width=9     height=11    xoffset=-2    yoffset=21    xadvance=4     page=0  
char id=70 x=359   y=34    width=9     height=9     xoffset=-2    yoffset=1     xadvance=4     page=0  
char id=71 x=73    y=37    width=10    height=11    xoffset=-3    yoffset=0     xadvance=4     page=0  
char id=72 x=339   y=34    width=9     height=9     xoffset=-2    yoffset=22    xadvance=4     page=0  
char id=73 x=328   y=34    width=10    height=9     xoffset=-2    yoffset=3     xadvance=4     page=0  
char id=74 x=349   y=34    width=9     height=9     xoffset=-2    yoffset=2     xadvance=4     page=0  
char id=75 x=287   y=34    width=10    height=10    xoffset=-2    yoffset=13    xadvance=6     page=0  
char id=76 x=699   y=0     width=9     height=16    xoffset=-2    yoffset=6     xadvance=4     page=0  
char id=77 x=709   y=0     width=9     height=16    xoffset=-2    yoffset=6     xadvance=4     page=0  
char id=78 x=498   y=0     width=9     height=17    xoffset=-2    yoffset=5     xadvance=4     page=0  
char id=79 x=689   y=0     width=9     height=16    xoffset=-2    yoffset=6     xadvance=4     page=0  
char id=80 x=57    y=0     width=13    height=20    xoffset=-3    yoffset=7     xadvance=7     page=0  
char id=81 x=71    y=0     width=13    height=20    xoffset=-3    yoffset=7     xadvance=6     page=0  
char id=82 x=186   y=0     width=9     height=19    xoffset=-2    yoffset=8     xadvance=4     page=0  
char id=83 x=196   y=0     width=9     height=19    xoffset=-2    yoffset=8     xadvance=4     page=0  
char id=84 x=380   y=0     width=15    height=17    xoffset=-2    yoffset=8     xadvance=11    page=0  
char id=85 x=443   y=0     width=14    height=17    xoffset=-2    yoffset=10    xadvance=10    page=0  
char id=86 x=150   y=20    width=11    height=15    xoffset=-2    yoffset=7     xadvance=7     page=0  
char id=87 x=906   y=0     width=12    height=15    xoffset=-3    yoffset=7     xadvance=6     page=0  
char id=88 x=830   y=16    width=7     height=14    xoffset=-2    yoffset=8     xadvance=4     page=0  
char id=89 x=820   y=16    width=9     height=14    xoffset=-2    yoffset=8     xadvance=4     page=0  
char id=90 x=545   y=17    width=15    height=14    xoffset=-2    yoffset=12    xadvance=11    page=0  
char id=97 x=561   y=17    width=15    height=14    xoffset=-2    yoffset=12    xadvance=11    page=0  
char id=98 x=724   y=17    width=12    height=14    xoffset=-3    yoffset=12    xadvance=6     page=0  
char id=99 x=750   y=16    width=12    height=14    xoffset=-3    yoffset=12    xadvance=6     page=0  
char id=100 x=763   y=16    width=11    height=14    xoffset=-2    yoffset=8     xadvance=7     page=0  
char id=101 x=138   y=20    width=11    height=15    xoffset=-2    yoffset=7     xadvance=7     page=0  
char id=102 x=964   y=16    width=15    height=12    xoffset=-2    yoffset=10    xadvance=11    page=0  
char id=103 x=948   y=16    width=15    height=12    xoffset=-2    yoffset=10    xadvance=11    page=0  
char id=104 x=896   y=16    width=12    height=13    xoffset=-3    yoffset=9     xadvance=6     page=0  
char id=105 x=909   y=16    width=12    height=13    xoffset=-3    yoffset=9     xadvance=6     page=0  
char id=106 x=593   y=17    width=15    height=14    xoffset=-2    yoffset=8     xadvance=11    page=0  
char id=107 x=609   y=17    width=15    height=14    xoffset=-2    yoffset=8     xadvance=11    page=0  
char id=108 x=919   y=0     width=12    height=15    xoffset=-3    yoffset=7     xadvance=6     page=0  
char id=109 x=932   y=0     width=12    height=15    xoffset=-3    yoffset=7     xadvance=6     page=0  
char id=110 x=572   y=0     width=14    height=16    xoffset=-2    yoffset=12    xadvance=10    page=0  
char id=111 x=541   y=0     width=15    height=16    xoffset=-2    yoffset=12    xadvance=11    page=0  
char id=112 x=309   y=19    width=16    height=14    xoffset=-3    yoffset=12    xadvance=11    page=0  
char id=113 x=326   y=19    width=16    height=14    xoffset=-3    yoffset=12    xadvance=10    page=0  
char id=114 x=557   y=0     width=14    height=16    xoffset=-2    yoffset=12    xadvance=10    page=0  
char id=115 x=525   y=0     width=15    height=16    xoffset=-2    yoffset=12    xadvance=11    page=0  
char id=116 x=183   y=35    width=16    height=10    xoffset=-3    yoffset=12    xadvance=11    page=0  
char id=117 x=200   y=35    width=16    height=10    xoffset=-3    yoffset=12    xadvance=10    page=0  
char id=118 x=141   y=0     width=14    height=19    xoffset=-2    yoffset=9     xadvance=10    page=0  
char id=119 x=125   y=0     width=15    height=19    xoffset=-2    yoffset=9     xadvance=11    page=0  
char id=120 x=496   y=18    width=16    height=14    xoffset=-3    yoffset=8     xadvance=11    page=0  
char id=121 x=479   y=18    width=16    height=14    xoffset=-3    yoffset=8     xadvance=10    page=0  
char id=122 x=51    y=37    width=10    height=11    xoffset=-2    yoffset=11    xadvance=7     page=0  
char id=172 x=62    y=37    width=10    height=11    xoffset=-2    yoffset=11    xadvance=6     page=0  
char id=174 x=809   y=16    width=10    height=14    xoffset=-2    yoffset=8     xadvance=7     page=0  
char id=175 x=787   y=16    width=10    height=14    xoffset=-2    yoffset=8     xadvance=6     page=0  
char id=176 x=922   y=16    width=12    height=13    xoffset=-2    yoffset=14    xadvance=7     page=0  
char id=177 x=935   y=16    width=12    height=13    xoffset=-2    yoffset=14    xadvance=6     page=0  
char id=178 x=294   y=0     width=12    height=18    xoffset=-2    yoffset=9     xadvance=7     page=0  
char id=179 x=307   y=0     width=12    height=18    xoffset=-2    yoffset=9     xadvance=6     page=0  
char id=180 x=269   y=19    width=19    height=14    xoffset=-2    yoffset=12    xadvance=16    page=0  
char id=181 x=289   y=19    width=19    height=14    xoffset=-2    yoffset=12    xadvance=15    page=0  
char id=182 x=147   y=36    width=17    height=10    xoffset=-3    yoffset=12    xadvance=11    page=0  
char id=183 x=165   y=36    width=17    height=10    xoffset=-3    yoffset=12    xadvance=11    page=0  
char id=184 x=85    y=0     width=19    height=19    xoffset=-2    yoffset=7     xadvance=16    page=0  
char id=185 x=105   y=0     width=19    height=19    xoffset=-2    yoffset=7     xadvance=15    page=0  
char id=186 x=763   y=0     width=17    height=15    xoffset=-3    yoffset=7     xadvance=11    page=0  
char id=187 x=781   y=0     width=17    height=15    xoffset=-3    yoffset=7     xadvance=11    page=0  
char id=188 x=180   y=20    width=22    height=14    xoffset=-2    yoffset=12    xadvance=18    page=0  
char id=189 x=203   y=20    width=22    height=14    xoffset=-2    yoffset=12    xadvance=17    page=0  
char id=190 x=104   y=36    width=21    height=10    xoffset=-3    yoffset=12    xadvance=15    page=0  
char id=191 x=126   y=36    width=20    height=10    xoffset=-3    yoffset=12    xadvance=14    page=0  
char id=192 x=206   y=0     width=22    height=18    xoffset=-2    yoffset=8     xadvance=18    page=0  
char id=193 x=229   y=0     width=22    height=18    xoffset=-2    yoffset=8     xadvance=17    page=0  
char id=194 x=226   y=19    width=21    height=14    xoffset=-3    yoffset=8     xadvance=15    page=0  
char id=195 x=248   y=19    width=20    height=14    xoffset=-3    yoffset=8     xadvance=14    page=0  
char id=196 x=377   y=19    width=16    height=14    xoffset=-2    yoffset=8     xadvance=12    page=0  
char id=197 x=394   y=18    width=16    height=14    xoffset=-2    yoffset=8     xadvance=11    page=0  
char id=198 x=343   y=19    width=16    height=14    xoffset=-3    yoffset=8     xadvance=11    page=0  
char id=199 x=360   y=19    width=16    height=14    xoffset=-3    yoffset=8     xadvance=10    page=0  
char id=200 x=411   y=18    width=16    height=14    xoffset=-2    yoffset=8     xadvance=12    page=0  
char id=201 x=428   y=18    width=16    height=14    xoffset=-2    yoffset=8     xadvance=11    page=0  
char id=202 x=445   y=18    width=16    height=14    xoffset=-3    yoffset=8     xadvance=11    page=0  
char id=203 x=462   y=18    width=16    height=14    xoffset=-3    yoffset=8     xadvance=10    page=0  
char id=204 x=458   y=0     width=13    height=17    xoffset=-2    yoffset=11    xadvance=9     page=0  
char id=205 x=587   y=0     width=13    height=16    xoffset=-2    yoffset=12    xadvance=9     page=0  
char id=206 x=0     y=38    width=14    height=11    xoffset=-3    yoffset=11    xadvance=9     page=0  
char id=207 x=232   y=34    width=14    height=10    xoffset=-3    yoffset=12    xadvance=8     page=0  
char id=208 x=43    y=0     width=13    height=20    xoffset=-2    yoffset=8     xadvance=9     page=0  
char id=209 x=29    y=0     width=13    height=20    xoffset=-2    yoffset=8     xadvance=9     page=0  
char id=210 x=640   y=17    width=14    height=14    xoffset=-3    yoffset=8     xadvance=9     page=0  
char id=211 x=655   y=17    width=14    height=14    xoffset=-3    yoffset=8     xadvance=8     page=0  
char id=212 x=745   y=0     width=17    height=15    xoffset=-2    yoffset=7     xadvance=13    page=0  
char id=213 x=799   y=0     width=17    height=15    xoffset=-2    yoffset=7     xadvance=12    page=0  
char id=214 x=102   y=20    width=11    height=15    xoffset=-3    yoffset=7     xadvance=6     page=0  
char id=215 x=945   y=0     width=12    height=15    xoffset=-3    yoffset=7     xadvance=6     page=0  
char id=216 x=171   y=0     width=14    height=19    xoffset=-2    yoffset=8     xadvance=10    page=0  
char id=217 x=156   y=0     width=14    height=19    xoffset=-2    yoffset=8     xadvance=10    page=0  
char id=218 x=126   y=20    width=11    height=15    xoffset=-3    yoffset=7     xadvance=6     page=0  
char id=219 x=958   y=0     width=12    height=15    xoffset=-3    yoffset=7     xadvance=6     page=0  
char id=220 x=577   y=17    width=15    height=14    xoffset=-2    yoffset=8     xadvance=12    page=0  
char id=221 x=529   y=17    width=15    height=14    xoffset=-2    yoffset=8     xadvance=11    page=0  
char id=222 x=882   y=16    width=13    height=13    xoffset=-3    yoffset=9     xadvance=7     page=0  
char id=223 x=868   y=16    width=13    height=13    xoffset=-3    yoffset=9     xadvance=7     page=0  
char id=224 x=485   y=0     width=12    height=17    xoffset=-2    yoffset=8     xadvance=8     page=0  
char id=225 x=472   y=0     width=12    height=17    xoffset=-2    yoffset=8     xadvance=8     page=0  
char id=226 x=798   y=16    width=10    height=14    xoffset=-3    yoffset=8     xadvance=5     page=0  
char id=227 x=775   y=16    width=11    height=14    xoffset=-3    yoffset=8     xadvance=5     page=0  
char id=228 x=643   y=0     width=11    height=16    xoffset=-2    yoffset=12    xadvance=7     page=0  
char id=229 x=655   y=0     width=11    height=16    xoffset=-2    yoffset=12    xadvance=7     page=0  
char id=230 x=261   y=34    width=13    height=10    xoffset=-3    yoffset=12    xadvance=7     page=0  
char id=231 x=247   y=34    width=13    height=10    xoffset=-3    yoffset=12    xadvance=6     page=0  
char id=232 x=629   y=0     width=13    height=16    xoffset=-2    yoffset=10    xadvance=9     page=0  
char id=233 x=601   y=0     width=13    height=16    xoffset=-2    yoffset=10    xadvance=8     page=0  
char id=234 x=737   y=16    width=12    height=14    xoffset=-3    yoffset=8     xadvance=6     page=0  
char id=235 x=711   y=17    width=12    height=14    xoffset=-3    yoffset=8     xadvance=6     page=0  
char id=236 x=39    y=37    width=11    height=11    xoffset=-2    yoffset=11    xadvance=7     page=0  
char id=237 x=995   y=16    width=11    height=12    xoffset=-2    yoffset=10    xadvance=7     page=0  
char id=238 x=838   y=16    width=14    height=13    xoffset=-3    yoffset=10    xadvance=9     page=0  
char id=239 x=971   y=0     width=12    height=15    xoffset=-3    yoffset=11    xadvance=6     page=0  
char id=240 x=878   y=0     width=13    height=15    xoffset=-3    yoffset=12    xadvance=7     page=0  
char id=241 x=892   y=0     width=13    height=15    xoffset=-3    yoffset=12    xadvance=6     page=0  
char id=242 x=513   y=17    width=15    height=14    xoffset=-2    yoffset=11    xadvance=11    page=0  
char id=243 x=980   y=16    width=14    height=12    xoffset=-2    yoffset=15    xadvance=10    page=0  
char id=244 x=412   y=0     width=15    height=17    xoffset=-2    yoffset=11    xadvance=11    page=0  
char id=245 x=849   y=0     width=14    height=15    xoffset=-2    yoffset=15    xadvance=10    page=0  
char id=246 x=685   y=17    width=12    height=14    xoffset=-3    yoffset=12    xadvance=6     page=0  
char id=247 x=698   y=17    width=12    height=14    xoffset=-3    yoffset=12    xadvance=6     page=0  
char id=248 x=428   y=0     width=14    height=17    xoffset=-2    yoffset=6     xadvance=10    page=0  
char id=249 x=396   y=0     width=15    height=17    xoffset=-2    yoffset=6     xadvance=10    page=0  
char id=250 x=267   y=0     width=13    height=18    xoffset=-2    yoffset=5     xadvance=9     page=0  
char id=251 x=252   y=0     width=14    height=18    xoffset=-2    yoffset=5     xadvance=10    page=0  
char id=252 x=0     y=0     width=13    height=21    xoffset=-2    yoffset=7     xadvance=9     page=0  
char id=253 x=14    y=0     width=14    height=20    xoffset=-2    yoffset=8     xadvance=10    page=0  
char id=254 x=615   y=0     width=13    height=16    xoffset=-2    yoffset=7     xadvance=9     page=0  
char id=255 x=834   y=0     width=14    height=15    xoffset=-2    yoffset=8     xadvance=10    page=0  
