{
  "type": "service_account",
  "project_id": "proyx-dev-bigquery",
  "private_key_id": "ae4099703d5b575fcdf831d8dce01517c1417cbf",
  "private_key": "-----BEGIN PRIVATE KEY-----\nMIIEvgIBADANBgkqhkiG9w0BAQEFAASCBKgwggSkAgEAAoIBAQDcQb/RKohzrOop\nSUClxTM9ETYW6t8HpfwiLEiUN6FCegPcBTNiKHh66/I3NucJPSIm9BvAq/b10oNi\nwEElm0WiX6VUlIi+wF2maWpAiLksz7+q2lR7oc01QlldGkBq2agTGPx/yiV/Rky3\nb4Cb+oAKRQPRFNGBj9Ait4YbUzJHQjO9oIhVH+pDo4mdTe24oDvkhkpadvP+D98Q\nuuOrxMGlYELN1wrSDJkJuzRUHOABUApPu2Bil8zjhEWHBqMVUAhtASzDL5w7W5in\n636j7B8+c++rWz4Qr7kv/Ck5X9ebkWxiwTbwGEH6g14MCplGBcazpLnJ80bDYfja\nE6hZbWu/AgMBAAECggEAN5kFMWhaH1Dzns5V2kJoB68zhx9sgwK8HWguPfO46g3g\nsYZCjTGIEAdFEfjy4tsiptCRvNXrteuYrLG5ACQstKsOEcaYqgXm3d3YK0gX7h7W\n0+rezoJuSVZhNmYtAovEqGVzP1KomnMFZHxp63WVIoJ/TyTBKcJCmLDY0kby9xdg\nA4ezewqo/M1FjAQsHWkOLZMcsomIwoU0x9kxI0Uz0VjH6DlYioBQq+lxNiEwytrP\ntP9mAPKMQv8pAhWFxmPSYoLL6XeJlj9xIPKmjt+K/A5tyX1XmWEv+CVNbnN7Y/Us\noVG7RWeUfAHtiUXlDcmdsj7FklJf4w9CJZ8IlmCsuQKBgQD1ikyluLP3PMYD3Uoo\nyN3zvBX9yuAp2KntHRcnOUPfM4BqFjSk4s4/O6MDxs7PQmf1zZcjH+CjXYfabMS4\ndT3+56JrkFc5bVl/MRwFzvBqOgPs378NFov8bnBTK0TRjQud1VVRU0OYrw9qmqOB\nshjKeyGPoztCerGweTGyB4YSswKBgQDlo7nJaBFzvT9hPZD5mpU1x5PHU/3su0HG\nmxvKPmEFQTJipPPMpLAmZOkNKuzeh3tcXGWW5qG58QTSNSEI4UG0AIAgmMlT/6an\nJULz6R1KJ4ct3PCe3j3mXNjsO/1gWHPgvkEhf4Ia1wOUcJ9OnHkSQlDvq6IGFnh2\nO3I/B57YxQKBgQClTaNGWm/GPgLtbRhVFs3eHj0L7H43jebwfAovXO0log2M3kA4\n1XyWs3aOv1RR0loc8HkUq4xXT0t7sIhLypqfNqBxG+6s+cIr0AsWmffe/AnSedus\nWwaJPmyegV3GWdd9Pbc/lffHHewaD9uOIDFyd6zjf7gQjHt93EmpmkkX4wKBgDuL\n4wco5y2d6ytp7Yfr37kcUWOkkfmq7Pl1CxW8aygTqd8OavGr2sl57Tyu3tEtTH28\nr9MbZuBycQ+ZG0HUN1dXseHB/KK9bhd1gBEDZ8bszQ7FddecRWzQsqc/PwqWpSWn\n7/ehurj+/Dynn4eg53wmmhor5U2y0fXGoG9bqIMJAoGBALYTf8Nq+N8JQiaYLtxt\nDgTrRmU4pj8pLuJx6rGMCeYMATjCTGGMPwcp8SXd/NjLGtYzjO9CkirsT+Hyhyg7\ntex2dVt+j5R0UN0Ubmuoq2I19XRA2Dwlkn/fZLONScLTUTEAK04a0P6aGUneKSiF\nCSUtH2E6HBkrK3JJRdS9Luoa\n-----END PRIVATE KEY-----\n",
  "client_email": "airflow-bigquery-dev@proyx-dev-bigquery.iam.gserviceaccount.com",
  "client_id": "109216174549985904225",
  "auth_uri": "https://accounts.google.com/o/oauth2/auth",
  "token_uri": "https://oauth2.googleapis.com/token",
  "auth_provider_x509_cert_url": "https://www.googleapis.com/oauth2/v1/certs",
  "client_x509_cert_url": "https://www.googleapis.com/robot/v1/metadata/x509/airflow-bigquery-dev%40proyx-dev-bigquery.iam.gserviceaccount.com"
}