{ 
	"role_groups": [
		// domain scope
		{
			"groupname": "Role-###RoleShortName###-Administrators",
			"alias": "Roles",
			"scope": "domain",
			"groupdescription": "Role ###RoleShortName###: Member of local group 'Administrators'",
			"grouptype": "domainlocal",
			"memberof": [
				"Right-###RoleShortName###-BuiltinGroup-Administrators",
				"Right-###RoleShortName###-BuiltinGroup-Users",
				"Right-###RoleShortName###-BuiltinGroup-RemoteDesktopUsers",
				"Right-###RoleShortName###-BuiltinGroup-RemoteManagementUsers"
			],
			"member": [
				"Domain Admins"
			]
		},
		{
			"groupname": "Role-###RoleShortName###-Users",
			"alias": "Roles",
			"scope": "domain",
			"groupdescription": "Role ###RoleShortName###: Member of local group 'Users'",
			"grouptype": "domainlocal",
			"memberof": [
				"Right-###RoleShortName###-BuiltinGroup-Users" 
			]
		},
		{
			"groupname": "Role-###RoleShortName###-RemoteDesktopUsers",
			"alias": "Roles",
			"scope": "domain",
			"groupdescription": "Role ###RoleShortName###: Remote Desktop Users",
			"grouptype": "domainlocal",
			"memberof": [
				"Right-###RoleShortName###-BuiltinGroup-Users",
				"Right-###RoleShortName###-BuiltinGroup-RemoteDesktopUsers"
			],
			"member": [
				"Domain Admins"
			]
		},

		// computer scope
		{
			"groupname": "Role-###RoleShortName###-Administrators-###ComputerName###",
			"alias": "Roles",
			"scope": "computer",
			"groupdescription": "Role ###RoleShortName###: Member of local group 'Administrators'",
			"grouptype": "domainlocal",
			"memberof": [
				"Right-###RoleShortName###-BuiltinGroup-Administrators-###ComputerName###",
				"Right-###RoleShortName###-BuiltinGroup-Users-###ComputerName###",
				"Right-###RoleShortName###-BuiltinGroup-RemoteDesktopUsers-###ComputerName###",
				"Right-###RoleShortName###-BuiltinGroup-RemoteManagementUsers-###ComputerName###"
			]
		},
		{
			"groupname": "Role-###RoleShortName###-Users-###ComputerName###",
			"alias": "Roles",
			"scope": "computer",
			"groupdescription": "Role ###RoleShortName###: Member of local group 'Users'",
			"grouptype": "domainlocal",
			"memberof": [
				"Right-###RoleShortName###-BuiltinGroup-Users-###ComputerName###" 
			]
		},
		{
			"groupname": "Role-###RoleShortName###-RemoteDesktopUsers-###ComputerName###",
			"alias": "Roles",
			"scope": "computer",
			"groupdescription": "Role ###RoleShortName###: Remote Desktop Users",
			"grouptype": "domainlocal",
			"memberof": [
				"Right-###RoleShortName###-BuiltinGroup-Users-###ComputerName###",
				"Right-###RoleShortName###-BuiltinGroup-RemoteDesktopUsers-###ComputerName###"
			]
		}
	]
}