{ 
	"rights_groups": [
		// Domain scoped groups for local group membership
		{
			"groupname": "Right-###RoleShortName###-BuiltinGroup-Administrators",
			"alias": "Rights",
			"scope": "domain",
			"groupdescription": "Role ###RoleShortName###: Member of local group 'Administrators'",
			"grouptype": "domainlocal"
		},
		{
			"groupname": "Right-###RoleShortName###-BuiltinGroup-Hyper-VAdministrators",
			"alias": "Rights",
			"scope": "domain",
			"groupdescription": "Role ###RoleShortName###: Member of local group 'Hyper-V Administrators'",
			"grouptype": "domainlocal"
		},
		{
			"groupname": "Right-###RoleShortName###-BuiltinGroup-RemoteDesktopUsers",
			"alias": "Rights",
			"scope": "domain",
			"groupdescription": "Role ###RoleShortName###: Member of local group 'Remote Desktop Users'",
			"grouptype": "domainlocal"
		},
		{
			"groupname": "Right-###RoleShortName###-BuiltinGroup-RemoteManagementUsers",
			"alias": "Rights",
			"scope": "domain",
			"groupdescription": "Role ###RoleShortName###: Member of local group 'Remote Management Users'",
			"grouptype": "domainlocal"
		},
		{
			"groupname": "Right-###RoleShortName###-BuiltinGroup-Users",
			"alias": "Rights",
			"scope": "domain",
			"groupdescription": "Role ###RoleShortName###: Member of local group 'Users'",
			"grouptype": "domainlocal"
		},

		// Site scoped  groups for local group membership
		{
			"groupname": "Right-###RoleShortName###-BuiltinGroup-Administrators-###ADSite###",
			"alias": "Rights",
			"scope": "site",
			"groupdescription": "Role ###RoleShortName###: Member of local group 'Administrators'",
			"grouptype": "domainlocal"
		},
		{
			"groupname": "Right-###RoleShortName###-BuiltinGroup-Hyper-VAdministrators-###ADSite###",
			"alias": "Rights",
			"scope": "site",
			"groupdescription": "Role ###RoleShortName###: Member of local group 'Hyper-V Administrators'",
			"grouptype": "domainlocal"
		},
		{
			"groupname": "Right-###RoleShortName###-BuiltinGroup-RemoteDesktopUsers-###ADSite###",
			"alias": "Rights",
			"scope": "site",
			"groupdescription": "Role ###RoleShortName###: Member of local group 'Remote Desktop Users'",
			"grouptype": "domainlocal"
		},
		{
			"groupname": "Right-###RoleShortName###-BuiltinGroup-RemoteManagementUsers-###ADSite###",
			"alias": "Rights",
			"scope": "site",
			"groupdescription": "Role ###RoleShortName###: Member of local group 'Remote Management Users'",
			"grouptype": "domainlocal"
		},
		{
			"groupname": "Right-###RoleShortName###-BuiltinGroup-Users-###ADSite###",
			"alias": "Rights",
			"scope": "site",
			"groupdescription": "Role ###RoleShortName###: Member of local group 'Users'",
			"grouptype": "domainlocal"
		},
		
		// Domain Scope - User Rights Assignment groups - Logon Rights
		{
			"groupname": "Right-###RoleShortName###-URA-SeInteractiveLogonRight",
			"alias": "Rights",
			"scope": "domain",
			"groupdescription": "Role ###RoleShortName###: URA 'Log on locally' (SeInteractiveLogonRight)",
			"grouptype": "domainlocal"
		},
		{
			"groupname": "Right-###RoleShortName###-URA-SeDenyInteractiveLogonRight",
			"alias": "Rights",
			"scope": "domain",
			"groupdescription": "Role ###RoleShortName###: URA 'Deny local logon' (SeDenyInteractiveLogonRight)",
			"grouptype": "domainlocal"
		},
		{
			"groupname": "Right-###RoleShortName###-URA-SeRemoteInteractiveLogonRight",
			"alias": "Rights",
			"scope": "domain",
			"groupdescription": "Role ###RoleShortName###: URA 'Allow logon through RDP/Terminal Services' (SeRemoteInteractiveLogonRight)",
			"grouptype": "domainlocal"
		},
		{
			"groupname": "Right-###RoleShortName###-URA-SeDenyRemoteInteractiveLogonRight",
			"alias": "Rights",
			"scope": "domain",
			"groupdescription": "Role ###RoleShortName###: URA 'Deny logon through RDP/Terminal Services' (SeDenyRemoteInteractiveLogonRight)",
			"grouptype": "domainlocal"
		},

		// Site Scope - User Rights Assignment groups - Logon Rights
		{
			"groupname": "Right-###RoleShortName###-URA-SeInteractiveLogonRight-###ADSite###",
			"alias": "Rights",
			"scope": "site",
			"groupdescription": "Role ###RoleShortName###: URA 'Log on locally' (SeInteractiveLogonRight)",
			"grouptype": "domainlocal"
		},
		{
			"groupname": "Right-###RoleShortName###-URA-SeDenyInteractiveLogonRight-###ADSite###",
			"alias": "Rights",
			"scope": "site",
			"groupdescription": "Role ###RoleShortName###: URA 'Deny local logon' (SeDenyInteractiveLogonRight)",
			"grouptype": "domainlocal"
		},
		{
			"groupname": "Right-###RoleShortName###-URA-SeRemoteInteractiveLogonRight-###ADSite###",
			"alias": "Rights",
			"scope": "site",
			"groupdescription": "Role ###RoleShortName###: URA 'Allow logon through RDP/Terminal Services' (SeRemoteInteractiveLogonRight)",
			"grouptype": "domainlocal"
		},
		{
			"groupname": "Right-###RoleShortName###-URA-SeDenyRemoteInteractiveLogonRight-###ADSite###",
			"alias": "Rights",
			"scope": "site",
			"groupdescription": "Role ###RoleShortName###: URA 'Deny logon through RDP/Terminal Services' (SeDenyRemoteInteractiveLogonRight)",
			"grouptype": "domainlocal"
		}
	]
}
