{	
	"ou_schema": 
	[		
		{
			"alias": "DomainRoot",
			"scope": [ "domain" ],
			"description": "Root of domain",
			"paths": {
				"domain": ""
			}	
		},
		
		// Workstation Computers Root
		{
			"alias": "Computer-Root",
			"scope": [ "domain" ],
			"description": "Root OU for Workstation Computer Objects",
			"paths": {
				"domain": "###org###/Workstations/Win" 
			}
			
		},

		// Computer (The OU where the machine account goes)
		{
			"alias": "Computer",
			"scope": [ "domain", "computer" ],
			"description": "Role OU for role '###RoleShortName###'",
			"parents": 
			[
				{
					"alias": "Computer-Root",
					"scope": "domain",
					"parentscope": "domain",
					"child": "###RoleShortName###"
				},
				{
					"alias": "Computer-Root",
					"scope": "computer",
					"parentscope": "domain",
					"child": "###RoleShortName###/###ComputerName###"
				}
			]	
		},

		// Roles Root
		{
			"alias": "Roles-Root",
			"scope": [ "domain" ],
			"description": "Root OU for Role groups",
			"paths": {
				"domain":"###org###/Roles"
			}
			
		},
		// Roles (Role groups)
		{
			"alias": "Roles",
			"scope": [ "domain", "computer" ],
			"description": "OU for Roles of role '###RoleShortName###'",
			"parents": 
			[
				{
					"alias": "Roles-Root",
					"scope": "domain",
					"parentscope": "domain",
					"child": "###RoleShortName###"
				},
				{
					"alias": "Roles-Root",
					"scope": "computer",
					"parentscope": "domain",
					"child": "###RoleShortName###/###ComputerName###"
				}
			]	
		},

		//Rights Root
		{
			"alias": "Rights-Root",
			"scope": [ "domain" ],
			"description": "Root OU for Rights groups",
			"paths": {
				"domain":"###org###/Rights"
			}
			
		},

		// Rights (Rights groups)
		{
			"alias": "Rights",
			"scope": [ "domain", "computer" ],
			"description": "OU for Rights of role '###RoleShortName###'",
			"parents": 
			[
				{
					"alias": "Rights-Root",
					"scope": "domain",
					"parentscope": "domain",
					"child": "###RoleShortName###"
				},
				{
					"alias": "Rights-Root",
					"scope": "computer",
					"parentscope": "domain",
					"child": "###RoleShortName###/###ComputerName###"
				}
			]	
		},

		// Users
		{
			"alias": "Users",
			"scope": [ "domain" ],
			"description": "User objects of any type",
			"paths": {
				"domain": "###org###/Users"
			}
		},
		{
			"alias": "Users-EndUsers",
			"scope": [ "domain" ],
			"description": "End user objects",
			"paths": {
				"domain": "###org###/Users/EndUsers"
			}
		},
		{
			"alias": "Users-AdmUsers",
			"scope": [ "domain" ],
			"description": "Adm user objects",
			"paths": {
				"domain": "###org###/Users/AdmUsers"
			}
		}
	]
}