{	
	"ou_schema": 
	[		
		{
			"alias": "DomainRoot",
			"scope": [ "domain" ],
			"description": "Root of domain",
			"paths": {
				"domain": ""
			}	
		},
		{
			"alias": "Computer-Root",
			"scope": [ "domain" ],
			"description": "Root OU for Workstation Computer Objects",
			"paths": {
				"domain": "###org###/Workstations/Win" 
			}
			
		},
		{
			"alias": "Computer-Role",
			"scope": [ "domain", "site" ],
			"description": "Role OU for role '###RoleShortName###'",
			"parents": 
			[
				{
					"alias": "Computer-Root",
					"scope": "domain",
					"parentscope": "domain",
					"child": "###RoleShortName###"
				},

				{
					"alias": "Computer-Root",
					"scope": "site",
					"parentscope": "domain",
					"child": "###RoleShortName###/###ADSite###"
				}
			]	
		},
		{
			"alias": "Roles-Root",
			"scope": [ "domain" ],
			"description": "Root OU for Role groups",
			"paths": {
				"domain":"###org###/Roles"
			}
			
		},
		{
			"alias": "Roles",
			"scope": [ "domain", "site" ],
			"description": "OU for OS Roles of role '###RoleShortName###'",
			"parents": 
			[
				{
					"alias": "Roles-Root",
					"scope": "domain",
					"parentscope": "domain",
					"child": "###RoleShortName###/OS"
				},

				{
					"alias": "Roles-Root",
					"scope": "site",
					"parentscope": "domain",
					"child": "###RoleShortName###/OS/###ADSite###"
				}
			]	
		},
		{
			"alias": "Rights-Root",
			"scope": [ "domain" ],
			"description": "Root OU for Rights groups",
			"paths": {
				"domain":"###org###/Rights"
			}
			
		},
		{
			"alias": "Rights",
			"scope": [ "domain", "site" ],
			"description": "OU for OS Rights of role '###RoleShortName###'",
			"parents": 
			[
				{
					"alias": "Rights-Root",
					"scope": "domain",
					"parentscope": "domain",
					"child": "###RoleShortName###/OS"
				},

				{
					"alias": "Rights-Root",
					"scope": "site",
					"parentscope": "domain",
					"child": "###RoleShortName###/OS/###ADSite###"
				}
			]	
		},
		{
			"alias": "Users",
			"scope": [ "domain" ],
			"description": "User objects of any type",
			"paths": {
				"domain": "###org###/Users"
			}
		},
		{
			"alias": "Users-EndUsers",
			"scope": [ "domain" ],
			"description": "End user objects",
			"paths": {
				"domain": "###org###/Users/EndUsers"
			}
		},
		{
			"alias": "Users-AdmUsers",
			"scope": [ "domain" ],
			"description": "Adm user objects",
			"paths": {
				"domain": "###org###/Users/AdmUsers"
			}
		}
	]
}