{ 
	"role_groups": [
		// domain scope
		{
			"groupname": "Role-###RoleShortName###-Administrators",
			"alias": "Roles",
			"scope": "domain",
			"groupdescription": "Role ###RoleShortName###: Member of local group 'Administrators'",
			"grouptype": "domainlocal",
			"memberof": [
				"Right-###RoleShortName###-BuiltinGroup-Administrators",
				"Right-###RoleShortName###-BuiltinGroup-Users",
				"Right-###RoleShortName###-BuiltinGroup-RemoteDesktopUsers",
				"Right-###RoleShortName###-BuiltinGroup-RemoteManagementUsers"
			]
		},
		{
			"groupname": "Role-###RoleShortName###-Users",
			"alias": "Roles",
			"scope": "domain",
			"groupdescription": "Role ###RoleShortName###: Member of local group 'Users'",
			"grouptype": "domainlocal",
			"memberof": [
				"Right-###RoleShortName###-BuiltinGroup-Users" 
			]
		},

		{
			"groupname": "Role-###RoleShortName###-RemoteDesktopUsers",
			"alias": "Roles",
			"scope": "domain",
			"groupdescription": "Role ###RoleShortName###: Remote Desktop Users",
			"grouptype": "domainlocal",
			"memberof": [
				"Right-###RoleShortName###-BuiltinGroup-Users",
				"Right-###RoleShortName###-BuiltinGroup-RemoteDesktopUsers"
			]
		},

		// site scope
		{
			"groupname": "Role-###RoleShortName###-Administrators-###ADSite###",
			"alias": "Roles",
			"scope": "site",
			"groupdescription": "Role ###RoleShortName###: Member of local group 'Administrators'",
			"grouptype": "domainlocal",
			"memberof": [
				"Right-###RoleShortName###-BuiltinGroup-Administrators-###ADSite###",
				"Right-###RoleShortName###-BuiltinGroup-Users-###ADSite###",
				"Right-###RoleShortName###-BuiltinGroup-RemoteDesktopUsers-###ADSite###",
				"Right-###RoleShortName###-BuiltinGroup-RemoteManagementUsers-###ADSite###" 
			]
		},
		{
			"groupname": "Role-###RoleShortName###-Users-###ADSite###",
			"alias": "Roles",
			"scope": "site",
			"groupdescription": "Role ###RoleShortName###: Member of local group 'Users'",
			"grouptype": "domainlocal",
			"memberof": [
				"Right-###RoleShortName###-BuiltinGroup-Users-###ADSite###" 
			]
		},
		{
			"groupname": "Role-###RoleShortName###-RemoteDesktopUsers-###ADSite###",
			"alias": "Roles",
			"scope": "site",
			"groupdescription": "Role ###RoleShortName###: Remote Desktop Users",
			"grouptype": "domainlocal",
			"memberof": [
				"Right-###RoleShortName###-BuiltinGroup-Users-###ADSite###",
				"Right-###RoleShortName###-BuiltinGroup-RemoteDesktopUsers-###ADSite###"
			]
		}
	]
}