[gd_scene load_steps=3 format=2]

[ext_resource path="res://rooms/bedroom/items/cover_slide.png" type="Texture" id=1]
[ext_resource path="res://addons/escoria-core/game/core-scripts/esc_item.gd" type="Script" id=2]

[node name="cover" type="Area2D"]
pause_mode = 1
script = ExtResource( 2 )
global_id = "inv_cover"
tooltip_name = "Cover"
inventory_texture = ExtResource( 1 )
dialog_color = Color( 1, 1, 1, 1 )
animations = null

[node name="Sprite" type="Sprite" parent="."]
texture = ExtResource( 1 )

[node name="CollisionPolygon2D" type="CollisionPolygon2D" parent="."]
position = Vector2( 1, 1 )
polygon = PoolVector2Array( -70, -19, 33, -18, 33, 16, -83, 16, -84, 10 )
