[gd_scene load_steps=3 format=2]

[ext_resource path="res://addons/escoria-core/game/core-scripts/esc_item.gd" type="Script" id=2]
[ext_resource path="res://rooms/bedroom/items/simcard_slide.png" type="Texture" id=3]

[node name="simcard" type="Area2D"]
pause_mode = 1
script = ExtResource( 2 )
global_id = "inv_simcard"
tooltip_name = "SIM card"
inventory_texture = ExtResource( 3 )
dialog_color = Color( 1, 1, 1, 1 )
animations = null

[node name="Sprite" type="Sprite" parent="."]
position = Vector2( -29, -24 )
scale = Vector2( 3.3069, 3.3069 )
texture = ExtResource( 3 )

[node name="CollisionPolygon2D" type="CollisionPolygon2D" parent="."]
position = Vector2( 1, 1 )
polygon = PoolVector2Array( -30, -19, 35, -17, 34, 12, -30, 10 )
