{
  "parent": "minecraft:recipes/root",
  "rewards": {
    "recipes": [
      "minecraft:smelting/silver_ingot_from_c_silver_ores"
    ]
  },
  "criteria": {
    "has_tag_c_silver_ores": {
      "trigger": "minecraft:inventory_changed",
      "conditions": {
        "items": [
          {
            "tag": "c:silver_ores"
          }
        ]
      }
    },
    "has_the_recipe": {
      "trigger": "minecraft:recipe_unlocked",
      "conditions": {
        "recipe": "minecraft:smelting/silver_ingot_from_c_silver_ores"
      }
    }
  },
  "requirements": [
    [
      "has_tag_c_silver_ores",
      "has_the_recipe"
    ]
  ]
}