{
    "__createdwith": "opl's Model Creator",
    "ambientocclusion": false,
    "textures": {
        "particle": "block/pointed_dripstone_down_base"
    },
    "elements": [
        {
            "from": [2,0,2],
            "to": [14,16,14],
            "faces": {
                "up": {
                    "uv": [2,0,14,12],
                    "texture": "#particle"
                },
                "west": {
                    "texture": "#particle"
                },
                "east": {
                    "texture": "#particle"
                },
                "north": {
                    "texture": "#particle"
                },
                "south": {
                    "texture": "#particle"
                }
            }
        },
        {
            "from": [0.5,0,0.5],
            "to": [14.5,3,14.5],
            "faces": {
                "up": {
                    "uv": [1,2,15,16],
                    "texture": "#particle"
                },
                "down": {
                    "uv": [1,2,15,16],
                    "texture": "#particle"
                },
                "west": {
                    "uv": [1,13,15,16],
                    "texture": "#particle"
                },
                "east": {
                    "uv": [1,13,15,16],
                    "texture": "#particle"
                },
                "north": {
                    "uv": [1,13,15,16],
                    "texture": "#particle"
                },
                "south": {
                    "uv": [1,13,15,16],
                    "texture": "#particle"
                }
            }
        },
        {
            "from": [1.5,3,1.5],
            "to": [12.5,19,12.5],
            "faces": {
                "up": {
                    "uv": [2,0,13,11],
                    "texture": "#particle"
                },
                "west": {
                    "uv": [3,0,14,16],
                    "texture": "#particle"
                },
                "east": {
                    "uv": [2,0,13,16],
                    "texture": "#particle"
                },
                "north": {
                    "uv": [3,0,14,16],
                    "texture": "#particle"
                },
                "south": {
                    "uv": [3,0,14,16],
                    "texture": "#particle"
                }
            }
        }
    ]
}