{
	"parent": "mcwbridges:block/bridge/rope/parent/inventory",
	"textures": {
		"0": "mcwbridges:block/lead_knot_vert",
		"2": "minecraft:block/oak_planks",
		"4": "minecraft:block/oak_log",
		"particle": "minecraft:block/oak_log",
		"1_4": "mcwbridges:block/lead_knot"
	}
}
