{
  "type": "minecraft:crafting_shaped",
  "pattern": [
    "XX",
    " #",
    " #"
  ],
  "key": {
    "X": {
      "item": "techreborn:peridot_gem"
    },
    "#": {
      "item": "minecraft:stick"
    }
  },
  "result": {
    "item": "techreborn:peridot_hoe"
  }
}