{
  "type": "techreborn:grinder",
  "power": 4,
  "time": 200,
  "ingredients": [
    {
      "item": "minecraft:red_concrete",
      "count": 1
    }
  ],
  "results": [
    {
      "item": "minecraft:red_concrete_powder"
    }
  ]
}