{
  "parent": "minecraft:block/slab_top",
  "textures": {
    "bottom": "block/custom/mossycobblestone/c",
    "top": "block/custom/mossycobblestone/c",
    "side": "block/custom/mossycobblestone/c"
  }
}