{
	"parent": "mcwbridges:block/bridge/bridge_stone/parent/inventory",
	"textures": {
		"2": "minecraft:block/polished_blackstone_bricks",
		"particle": "minecraft:block/blackstone_top",
		"2_2": "minecraft:block/blackstone_top"
	}
}
