{
    "variants": {
        "axis=y": [
		{ "model": "block/stripped_acacia_log", "weight": 10 },
		{ "model": "block/strippedlog/acacia_a", "weight": 10 },
		{ "model": "block/strippedlog/acacia_b", "weight": 10 },
		{ "model": "block/strippedlog/acacia_c", "weight": 10 }
		],
        "axis=z": [
		{ "model": "block/stripped_acacia_log", "weight": 10, "x": 90 },
		{ "model": "block/strippedlog/acacia_a", "weight": 10, "x": 90 },
		{ "model": "block/strippedlog/acacia_b", "weight": 10, "x": 90 },
		{ "model": "block/strippedlog/acacia_c", "weight": 10, "x": 90 }
		],
        "axis=x": [
		{ "model": "block/stripped_acacia_log", "weight": 10, "x": 90, "y": 90 },
		{ "model": "block/strippedlog/acacia_a", "weight": 10, "x": 90, "y": 90 },
		{ "model": "block/strippedlog/acacia_b", "weight": 10, "x": 90, "y": 90 },
		{ "model": "block/strippedlog/acacia_c", "weight": 10, "x": 90, "y": 90 }
		]
    }
}
