{
  "parent": "minecraft:recipes/root",
  "rewards": {
    "recipes": [
      "techreborn:crafting_table/small_dust/olivine_small_dust_from_dust"
    ]
  },
  "criteria": {
    "has_olivine_dust": {
      "trigger": "minecraft:inventory_changed",
      "conditions": {
        "items": [
          {
            "items": [
              "techreborn:olivine_dust"
            ]
          }
        ]
      }
    },
    "has_the_recipe": {
      "trigger": "minecraft:recipe_unlocked",
      "conditions": {
        "recipe": "techreborn:crafting_table/small_dust/olivine_small_dust_from_dust"
      }
    }
  },
  "requirements": [
    [
      "has_olivine_dust",
      "has_the_recipe"
    ]
  ]
}