{
  "type": "techreborn:industrial_sawmill",
  "power": 30,
  "time": 100,
  "ingredients": [
    {
      "item": "minecraft:wooden_hoe",
      "count": 1
    }
  ],
  "results": [
    {
      "item": "techreborn:saw_small_dust",
      "count": 3
    }
  ],
  "tank": {
    "fluid": "minecraft:water",
    "amount": {
      "droplets": 8100
    }
  }
}