{
    "variants": {
        "": [
		{ "model": "block/flower/poppy", "weight": 100 },
		{ "model": "block/flower/poppy_a", "weight": 99 },
		{ "model": "block/flower/poppy_b", "weight": 99 },
		{ "model": "block/flower/poppy_c", "weight": 99 },
		{ "model": "block/flower/poppy_d", "weight": 99 }
		]
    }
}
