{
  "type": "techreborn:grinder",
  "power": 2,
  "time": 200,
  "ingredients": [
    {
      "tag": "c:yellow_garnet_gems"
    }
  ],
  "results": [
    {
      "item": "techreborn:yellow_garnet_dust"
    }
  ]
}