{
  "type": "techreborn:compressor",
  "power": 10,
  "time": 300,
  "ingredients": [
    {
      "item": "minecraft:lapis_block",
      "count": 1
    }
  ],
  "results": [
    {
      "item": "techreborn:lapis_plate"
    }
  ]
}