{
    "variants": {
        "": [
		{ "model": "block/nether_wart_block", "weight": 100 },
		{ "model": "block/netherwartblock/a", "weight": 5 },
		{ "model": "block/netherwartblock/b", "weight": 5 },
		{ "model": "block/netherwartblock/c", "weight": 5 },
		{ "model": "block/netherwartblock/d", "weight": 5 }
		]
    }
}
