{
  "parent": "minecraft:recipes/root",
  "rewards": {
    "recipes": [
      "techreborn:crafting_table/tool/peridot_sword"
    ]
  },
  "criteria": {
    "has_peridot_gem": {
      "trigger": "minecraft:inventory_changed",
      "conditions": {
        "items": [
          {
            "items": [
              "techreborn:peridot_gem"
            ]
          }
        ]
      }
    },
    "has_the_recipe": {
      "trigger": "minecraft:recipe_unlocked",
      "conditions": {
        "recipe": "techreborn:crafting_table/tool/peridot_sword"
      }
    }
  },
  "requirements": [
    [
      "has_peridot_gem",
      "has_the_recipe"
    ]
  ]
}