{
    "variants": {
        "facing=south": { "model": "block/anvil/slightly_damaged" },
        "facing=west": { "model": "block/anvil/slightly_damaged", "y": 90 },
        "facing=north": { "model": "block/anvil/slightly_damaged", "y": 180 },
        "facing=east": { "model": "block/anvil/slightly_damaged", "y": 270 }
    }
}
