{
  "parent": "minecraft:recipes/root",
  "rewards": {
    "recipes": [
      "techreborn:extractor/bucket_from_powder_snow_bucket"
    ]
  },
  "criteria": {
    "has_powder_snow_bucket": {
      "trigger": "minecraft:inventory_changed",
      "conditions": {
        "items": [
          {
            "items": [
              "minecraft:powder_snow_bucket"
            ]
          }
        ]
      }
    },
    "has_the_recipe": {
      "trigger": "minecraft:recipe_unlocked",
      "conditions": {
        "recipe": "techreborn:extractor/bucket_from_powder_snow_bucket"
      }
    }
  },
  "requirements": [
    [
      "has_powder_snow_bucket",
      "has_the_recipe"
    ]
  ]
}