{
	"parent": "mcwbridges:block/stair/stone/parent/torch",
	"textures": {
		"3": "minecraft:block/torch",
		"1_1": "minecraft:block/polished_blackstone_bricks",
		"particle": "minecraft:block/polished_blackstone_bricks"
	}
}
