{
	"parent": "mcwbridges:block/bridge/bridge_wood/parent/inventory",
	"textures": {
		"0": "minecraft:block/warped_stem",
		"2": "minecraft:block/warped_planks",
		"particle": "minecraft:block/warped_stem"
	}
}
