{
  "parent": "minecraft:recipes/root",
  "rewards": {
    "recipes": [
      "techreborn:blast_furnace/silver_ingot_from_leggings"
    ]
  },
  "criteria": {
    "has_silver_leggings": {
      "trigger": "minecraft:inventory_changed",
      "conditions": {
        "items": [
          {
            "items": [
              "techreborn:silver_leggings"
            ]
          }
        ]
      }
    },
    "has_the_recipe": {
      "trigger": "minecraft:recipe_unlocked",
      "conditions": {
        "recipe": "techreborn:blast_furnace/silver_ingot_from_leggings"
      }
    }
  },
  "requirements": [
    [
      "has_silver_leggings",
      "has_the_recipe"
    ]
  ]
}