{
  "parent": "minecraft:block/slab_top",
  "textures": {
    "bottom": "block/custom/cobbleddeepslate/c",
    "top": "block/custom/cobbleddeepslate/c",
    "side": "block/custom/cobbleddeepslate/c"
  }
}