{
    "variants": {
        "": [
		{ "model": "block/oak_planks", "weight": 50 },
		{ "model": "block/planks/oak_a", "weight": 100 },
		{ "model": "block/planks/oak_b", "weight": 100 },
		{ "model": "block/planks/oak_c", "weight": 100 },
		{ "model": "block/planks/oak_d", "weight": 100 }
		]
    }
}
