{
  "multipart": [
    {
      "when": {
        "up": "true"
      },
      "apply": [
        {"model": "minecraft:block/deepslate_brick_wall_post", "weight": 100},
		{"model": "block/wall/deepslate_bricks_wall_post_a", "weight": 99},
		{"model": "block/wall/deepslate_bricks_wall_post_b", "weight": 99},
		{"model": "block/wall/deepslate_bricks_wall_post_c", "weight": 99},
		{"model": "block/wall/deepslate_bricks_wall_post_d", "weight": 99},
		{"model": "block/wall/deepslate_bricks_wall_post_e", "weight": 99},
		{"model": "block/wall/deepslate_bricks_wall_post_f", "weight": 99},
		{"model": "block/wall/deepslate_bricks_wall_post_g", "weight": 99},
		{"model": "block/wall/deepslate_bricks_wall_post_h", "weight": 99}
		]
	},
    {
      "when": {
        "north": "low"
      },
      "apply": [
        {"model": "minecraft:block/deepslate_brick_wall_side", "weight": 100, "uvlock": true},
		{"model": "block/wall/deepslate_bricks_wall_side_a", "weight": 99, "uvlock": true},
		{"model": "block/wall/deepslate_bricks_wall_side_b", "weight": 99, "uvlock": true},
		{"model": "block/wall/deepslate_bricks_wall_side_c", "weight": 99, "uvlock": true},
		{"model": "block/wall/deepslate_bricks_wall_side_d", "weight": 99, "uvlock": true},
		{"model": "block/wall/deepslate_bricks_wall_side_e", "weight": 99, "uvlock": true},
		{"model": "block/wall/deepslate_bricks_wall_side_f", "weight": 99, "uvlock": true},
		{"model": "block/wall/deepslate_bricks_wall_side_g", "weight": 99, "uvlock": true},
		{"model": "block/wall/deepslate_bricks_wall_side_h", "weight": 99, "uvlock": true}
		]
	},
    {
      "when": {
        "east": "low"
      },
      "apply": [
        {"model": "minecraft:block/deepslate_brick_wall_side", "weight": 100, "uvlock": true, "y":90},
		{"model": "block/wall/deepslate_bricks_wall_side_a", "weight": 99, "uvlock": true, "y":90},
		{"model": "block/wall/deepslate_bricks_wall_side_b", "weight": 99, "uvlock": true, "y":90},
		{"model": "block/wall/deepslate_bricks_wall_side_c", "weight": 99, "uvlock": true, "y":90},
		{"model": "block/wall/deepslate_bricks_wall_side_d", "weight": 99, "uvlock": true, "y":90},
		{"model": "block/wall/deepslate_bricks_wall_side_e", "weight": 99, "uvlock": true, "y":90},
		{"model": "block/wall/deepslate_bricks_wall_side_f", "weight": 99, "uvlock": true, "y":90},
		{"model": "block/wall/deepslate_bricks_wall_side_g", "weight": 99, "uvlock": true, "y":90},
		{"model": "block/wall/deepslate_bricks_wall_side_h", "weight": 99, "uvlock": true, "y":90}
		]
	},
    {
      "when": {
        "south": "low"
      },
      "apply": [
        {"model": "minecraft:block/deepslate_brick_wall_side", "weight": 100, "uvlock": true, "y":180},
		{"model": "block/wall/deepslate_bricks_wall_side_a", "weight": 99, "uvlock": true, "y":180},
		{"model": "block/wall/deepslate_bricks_wall_side_b", "weight": 99, "uvlock": true, "y":180},
		{"model": "block/wall/deepslate_bricks_wall_side_c", "weight": 99, "uvlock": true, "y":180},
		{"model": "block/wall/deepslate_bricks_wall_side_d", "weight": 99, "uvlock": true, "y":180},
		{"model": "block/wall/deepslate_bricks_wall_side_e", "weight": 99, "uvlock": true, "y":180},
		{"model": "block/wall/deepslate_bricks_wall_side_f", "weight": 99, "uvlock": true, "y":180},
		{"model": "block/wall/deepslate_bricks_wall_side_g", "weight": 99, "uvlock": true, "y":180},
		{"model": "block/wall/deepslate_bricks_wall_side_h", "weight": 99, "uvlock": true, "y":180}
		]
	},
    {
      "when": {
        "west": "low"
      },
      "apply": [
        {"model": "minecraft:block/deepslate_brick_wall_side", "weight": 100, "uvlock": true, "y":270},
		{"model": "block/wall/deepslate_bricks_wall_side_a", "weight": 99, "uvlock": true, "y":270},
		{"model": "block/wall/deepslate_bricks_wall_side_b", "weight": 99, "uvlock": true, "y":270},
		{"model": "block/wall/deepslate_bricks_wall_side_c", "weight": 99, "uvlock": true, "y":270},
		{"model": "block/wall/deepslate_bricks_wall_side_d", "weight": 99, "uvlock": true, "y":270},
		{"model": "block/wall/deepslate_bricks_wall_side_e", "weight": 99, "uvlock": true, "y":270},
		{"model": "block/wall/deepslate_bricks_wall_side_f", "weight": 99, "uvlock": true, "y":270},
		{"model": "block/wall/deepslate_bricks_wall_side_g", "weight": 99, "uvlock": true, "y":270},
		{"model": "block/wall/deepslate_bricks_wall_side_h", "weight": 99, "uvlock": true, "y":270}
		]
	},
    {
      "when": {
        "north": "tall"
      },
      "apply": [
        {"model": "minecraft:block/deepslate_brick_wall_side_tall", "weight": 100, "uvlock": true},
		{"model": "block/wall/deepslate_bricks_wall_side_tall_a", "weight": 99, "uvlock": true},
		{"model": "block/wall/deepslate_bricks_wall_side_tall_b", "weight": 99, "uvlock": true},
		{"model": "block/wall/deepslate_bricks_wall_side_tall_c", "weight": 99, "uvlock": true},
		{"model": "block/wall/deepslate_bricks_wall_side_tall_d", "weight": 99, "uvlock": true},
		{"model": "block/wall/deepslate_bricks_wall_side_tall_e", "weight": 99, "uvlock": true},
		{"model": "block/wall/deepslate_bricks_wall_side_tall_f", "weight": 99, "uvlock": true},
		{"model": "block/wall/deepslate_bricks_wall_side_tall_g", "weight": 99, "uvlock": true},
		{"model": "block/wall/deepslate_bricks_wall_side_tall_h", "weight": 99, "uvlock": true}
		]
	},
    {
      "when": {
        "east": "tall"
      },
      "apply": [
        {"model": "minecraft:block/deepslate_brick_wall_side_tall", "weight": 100, "uvlock": true, "y":90},
		{"model": "block/wall/deepslate_bricks_wall_side_tall_a", "weight": 99, "uvlock": true, "y":90},
		{"model": "block/wall/deepslate_bricks_wall_side_tall_b", "weight": 99, "uvlock": true, "y":90},
		{"model": "block/wall/deepslate_bricks_wall_side_tall_c", "weight": 99, "uvlock": true, "y":90},
		{"model": "block/wall/deepslate_bricks_wall_side_tall_d", "weight": 99, "uvlock": true, "y":90},
		{"model": "block/wall/deepslate_bricks_wall_side_tall_e", "weight": 99, "uvlock": true, "y":90},
		{"model": "block/wall/deepslate_bricks_wall_side_tall_f", "weight": 99, "uvlock": true, "y":90},
		{"model": "block/wall/deepslate_bricks_wall_side_tall_g", "weight": 99, "uvlock": true, "y":90},
		{"model": "block/wall/deepslate_bricks_wall_side_tall_h", "weight": 99, "uvlock": true, "y":90}
		]
	},
    {
      "when": {
        "south": "tall"
      },
      "apply": [
        {"model": "minecraft:block/deepslate_brick_wall_side_tall", "weight": 100, "uvlock": true, "y":180},
		{"model": "block/wall/deepslate_bricks_wall_side_tall_a", "weight": 99, "uvlock": true, "y":180},
		{"model": "block/wall/deepslate_bricks_wall_side_tall_b", "weight": 99, "uvlock": true, "y":180},
		{"model": "block/wall/deepslate_bricks_wall_side_tall_c", "weight": 99, "uvlock": true, "y":180},
		{"model": "block/wall/deepslate_bricks_wall_side_tall_d", "weight": 99, "uvlock": true, "y":180},
		{"model": "block/wall/deepslate_bricks_wall_side_tall_e", "weight": 99, "uvlock": true, "y":180},
		{"model": "block/wall/deepslate_bricks_wall_side_tall_f", "weight": 99, "uvlock": true, "y":180},
		{"model": "block/wall/deepslate_bricks_wall_side_tall_g", "weight": 99, "uvlock": true, "y":180},
		{"model": "block/wall/deepslate_bricks_wall_side_tall_h", "weight": 99, "uvlock": true, "y":180}
		]
	},
    {
      "when": {
        "west": "tall"
      },
      "apply": [
        {"model": "minecraft:block/deepslate_brick_wall_side_tall", "weight": 100, "uvlock": true, "y":270},
		{"model": "block/wall/deepslate_bricks_wall_side_tall_a", "weight": 99, "uvlock": true, "y":270},
		{"model": "block/wall/deepslate_bricks_wall_side_tall_b", "weight": 99, "uvlock": true, "y":270},
		{"model": "block/wall/deepslate_bricks_wall_side_tall_c", "weight": 99, "uvlock": true, "y":270},
		{"model": "block/wall/deepslate_bricks_wall_side_tall_d", "weight": 99, "uvlock": true, "y":270},
		{"model": "block/wall/deepslate_bricks_wall_side_tall_e", "weight": 99, "uvlock": true, "y":270},
		{"model": "block/wall/deepslate_bricks_wall_side_tall_f", "weight": 99, "uvlock": true, "y":270},
		{"model": "block/wall/deepslate_bricks_wall_side_tall_g", "weight": 99, "uvlock": true, "y":270},
		{"model": "block/wall/deepslate_bricks_wall_side_tall_h", "weight": 99, "uvlock": true, "y":270}
		]
	}
  ]
}