{
  "type": "techreborn:blast_furnace",
  "power": 128,
  "time": 140,
  "ingredients": [
    {
      "item": "minecraft:golden_boots",
      "count": 1
    },
    {
      "item": "minecraft:sand",
      "count": 1
    }
  ],
  "results": [
    {
      "item": "minecraft:gold_ingot",
      "count": 2
    },
    {
      "item": "techreborn:dark_ashes_dust"
    }
  ],
  "heat": 1000
}