{
    "variants": {
        "": [
		{ "model": "block/birch_planks", "weight": 101 },
		{ "model": "block/planks/birch_a", "weight": 100 },
		{ "model": "block/planks/birch_b", "weight": 100 },
		{ "model": "block/planks/birch_c", "weight": 100 },
		{ "model": "block/planks/birch_d", "weight": 100 }
		]
    }
}
