{
  "parent": "minecraft:block/cube_bottom_top",
  "textures": {
    "side": "farmersdelight:block/onion_crate_side",
    "bottom": "farmersdelight:block/crate_bottom",
    "top": "farmersdelight:block/onion_crate_top"
  }
}