{
    "__createdwith": "opl's Model Creator",
    "ambientocclusion": false,
    "textures": {
        "particle": "block/acacia_trapdoor"
    },
    "elements": [
        {
            "from": [1,0,14],
            "to": [5,16,15],
            "faces": {
                "up": {
                    "uv": [1,10,5,11],
                    "texture": "#particle"
                },
                "down": {
                    "uv": [1,14,5,13],
                    "texture": "#particle"
                },
                "west": {
                    "uv": [0,13,16,14],
                    "texture": "#particle"
                },
                "east": {
                    "uv": [1,13,2,14],
                    "texture": "#particle"
                },
                "north": {
                    "uv": [5,0,1,16],
                    "texture": "#particle"
                },
                "south": {
                    "uv": [1,0,5,16],
                    "texture": "#particle"
                }
            }
        },
        {
            "from": [0,2,15],
            "to": [16,6,16],
            "faces": {
                "up": {
                    "uv": [0,12,16,13],
                    "texture": "#particle"
                },
                "down": {
                    "uv": [0,5,16,6],
                    "texture": "#particle"
                },
                "west": {
                    "uv": [0,2,1,6],
                    "texture": "#particle"
                },
                "east": {
                    "uv": [0,2,1,6],
                    "texture": "#particle"
                },
                "north": {
                    "uv": [0,13,1,14],
                    "texture": "#particle"
                },
                "south": {
                    "uv": [0,10,16,14],
                    "texture": "#particle"
                }
            }
        },
        {
            "from": [0,10,15],
            "to": [16,14,16],
            "faces": {
                "up": {
                    "uv": [0,12,16,13],
                    "texture": "#particle"
                },
                "down": {
                    "uv": [0,5,16,6],
                    "texture": "#particle"
                },
                "west": {
                    "uv": [0,2,1,6],
                    "texture": "#particle"
                },
                "east": {
                    "uv": [0,2,1,6],
                    "texture": "#particle"
                },
                "north": {
                    "uv": [0,13,1,14],
                    "texture": "#particle"
                },
                "south": {
                    "uv": [0,2,16,6],
                    "texture": "#particle"
                }
            }
        },
        {
            "from": [0,10,13],
            "to": [16,14,14],
            "faces": {
                "up": {
                    "uv": [0,12,16,13],
                    "texture": "#particle"
                },
                "down": {
                    "uv": [0,5,16,6],
                    "texture": "#particle"
                },
                "west": {
                    "uv": [0,2,1,6],
                    "texture": "#particle"
                },
                "east": {
                    "uv": [0,2,1,6],
                    "texture": "#particle"
                },
                "north": {
                    "uv": [0,2,16,6],
                    "texture": "#particle"
                },
                "south": {
                    "uv": [0,13,1,14],
                    "texture": "#particle"
                }
            }
        },
        {
            "from": [0,2,13],
            "to": [16,6,14],
            "faces": {
                "up": {
                    "uv": [0,12,16,13],
                    "texture": "#particle"
                },
                "down": {
                    "uv": [0,5,16,6],
                    "texture": "#particle"
                },
                "west": {
                    "uv": [0,2,1,6],
                    "texture": "#particle"
                },
                "east": {
                    "uv": [0,2,1,6],
                    "texture": "#particle"
                },
                "north": {
                    "uv": [0,10,16,14],
                    "texture": "#particle"
                },
                "south": {
                    "uv": [0,13,1,14],
                    "texture": "#particle"
                }
            }
        },
        {
            "from": [11,0,14],
            "to": [15,16,15],
            "faces": {
                "up": {
                    "uv": [1,10,5,11],
                    "texture": "#particle"
                },
                "down": {
                    "uv": [1,14,5,13],
                    "texture": "#particle"
                },
                "west": {
                    "uv": [0,13,16,14],
                    "texture": "#particle"
                },
                "east": {
                    "uv": [1,13,2,14],
                    "texture": "#particle"
                },
                "north": {
                    "uv": [5,0,1,16],
                    "texture": "#particle"
                },
                "south": {
                    "uv": [1,0,5,16],
                    "texture": "#particle"
                }
            }
        },
        {
            "from": [6,0,14],
            "to": [10,16,15],
            "faces": {
                "up": {
                    "uv": [1,10,5,11],
                    "texture": "#particle"
                },
                "down": {
                    "uv": [1,14,5,13],
                    "texture": "#particle"
                },
                "west": {
                    "uv": [0,13,16,14],
                    "texture": "#particle"
                },
                "east": {
                    "uv": [1,13,2,14],
                    "texture": "#particle"
                },
                "north": {
                    "uv": [5,0,1,16],
                    "texture": "#particle"
                },
                "south": {
                    "uv": [1,0,5,16],
                    "texture": "#particle"
                }
            }
        }
    ]
}