{
	"parent": "mcwbridges:block/bridge/rail/parent/side_left",
	"textures": {
		"0": "minecraft:block/crimson_stem",
		"2": "minecraft:block/crimson_planks",
		"3": "minecraft:block/crimson_stem_top",
		"particle": "minecraft:block/crimson_planks"
	}
}
