{
  "parent": "minecraft:block/slab_top",
  "textures": {
    "bottom": "block/custom/planks/dark_oak_d",
    "top": "block/custom/planks/dark_oak_d",
    "side": "block/custom/planks/dark_oak_d"
  }
}