{
  "type": "techreborn:grinder",
  "power": 5,
  "time": 1500,
  "ingredients": [
    {
      "tag": "c:platinum_blocks"
    }
  ],
  "results": [
    {
      "item": "techreborn:platinum_dust",
      "count": 9
    }
  ]
}