{
    "variants": {
        "": [
		{ "model": "minecraft:block/deepslate_tiles", "weight": 3 },
		{ "model": "block/deepslatetiles/a", "weight": 3 },
		{ "model": "block/deepslatetiles/b", "weight": 3 },
		{ "model": "block/deepslatetiles/c", "weight": 3 },
		{ "model": "block/deepslatetiles/d", "weight": 3 }
		]
    }
}
