{
	"credit": "Made with Blockbench",
	"elements": [
		{
			"from": [6, 4, 7],
			"to": [10, 6, 8],
			"faces": {
				"north": {"uv": [0, 0, 4, 2], "texture": "#1_1"},
				"east": {"uv": [0, 0, 1, 2], "texture": "#1_1"},
				"south": {"uv": [0, 0, 4, 2], "texture": "#1_1"},
				"west": {"uv": [0, 0, 1, 2], "texture": "#1_1"},
				"down": {"uv": [0, 0, 4, 1], "texture": "#1_1"}
			}
		},
		{
			"from": [6, 5, 6],
			"to": [10, 8, 7],
			"faces": {
				"north": {"uv": [0, 0, 4, 3], "texture": "#1_1"},
				"east": {"uv": [0, 0, 1, 3], "texture": "#1_1"},
				"south": {"uv": [0, 0, 0, 0], "texture": "#1_1"},
				"west": {"uv": [0, 0, 1, 3], "texture": "#1_1"},
				"down": {"uv": [0, 0, 4, 1], "texture": "#1_1"}
			}
		},
		{
			"from": [7, 5, 8],
			"to": [9, 7, 9],
			"faces": {
				"east": {"uv": [7, 6, 8, 8], "texture": "#3"},
				"south": {"uv": [7, 6, 9, 8], "texture": "#3"},
				"west": {"uv": [7, 6, 8, 8], "texture": "#3"},
				"up": {"uv": [7, 6, 9, 7], "texture": "#3"},
				"down": {"uv": [7, 6, 9, 7], "texture": "#3"}
			}
		}
	],
	"display": {
		"thirdperson_righthand": {
			"rotation": [73, -180, 0],
			"translation": [-0.25, 0, 2.75],
			"scale": [0.4, 0.4, 0.4]
		},
		"thirdperson_lefthand": {
			"rotation": [73, -180, 0],
			"translation": [0, 0, 2.25],
			"scale": [0.4, 0.4, 0.4]
		},
		"firstperson_righthand": {
			"rotation": [0, -75, 0],
			"translation": [0, 1.75, 0],
			"scale": [0.4, 0.4, 0.4]
		},
		"firstperson_lefthand": {
			"rotation": [0, -73, 0],
			"translation": [0, 1.5, 0],
			"scale": [0.4, 0.4, 0.4]
		},
		"ground": {
			"scale": [0.31, 0.31, 0.31]
		},
		"gui": {
			"rotation": [25, 45, 0],
			"scale": [0.6, 0.6, 0.6]
		},
		"head": {
			"rotation": [-1, 0, 0],
			"translation": [0, 10.5, 0],
			"scale": [0.5, 0.5, 0.5]
		},
		"fixed": {
			"rotation": [0, 90, 0],
			"translation": [0, 0, 4.75]
		}
	},
	"groups": [
		{
			"name": "torch",
			"origin": [8, 8, 8],
			"color": 0,
			"children": [0, 1, 2]
		}
	]
}