{
	"credit": "Made with Blockbench",
	"elements": [
		{
			"from": [0, 8.9, 0],
			"to": [2, 15.9, 8],
			"rotation": {"angle": 0, "axis": "y", "origin": [8, 6.22049, 8.24841]},
			"faces": {
				"north": {"uv": [0, 0, 2, 7], "texture": "#2"},
				"east": {"uv": [0, 0, 8, 7], "texture": "#2"},
				"south": {"uv": [0, 0, 2, 7], "texture": "#2"},
				"west": {"uv": [0, 0, 8, 7], "texture": "#2"},
				"up": {"uv": [0, 0, 2, 8], "texture": "#2"}
			}
		},
		{
			"from": [0, 6, 0],
			"to": [16, 9, 8],
			"rotation": {"angle": 0, "axis": "y", "origin": [8, -5, 8]},
			"faces": {
				"north": {"uv": [0, 5, 16, 8], "texture": "#2"},
				"south": {"uv": [0, 5, 16, 8], "texture": "#2"},
				"west": {"uv": [0, 8, 8, 11], "texture": "#2"},
				"up": {"uv": [0, 0, 8, 16], "rotation": 90, "texture": "#1"},
				"down": {"uv": [0, 0, 8, 16], "rotation": 270, "texture": "#2"}
			}
		},
		{
			"from": [0, 0, 8],
			"to": [16, 3, 16],
			"rotation": {"angle": 0, "axis": "y", "origin": [8, -5, 8]},
			"faces": {
				"north": {"uv": [0, 5, 16, 8], "texture": "#2"},
				"south": {"uv": [0, 5, 16, 8], "texture": "#2"},
				"west": {"uv": [0, 8, 8, 11], "texture": "#2"},
				"up": {"uv": [0, 0, 8, 16], "rotation": 90, "texture": "#1"},
				"down": {"uv": [0, 0, 8, 16], "rotation": 270, "texture": "#2"}
			}
		},
		{
			"from": [0, 2.9, 8],
			"to": [2, 9.9, 16],
			"rotation": {"angle": 0, "axis": "y", "origin": [8, 6.22049, 8.24841]},
			"faces": {
				"north": {"uv": [0, 0, 2, 7], "texture": "#2"},
				"east": {"uv": [0, 0, 8, 7], "texture": "#2"},
				"south": {"uv": [0, 0, 2, 7], "texture": "#2"},
				"west": {"uv": [0, 0, 8, 7], "texture": "#2"},
				"up": {"uv": [0, 0, 2, 8], "texture": "#2"}
			}
		}
	],
	"display": {
		"thirdperson_righthand": {
			"rotation": [73, -180, 0],
			"translation": [-0.25, 0, 2.75],
			"scale": [0.4, 0.4, 0.4]
		},
		"thirdperson_lefthand": {
			"rotation": [73, -180, 0],
			"translation": [0, 0, 2.25],
			"scale": [0.4, 0.4, 0.4]
		},
		"firstperson_righthand": {
			"rotation": [0, -75, 0],
			"translation": [0, 1.75, 0],
			"scale": [0.4, 0.4, 0.4]
		},
		"firstperson_lefthand": {
			"rotation": [0, -73, 0],
			"translation": [0, 1.5, 0],
			"scale": [0.4, 0.4, 0.4]
		},
		"ground": {
			"scale": [0.31, 0.31, 0.31]
		},
		"gui": {
			"rotation": [25, 45, 0],
			"scale": [0.6, 0.6, 0.6]
		},
		"head": {
			"rotation": [-1, 0, 0],
			"translation": [0, 10.5, 0],
			"scale": [0.5, 0.5, 0.5]
		},
		"fixed": {
			"rotation": [0, 90, 0],
			"translation": [0, 0, 4.75]
		}
	},
	"groups": [
		{
			"name": "double",
			"origin": [8, 8, 8],
			"color": 0,
			"children": [0, 1, 2, 3]
		}
	]
}