{
    "variants": {
        "": [
		{ "model": "block/red_sandstone", "weight":101 },
		{ "model": "block/redsandstone/normal_a", "weight":100 },
		{ "model": "block/redsandstone/normal_b", "weight":100 },
		{ "model": "block/redsandstone/normal_c", "weight":100 }
		]
    }
}
