{
	"credit": "Made with Blockbench",
	"textures": {
		"1": "mcwbridges:block/bridge_1",
		"particle": "mcwbridges:block/bridge_1"
	},
	"elements": [
		{
			"from": [15, 14, 0],
			"to": [16, 16, 10],
			"rotation": {"angle": 0, "axis": "y", "origin": [15, 1, 0]},
			"faces": {
				"north": {"uv": [0, 0, 1, 2], "texture": "#1"},
				"east": {"uv": [0, 0, 10, 2], "texture": "#1"},
				"south": {"uv": [0, 0, 1, 2], "texture": "#1"},
				"west": {"uv": [0, 0, 10, 2], "texture": "#1"},
				"up": {"uv": [0, 0, 1, 10], "texture": "#1"},
				"down": {"uv": [0, 0, 1, 10], "texture": "#1"}
			}
		},
		{
			"from": [15, 1, 7],
			"to": [16, 14, 9],
			"rotation": {"angle": 0, "axis": "y", "origin": [15, 1, 0]},
			"faces": {
				"north": {"uv": [0, 0, 1, 13], "texture": "#1"},
				"east": {"uv": [0, 0, 2, 13], "texture": "#1"},
				"south": {"uv": [0, 0, 1, 13], "texture": "#1"},
				"west": {"uv": [0, 0, 2, 13], "texture": "#1"},
				"down": {"uv": [0, 0, 1, 2], "texture": "#1"}
			}
		},
		{
			"from": [15.1, 1.2, 11.6],
			"to": [15.9, 17.2, 13.6],
			"rotation": {"angle": -22.5, "axis": "x", "origin": [15.5, 7.5, 15]},
			"faces": {
				"north": {"uv": [0, 0, 0.8, 16], "texture": "#1"},
				"east": {"uv": [0, 0, 2, 16], "texture": "#1"},
				"south": {"uv": [0, 0, 0.8, 16], "texture": "#1"},
				"west": {"uv": [0, 0, 2, 16], "texture": "#1"},
				"down": {"uv": [0, 0, 0.8, 2], "texture": "#1"}
			}
		}
	]
}