{
    "variants": {
        "": [
		{ "model": "block/warped_roots", "weight": 100 },
		{ "model": "block/warpedroots/a", "weight": 99 },
		{ "model": "block/warpedroots/b", "weight": 99 }
		]
    }
}
