{
  "variants": {
    "composting=0": [
      { "model": "farmersdelight:block/organic_compost_0" },
      { "model": "farmersdelight:block/organic_compost_0", "y": 90 },
      { "model": "farmersdelight:block/organic_compost_0", "y": 180 },
      { "model": "farmersdelight:block/organic_compost_0", "y": 270 }
    ],
    "composting=1": [
      { "model": "farmersdelight:block/organic_compost_1" },
      { "model": "farmersdelight:block/organic_compost_1", "y": 90 },
      { "model": "farmersdelight:block/organic_compost_1", "y": 180 },
      { "model": "farmersdelight:block/organic_compost_1", "y": 270 }
    ],
    "composting=2": [
      { "model": "farmersdelight:block/organic_compost_2" },
      { "model": "farmersdelight:block/organic_compost_2", "y": 90 },
      { "model": "farmersdelight:block/organic_compost_2", "y": 180 },
      { "model": "farmersdelight:block/organic_compost_2", "y": 270 }
    ],
    "composting=3": [
      { "model": "farmersdelight:block/organic_compost_3" },
      { "model": "farmersdelight:block/organic_compost_3", "y": 90 },
      { "model": "farmersdelight:block/organic_compost_3", "y": 180 },
      { "model": "farmersdelight:block/organic_compost_3", "y": 270 }
    ],
    "composting=4": [
      { "model": "farmersdelight:block/organic_compost_4" },
      { "model": "farmersdelight:block/organic_compost_4", "y": 90 },
      { "model": "farmersdelight:block/organic_compost_4", "y": 180 },
      { "model": "farmersdelight:block/organic_compost_4", "y": 270 }
    ],
    "composting=5": [
      { "model": "farmersdelight:block/organic_compost_5" },
      { "model": "farmersdelight:block/organic_compost_5", "y": 90 },
      { "model": "farmersdelight:block/organic_compost_5", "y": 180 },
      { "model": "farmersdelight:block/organic_compost_5", "y": 270 }
    ],
    "composting=6": [
      { "model": "farmersdelight:block/organic_compost_6" },
      { "model": "farmersdelight:block/organic_compost_6", "y": 90 },
      { "model": "farmersdelight:block/organic_compost_6", "y": 180 },
      { "model": "farmersdelight:block/organic_compost_6", "y": 270 }
    ],
    "composting=7": [
      { "model": "farmersdelight:block/organic_compost_7" },
      { "model": "farmersdelight:block/organic_compost_7", "y": 90 },
      { "model": "farmersdelight:block/organic_compost_7", "y": 180 },
      { "model": "farmersdelight:block/organic_compost_7", "y": 270 }
    ]
  }
}
