{
  "type": "minecraft:crafting_shapeless",
  "ingredients": [
    {
      "item": "techreborn:brass_ingot"
    },
    {
      "item": "techreborn:brass_ingot"
    },
    {
      "item": "techreborn:brass_ingot"
    },
    {
      "item": "techreborn:brass_ingot"
    },
    {
      "item": "techreborn:brass_ingot"
    },
    {
      "item": "techreborn:brass_ingot"
    },
    {
      "item": "techreborn:brass_ingot"
    },
    {
      "item": "techreborn:brass_ingot"
    },
    {
      "item": "techreborn:brass_ingot"
    }
  ],
  "result": {
    "item": "techreborn:brass_storage_block"
  }
}