{
  "type": "techreborn:grinder",
  "power": 2,
  "time": 270,
  "ingredients": [
    {
      "tag": "c:silver_ores"
    }
  ],
  "results": [
    {
      "item": "techreborn:raw_silver",
      "count": 2
    }
  ]
}