{
  "parent": "minecraft:block/slab_top",
  "textures": {
    "bottom": "block/custom/deepslatebricks/f",
    "top": "block/custom/deepslatebricks/f",
    "side": "block/custom/deepslatebricks/f"
  }
}