{
    "variants": {
        "": [
		{ "model": "block/planks/dark_oak_a", "weight": 100 },
		{ "model": "block/planks/dark_oak_b", "y": 90, "weight": 100 },
		{ "model": "block/planks/dark_oak_c", "y": 180, "weight": 100 },
		{ "model": "block/planks/dark_oak_d", "y": 270, "weight": 100 }
		]
    }
}
