{
	"parent": "mcwbridges:block/bridge/rail/parent/inventory",
	"textures": {
		"0": "minecraft:block/birch_log",
		"2": "minecraft:block/birch_planks",
		"3": "minecraft:block/birch_log_top",
		"particle": "minecraft:block/birch_planks"
	}
}
