{
    "variants": {
        "": [
		{ "model": "block/blackstone", "weight": 101 },
		{ "model": "block/blackstone/a", "weight": 100 },
		{ "model": "block/blackstone/b", "weight": 100 }
		]
    }
}
