{
	"parent": "mcwbridges:block/bridge/rail/parent/corner",
	"textures": {
		"0": "minecraft:block/acacia_log",
		"2": "minecraft:block/acacia_planks",
		"3": "minecraft:block/acacia_log_top",
		"particle": "minecraft:block/acacia_planks"
	}
}
