{
  "parent": "minecraft:block/slab_top",
  "textures": {
    "bottom": "block/custom/deepslatebricks/g",
    "top": "block/custom/deepslatebricks/g",
    "side": "block/custom/deepslatebricks/g"
  }
}