{
  "type": "minecraft:crafting_shapeless",
  "ingredients": [
    {
      "item": "techreborn:raw_tungsten"
    },
    {
      "item": "techreborn:raw_tungsten"
    },
    {
      "item": "techreborn:raw_tungsten"
    },
    {
      "item": "techreborn:raw_tungsten"
    },
    {
      "item": "techreborn:raw_tungsten"
    },
    {
      "item": "techreborn:raw_tungsten"
    },
    {
      "item": "techreborn:raw_tungsten"
    },
    {
      "item": "techreborn:raw_tungsten"
    },
    {
      "item": "techreborn:raw_tungsten"
    }
  ],
  "result": {
    "item": "techreborn:raw_tungsten_storage_block"
  }
}