{
  "type": "minecraft:crafting_shapeless",
  "ingredients": [
    {
      "item": "techreborn:tin_ingot"
    },
    {
      "item": "techreborn:tin_ingot"
    },
    {
      "item": "techreborn:tin_ingot"
    },
    {
      "item": "techreborn:tin_ingot"
    },
    {
      "item": "techreborn:tin_ingot"
    },
    {
      "item": "techreborn:tin_ingot"
    },
    {
      "item": "techreborn:tin_ingot"
    },
    {
      "item": "techreborn:tin_ingot"
    },
    {
      "item": "techreborn:tin_ingot"
    }
  ],
  "result": {
    "item": "techreborn:tin_storage_block"
  }
}