{
  "type": "minecraft:crafting_shaped",
  "pattern": [
    "X  ",
    "XX ",
    "XXX"
  ],
  "key": {
    "X": {
      "tag": "c:invar_blocks"
    }
  },
  "result": {
    "item": "techreborn:invar_storage_block_stairs",
    "count": 4
  }
}