{
  "parent": "minecraft:recipes/root",
  "rewards": {
    "recipes": [
      "techreborn:chemical_reactor/gray_terracotta_from_light_gray_terracotta_with_black_dye"
    ]
  },
  "criteria": {
    "has_black_dye": {
      "trigger": "minecraft:inventory_changed",
      "conditions": {
        "items": [
          {
            "items": [
              "minecraft:black_dye"
            ]
          }
        ]
      }
    },
    "has_the_recipe": {
      "trigger": "minecraft:recipe_unlocked",
      "conditions": {
        "recipe": "techreborn:chemical_reactor/gray_terracotta_from_light_gray_terracotta_with_black_dye"
      }
    }
  },
  "requirements": [
    [
      "has_black_dye",
      "has_the_recipe"
    ]
  ]
}