{
  "parent": "minecraft:recipes/root",
  "rewards": {
    "recipes": [
      "techreborn:blast_furnace/bronze_ingot_from_chestplate"
    ]
  },
  "criteria": {
    "has_bronze_chestplate": {
      "trigger": "minecraft:inventory_changed",
      "conditions": {
        "items": [
          {
            "items": [
              "techreborn:bronze_chestplate"
            ]
          }
        ]
      }
    },
    "has_the_recipe": {
      "trigger": "minecraft:recipe_unlocked",
      "conditions": {
        "recipe": "techreborn:blast_furnace/bronze_ingot_from_chestplate"
      }
    }
  },
  "requirements": [
    [
      "has_bronze_chestplate",
      "has_the_recipe"
    ]
  ]
}