{
  "type": "minecraft:crafting_shaped",
  "pattern": [
    "X",
    "X",
    "#"
  ],
  "key": {
    "X": {
      "item": "techreborn:ruby_gem"
    },
    "#": {
      "item": "minecraft:stick"
    }
  },
  "result": {
    "item": "techreborn:ruby_sword"
  }
}