{
  "parent": "minecraft:recipes/root",
  "rewards": {
    "recipes": [
      "techreborn:compressor/carbon_plate"
    ]
  },
  "criteria": {
    "has_carbon_mesh": {
      "trigger": "minecraft:inventory_changed",
      "conditions": {
        "items": [
          {
            "items": [
              "techreborn:carbon_mesh"
            ]
          }
        ]
      }
    },
    "has_the_recipe": {
      "trigger": "minecraft:recipe_unlocked",
      "conditions": {
        "recipe": "techreborn:compressor/carbon_plate"
      }
    }
  },
  "requirements": [
    [
      "has_carbon_mesh",
      "has_the_recipe"
    ]
  ]
}