{
	"parent": "mcwbridges:block/bridge/bridge_stone/parent/base_torch",
	"textures": {
		"1": "minecraft:block/deepslate_tiles",
		"3": "minecraft:block/torch",
		"particle": "minecraft:block/deepslate_tiles"
	}
}
