{
  "parent": "minecraft:block/slab_top",
  "textures": {
    "bottom": "block/custom/mossycobblestone/e",
    "top": "block/custom/mossycobblestone/e",
    "side": "block/custom/mossycobblestone/e"
  }
}