{
  "parent": "minecraft:recipes/root",
  "rewards": {
    "recipes": [
      "techreborn:extractor/blue_dye_from_lapis_lazuli"
    ]
  },
  "criteria": {
    "has_lapis_lazuli": {
      "trigger": "minecraft:inventory_changed",
      "conditions": {
        "items": [
          {
            "items": [
              "minecraft:lapis_lazuli"
            ]
          }
        ]
      }
    },
    "has_the_recipe": {
      "trigger": "minecraft:recipe_unlocked",
      "conditions": {
        "recipe": "techreborn:extractor/blue_dye_from_lapis_lazuli"
      }
    }
  },
  "requirements": [
    [
      "has_lapis_lazuli",
      "has_the_recipe"
    ]
  ]
}