{
  "type": "techreborn:grinder",
  "power": 3,
  "time": 200,
  "ingredients": [
    {
      "item": "minecraft:smooth_sandstone_stairs",
      "count": 1
    }
  ],
  "results": [
    {
      "item": "minecraft:sand",
      "count": 3
    }
  ]
}