{
  "type": "techreborn:grinder",
  "power": 3,
  "time": 180,
  "ingredients": [
    {
      "item": "minecraft:wooden_pickaxe",
      "count": 1
    }
  ],
  "results": [
    {
      "item": "techreborn:saw_small_dust"
    }
  ]
}