{
    "variants": {
        "": [
		{ "model": "block/grass", "weight": 101 },
		{ "model": "block/grass/a", "weight": 100 },
		{ "model": "block/grass/b", "weight": 100 },
		{ "model": "block/grass/c", "weight": 100 }
		]
    }
}
