{
  "parent": "block/cube_bottom_top",
  "textures": {
    "top": "farmersdelight:block/rich_soil_farmland_moist",
    "side": "farmersdelight:block/rich_soil_farmland_moist_side",
    "bottom": "farmersdelight:block/rich_soil"
  },
  "elements": [
    {
      "from": [ 0, 0, 0 ],
      "to": [ 16, 15, 16 ],
      "faces": {
        "down":  { "uv": [ 0, 0, 16, 16 ], "texture": "#bottom", "cullface": "down" },
        "up":    { "uv": [ 0, 0, 16, 16 ], "texture": "#top" },
        "north": { "uv": [ 0, 1, 16, 16 ], "texture": "#side", "cullface": "north" },
        "south": { "uv": [ 0, 1, 16, 16 ], "texture": "#side", "cullface": "south" },
        "west":  { "uv": [ 0, 1, 16, 16 ], "texture": "#side", "cullface": "west" },
        "east":  { "uv": [ 0, 1, 16, 16 ], "texture": "#side", "cullface": "east" }
      }
    }
  ]
}
