{
	"parent": "mcwbridges:block/bridge/rope/parent/base_torch",
	"textures": {
		"1": "minecraft:block/torch",
		"3": "minecraft:block/crimson_stem",
		"particle": "minecraft:block/crimson_planks"
	}
}
