{
    "__createdwith": "opl's Model Creator",
    "ambientocclusion": false,
    "textures": {
        "particle": "block/acacia_trapdoor"
    },
    "elements": [
        {
            "from": [1,1,0],
            "to": [5,2,16],
            "faces": {
                "up": {
                    "uv": [1,0,5,16],
                    "texture": "#particle"
                },
                "down": {
                    "uv": [1,16,5,0],
                    "texture": "#particle"
                },
                "west": {
                    "uv": [0,13,16,14],
                    "texture": "#particle"
                },
                "east": {
                    "uv": [0,13,16,14],
                    "texture": "#particle"
                },
                "north": {
                    "uv": [4,7,3,10],
                    "texture": "#particle"
                },
                "south": {
                    "uv": [1,15,5,16],
                    "texture": "#particle"
                }
            }
        },
        {
            "from": [11,1,0],
            "to": [15,2,16],
            "faces": {
                "up": {
                    "uv": [11,0,15,16],
                    "texture": "#particle"
                },
                "down": {
                    "uv": [11,16,15,0],
                    "texture": "#particle"
                },
                "west": {
                    "uv": [0,13,16,14],
                    "texture": "#particle"
                },
                "east": {
                    "uv": [0,13,16,14],
                    "texture": "#particle"
                },
                "north": {
                    "uv": [4,7,3,10],
                    "texture": "#particle"
                },
                "south": {
                    "uv": [11,15,15,16],
                    "texture": "#particle"
                }
            }
        },
        {
            "from": [0,0,2],
            "to": [16,1,6],
            "faces": {
                "up": {
                    "uv": [0,2,16,6],
                    "texture": "#particle"
                },
                "down": {
                    "uv": [0,14,16,10],
                    "texture": "#particle"
                },
                "west": {
                    "uv": [0,2,1,6],
                    "texture": "#particle",
                    "rotation": 90
                },
                "east": {
                    "uv": [0,2,1,6],
                    "texture": "#particle",
                    "rotation": 270
                },
                "north": {
                    "uv": [0,12,16,13],
                    "texture": "#particle"
                },
                "south": {
                    "uv": [0,13,16,14],
                    "texture": "#particle"
                }
            }
        },
        {
            "from": [0,0,10],
            "to": [16,1,14],
            "faces": {
                "up": {
                    "uv": [0,10,16,14],
                    "texture": "#particle"
                },
                "down": {
                    "uv": [0,6,16,2],
                    "texture": "#particle"
                },
                "west": {
                    "uv": [0,2,1,6],
                    "texture": "#particle",
                    "rotation": 90
                },
                "east": {
                    "uv": [0,2,1,6],
                    "texture": "#particle",
                    "rotation": 270
                },
                "north": {
                    "uv": [0,12,16,13],
                    "texture": "#particle"
                },
                "south": {
                    "uv": [0,13,16,14],
                    "texture": "#particle"
                }
            }
        },
        {
            "from": [6,1,0],
            "to": [10,2,16],
            "faces": {
                "up": {
                    "uv": [6,0,10,16],
                    "texture": "#particle"
                },
                "down": {
                    "uv": [6,16,10,0],
                    "texture": "#particle"
                },
                "west": {
                    "uv": [0,13,16,14],
                    "texture": "#particle"
                },
                "east": {
                    "uv": [0,13,16,14],
                    "texture": "#particle"
                },
                "north": {
                    "uv": [4,7,3,10],
                    "texture": "#particle"
                },
                "south": {
                    "uv": [6,15,10,16],
                    "texture": "#particle"
                }
            }
        },
        {
            "from": [0,2,10],
            "to": [16,3,14],
            "faces": {
                "up": {
                    "uv": [0,10,16,14],
                    "texture": "#particle"
                },
                "down": {
                    "uv": [0,2,16,6],
                    "texture": "#particle"
                },
                "west": {
                    "uv": [0,2,1,6],
                    "texture": "#particle",
                    "rotation": 90
                },
                "east": {
                    "uv": [0,2,1,6],
                    "texture": "#particle",
                    "rotation": 270
                },
                "north": {
                    "uv": [0,12,16,13],
                    "texture": "#particle"
                },
                "south": {
                    "uv": [0,13,16,14],
                    "texture": "#particle"
                }
            }
        },
        {
            "from": [0,2,2],
            "to": [16,3,6],
            "faces": {
                "up": {
                    "uv": [0,10,16,14],
                    "texture": "#particle"
                },
                "down": {
                    "uv": [0,2,16,6],
                    "texture": "#particle"
                },
                "west": {
                    "uv": [0,2,1,6],
                    "texture": "#particle",
                    "rotation": 90
                },
                "east": {
                    "uv": [0,2,1,6],
                    "texture": "#particle",
                    "rotation": 270
                },
                "north": {
                    "uv": [0,12,16,13],
                    "texture": "#particle"
                },
                "south": {
                    "uv": [0,13,16,14],
                    "texture": "#particle"
                }
            }
        }
    ]
}