{
	"parent": "mcwbridges:block/bridge/rope/parent/side_left",
	"textures": {
		"0": "mcwbridges:block/lead_knot_vert",
		"3": "mcwbridges:block/lead_knot",
		"4": "minecraft:block/birch_log",
		"particle": "minecraft:block/birch_log"
	}
}
