{
    "parent": "block/cube_bottom_top",
    "textures": {
        "bottom": "block/dark_oak_planks",
        "top": "block/dark_oak_planks",
        "side": "block/custom/planks/dark_oak_a"
    }
}
