{
  "parent": "minecraft:recipes/root",
  "rewards": {
    "recipes": [
      "techreborn:chemical_reactor/purple_stained_glass_from_blue_stained_glass_with_magenta_dye"
    ]
  },
  "criteria": {
    "has_magenta_dye": {
      "trigger": "minecraft:inventory_changed",
      "conditions": {
        "items": [
          {
            "items": [
              "minecraft:magenta_dye"
            ]
          }
        ]
      }
    },
    "has_the_recipe": {
      "trigger": "minecraft:recipe_unlocked",
      "conditions": {
        "recipe": "techreborn:chemical_reactor/purple_stained_glass_from_blue_stained_glass_with_magenta_dye"
      }
    }
  },
  "requirements": [
    [
      "has_magenta_dye",
      "has_the_recipe"
    ]
  ]
}