{
    "variants": {
        "": [
			{ "model": "block/lapis_ore", "weight": 101 },
			{ "model": "block/ore/lapis_a", "weight": 100 },
			{ "model": "block/ore/lapis_b", "weight": 100 },
			{ "model": "block/ore/lapis_c", "weight": 100 }
		]
    }
}
