{
    "__createdwith": "opl's Model Creator",
    "ambientocclusion": false,
    "textures": {
        "particle": "block/dark_oak_trapdoor"
    },
    "elements": [
        {
            "from": [13,0,13],
            "to": [16,16,16],
            "faces": {
                "up": {
                    "uv": [13,0,16,3],
                    "texture": "#particle"
                },
                "down": {
                    "uv": [13,0,16,3],
                    "texture": "#particle"
                },
                "west": {
                    "uv": [13,4,14,5],
                    "texture": "#particle"
                },
                "east": {
                    "uv": [0,0,16,3],
                    "texture": "#particle",
                    "rotation": 90
                },
                "north": {
                    "uv": [0,0,3,16],
                    "texture": "#particle"
                },
                "south": {
                    "texture": "#particle"
                }
            }
        },
        {
            "from": [0,0,13],
            "to": [3,16,16],
            "faces": {
                "up": {
                    "uv": [0,0,3,3],
                    "texture": "#particle"
                },
                "down": {
                    "uv": [0,0,3,3],
                    "texture": "#particle"
                },
                "west": {
                    "uv": [0,0,16,3],
                    "texture": "#particle",
                    "rotation": 90
                },
                "east": {
                    "uv": [13,4,14,5],
                    "texture": "#particle"
                },
                "north": {
                    "uv": [13,0,16,16],
                    "texture": "#particle"
                },
                "south": {
                    "texture": "#particle"
                }
            }
        },
        {
            "from": [3,13,13],
            "to": [13,16,16],
            "faces": {
                "up": {
                    "uv": [3,0,13,3],
                    "texture": "#particle"
                },
                "down": {
                    "uv": [15,2,16,3],
                    "texture": "#particle"
                },
                "north": {
                    "uv": [3,13,13,16],
                    "texture": "#particle"
                },
                "south": {
                    "uv": [3,13,13,16],
                    "texture": "#particle"
                }
            }
        },
        {
            "from": [3,0,13],
            "to": [13,3,16],
            "faces": {
                "up": {
                    "uv": [13,4,14,5],
                    "texture": "#particle"
                },
                "down": {
                    "uv": [3,0,13,3],
                    "texture": "#particle"
                },
                "north": {
                    "texture": "#particle"
                },
                "south": {
                    "uv": [3,13,13,16],
                    "texture": "#particle"
                }
            }
        },
        {
            "from": [3,2,14],
            "to": [13,13,15],
            "faces": {
                "north": {
                    "texture": "#particle"
                },
                "south": {
                    "texture": "#particle"
                }
            }
        }
    ]
}