{
  "variants": {
    "type=bottom": [
		{"model": "minecraft:block/andesite_slab", "weight": 101 },
		{"model": "block/slab/andesite_a", "weight": 100 }
    ],
    "type=double": [
		{ "model": "minecraft:block/andesite", "weight": 101 },
		{ "model": "block/andesite/a", "weight": 100 }
    ],
    "type=top": [
		{"model": "minecraft:block/andesite_slab_top", "weight": 101 },
	  	{"model": "block/slab/andesite_top_a", "weight": 100 }
	]
  }
}