{
	"parent": "mcwbridges:block/bridge/bridge_stone/parent/inventory",
	"textures": {
		"2": "minecraft:block/deepslate_tiles",
		"particle": "minecraft:block/deepslate",
		"2_2": "minecraft:block/deepslate"
	}
}
