{
  "credit": "Made with Blockbench",
  "textures": {
    "0": "farmersdelight:block/rope",
    "particle": "farmersdelight:block/rope"
  },
  "elements": [
    {
      "from": [8, 0, 0],
      "to": [8, 16, 7],
      "faces": {
        "east": {
          "uv": [9, 0, 16, 16],
          "texture": "#0"
        },
        "west": {
          "uv": [0, 0, 7, 16],
          "texture": "#0"
        }
      }
    }
  ]
}