{
	"parent": "mcwbridges:block/stair/rope/parent/double",
	"textures": {
		"0": "mcwbridges:block/lead_knot_vert",
		"2": "minecraft:block/warped_planks",
		"3": "mcwbridges:block/lead_knot",
		"4": "minecraft:block/warped_stem",
		"particle": "minecraft:block/warped_stem"
	}
}
