{
    "__createdwith": "opl's Model Creator",
    "ambientocclusion": false,
    "textures": {
        "particle": "block/jungle_trapdoor"
    },
    "elements": [
        {
            "from": [0,13,13],
            "to": [16,16,16],
            "faces": {
                "up": {
                    "texture": "#particle"
                },
                "down": {
                    "uv": [0,16,16,13],
                    "texture": "#particle"
                },
                "west": {
                    "texture": "#particle"
                },
                "east": {
                    "uv": [0,13,3,16],
                    "texture": "#particle"
                },
                "north": {
                    "uv": [0,13,16,14],
                    "texture": "#particle"
                },
                "south": {
                    "texture": "#particle"
                }
            }
        },
        {
            "from": [0,13,0],
            "to": [16,16,3],
            "faces": {
                "up": {
                    "texture": "#particle"
                },
                "down": {
                    "uv": [0,3,16,0],
                    "texture": "#particle"
                },
                "west": {
                    "texture": "#particle"
                },
                "east": {
                    "uv": [13,13,16,16],
                    "texture": "#particle"
                },
                "north": {
                    "texture": "#particle"
                },
                "south": {
                    "uv": [0,13,16,14],
                    "texture": "#particle"
                }
            }
        },
        {
            "from": [0,13,3],
            "to": [3,16,13],
            "faces": {
                "up": {
                    "texture": "#particle"
                },
                "down": {
                    "uv": [13,13,16,3],
                    "texture": "#particle"
                },
                "west": {
                    "texture": "#particle"
                },
                "east": {
                    "uv": [3,13,13,14],
                    "texture": "#particle"
                }
            }
        },
        {
            "from": [13,13,3],
            "to": [16,16,13],
            "faces": {
                "up": {
                    "texture": "#particle"
                },
                "down": {
                    "uv": [0,13,3,3],
                    "texture": "#particle"
                },
                "west": {
                    "uv": [3,13,13,14],
                    "texture": "#particle"
                },
                "east": {
                    "texture": "#particle"
                }
            }
        },
        {
            "from": [4,14,3],
            "to": [7,15,13],
            "faces": {
                "up": {
                    "texture": "#particle"
                },
                "down": {
                    "uv": [12,13,9,3],
                    "texture": "#particle"
                },
                "west": {
                    "uv": [3,13,13,14],
                    "texture": "#particle"
                },
                "east": {
                    "uv": [3,13,13,14],
                    "texture": "#particle"
                }
            }
        },
        {
            "from": [9,14,3],
            "to": [12,15,13],
            "faces": {
                "up": {
                    "texture": "#particle"
                },
                "down": {
                    "uv": [7,13,4,3],
                    "texture": "#particle"
                },
                "west": {
                    "uv": [3,13,13,14],
                    "texture": "#particle"
                },
                "east": {
                    "uv": [3,13,13,14],
                    "texture": "#particle"
                }
            }
        },
        {
            "from": [3,14,4],
            "to": [13,15,7],
            "faces": {
                "up": {
                    "texture": "#particle"
                },
                "down": {
                    "uv": [3,7,13,4],
                    "texture": "#particle"
                },
                "north": {
                    "uv": [3,13,13,14],
                    "texture": "#particle"
                },
                "south": {
                    "uv": [3,13,13,14],
                    "texture": "#particle"
                }
            }
        },
        {
            "from": [3,14,9],
            "to": [13,15,12],
            "faces": {
                "up": {
                    "texture": "#particle"
                },
                "down": {
                    "uv": [3,12,13,9],
                    "texture": "#particle"
                },
                "north": {
                    "uv": [3,13,13,14],
                    "texture": "#particle"
                },
                "south": {
                    "uv": [3,13,13,14],
                    "texture": "#particle"
                }
            }
        }
    ]
}