{
  "parent": "minecraft:recipes/root",
  "rewards": {
    "recipes": [
      "techreborn:grinder/sand_from_cut_sandstone"
    ]
  },
  "criteria": {
    "has_cut_sandstone": {
      "trigger": "minecraft:inventory_changed",
      "conditions": {
        "items": [
          {
            "items": [
              "minecraft:cut_sandstone"
            ]
          }
        ]
      }
    },
    "has_the_recipe": {
      "trigger": "minecraft:recipe_unlocked",
      "conditions": {
        "recipe": "techreborn:grinder/sand_from_cut_sandstone"
      }
    }
  },
  "requirements": [
    [
      "has_cut_sandstone",
      "has_the_recipe"
    ]
  ]
}