{
    "variants": {
        "": [
		{ "model": "block/flowering_azalea_leaves", "weight": 101 },
		{ "model": "block/flowering_azalea_leaves", "weight":   25, "x": 90, "y": 90, "z": 90  },
		{ "model": "block/flowering_azalea_leaves", "weight":   25, "x":180, "y":180, "z":180  },
		{ "model": "block/flowering_azalea_leaves", "weight":   25, "x":270, "y":270, "z":270  }
		]
    }
}
