{
  "parent": "minecraft:block/slab_top",
  "textures": {
    "bottom": "block/custom/planks/mangrove_a",
    "top": "block/custom/planks/mangrove_a",
    "side": "block/custom/planks/mangrove_a"
  }
}