{
  "replace": false,
  "values": [
    "techreborn:advanced_alloy_storage_block",
    "techreborn:aluminum_storage_block",
    "techreborn:brass_storage_block",
    "techreborn:bronze_storage_block",
    "techreborn:chrome_storage_block",
    "techreborn:electrum_storage_block",
    "techreborn:hot_tungstensteel_storage_block",
    "techreborn:invar_storage_block",
    "techreborn:iridium_storage_block",
    "techreborn:iridium_reinforced_stone_storage_block",
    "techreborn:iridium_reinforced_tungstensteel_storage_block",
    "techreborn:lead_storage_block",
    "techreborn:nickel_storage_block",
    "techreborn:peridot_storage_block",
    "techreborn:platinum_storage_block",
    "techreborn:raw_iridium_storage_block",
    "techreborn:raw_lead_storage_block",
    "techreborn:raw_silver_storage_block",
    "techreborn:raw_tin_storage_block",
    "techreborn:raw_tungsten_storage_block",
    "techreborn:red_garnet_storage_block",
    "techreborn:refined_iron_storage_block",
    "techreborn:ruby_storage_block",
    "techreborn:sapphire_storage_block",
    "techreborn:silver_storage_block",
    "techreborn:steel_storage_block",
    "techreborn:tin_storage_block",
    "techreborn:titanium_storage_block",
    "techreborn:tungsten_storage_block",
    "techreborn:tungstensteel_storage_block",
    "techreborn:yellow_garnet_storage_block",
    "techreborn:zinc_storage_block"
  ]
}