{
	"parent": "mcwbridges:block/bridge/bridge_wood/parent/base_torch",
	"textures": {
		"1": "minecraft:block/jungle_log",
		"3": "minecraft:block/torch",
		"particle": "minecraft:block/jungle_planks"
	}
}
