{
  "parent": "minecraft:recipes/root",
  "rewards": {
    "recipes": [
      "techreborn:crafting_table/ingot/iridium_ingot_from_nugget"
    ]
  },
  "criteria": {
    "has_iridium_nugget": {
      "trigger": "minecraft:inventory_changed",
      "conditions": {
        "items": [
          {
            "items": [
              "techreborn:iridium_nugget"
            ]
          }
        ]
      }
    },
    "has_the_recipe": {
      "trigger": "minecraft:recipe_unlocked",
      "conditions": {
        "recipe": "techreborn:crafting_table/ingot/iridium_ingot_from_nugget"
      }
    }
  },
  "requirements": [
    [
      "has_iridium_nugget",
      "has_the_recipe"
    ]
  ]
}