{
    "__createdwith": "opl's Model Creator",
    "ambientocclusion": false,
    "textures": {
        "particle": "block/pointed_dripstone_down_base"
    },
    "elements": [
        {
            "from": [3,0,3],
            "to": [12,3,12],
            "faces": {
                "up": {
                    "texture": "#particle"
                },
                "down": {
                    "texture": "#particle"
                },
                "west": {
                    "uv": [2,8,11,11.1],
                    "texture": "#particle"
                },
                "east": {
                    "uv": [4,12,13,15.1],
                    "texture": "#particle"
                },
                "north": {
                    "uv": [3,12,12,15.1],
                    "texture": "#particle"
                },
                "south": {
                    "uv": [4,9,13,12.1],
                    "texture": "#particle"
                }
            }
        },
        {
            "from": [3.9,3,3.8999999],
            "to": [11.1,11,11.1],
            "faces": {
                "up": {
                    "texture": "#particle"
                },
                "west": {
                    "uv": [4,5,11,13],
                    "texture": "#particle"
                },
                "east": {
                    "uv": [4,5,11,13],
                    "texture": "#particle"
                },
                "north": {
                    "uv": [4,5,11,13],
                    "texture": "#particle"
                },
                "south": {
                    "uv": [4,5,11,13],
                    "texture": "#particle"
                }
            }
        },
        {
            "from": [5,11,5],
            "to": [10,16,10],
            "faces": {
                "up": {
                    "texture": "#particle"
                },
                "west": {
                    "uv": [5,0,10,5],
                    "texture": "#particle"
                },
                "east": {
                    "uv": [5,0,10,5],
                    "texture": "#particle"
                },
                "north": {
                    "uv": [5,0,10,5],
                    "texture": "#particle"
                },
                "south": {
                    "uv": [5,0,10,5],
                    "texture": "#particle"
                }
            }
        }
    ]
}