{
    "__createdwith": "opl's Model Creator",
    "ambientocclusion": false,
    "textures": {
        "particle": "block/spruce_trapdoor"
    },
    "elements": [
        {
            "from": [0,0,0],
            "to": [16,1,16],
            "faces": {
                "up": {
                    "texture": "#particle"
                },
                "down": {
                    "uv": [16.0,0.0,0.0,16.0],
                    "texture": "#particle",
                    "rotation": 180
                },
                "west": {
                    "uv": [0.0,13.0,16.0,14.0],
                    "texture": "#particle"
                },
                "east": {
                    "uv": [0.0,13.0,16.0,14.0],
                    "texture": "#particle"
                },
                "north": {
                    "uv": [16.0,14.0,0.0,15.0],
                    "texture": "#particle"
                },
                "south": {
                    "uv": [0.0,15.0,16.0,16.0],
                    "texture": "#particle"
                }
            }
        },
        {
            "from": [0.01,-1,2],
            "to": [15.99,2,5],
            "faces": {
                "up": {
                    "texture": "#particle"
                },
                "down": {
                    "texture": "#particle",
                    "rotation": 180
                },
                "west": {
                    "uv": [8.0,3.0,11.0,6.0],
                    "texture": "#particle"
                },
                "east": {
                    "uv": [8.0,3.0,11.0,6.0],
                    "texture": "#particle"
                },
                "north": {
                    "uv": [0.0,2.0,16.0,3.0],
                    "texture": "#particle"
                },
                "south": {
                    "uv": [0.0,13.0,16.0,14.0],
                    "texture": "#particle"
                }
            }
        },
        {
            "from": [0.01,-1,11],
            "to": [15.99,2,14],
            "faces": {
                "up": {
                    "texture": "#particle"
                },
                "down": {
                    "texture": "#particle",
                    "rotation": 180
                },
                "west": {
                    "uv": [8.0,3.0,11.0,6.0],
                    "texture": "#particle"
                },
                "east": {
                    "uv": [8.0,3.0,11.0,6.0],
                    "texture": "#particle"
                },
                "north": {
                    "uv": [0.0,2.0,16.0,3.0],
                    "texture": "#particle"
                },
                "south": {
                    "uv": [0.0,4.0,16.0,5.0],
                    "texture": "#particle"
                }
            }
        }
    ]
}