{
  "parent": "minecraft:block/orientable",
  "textures": {
    "side": "farmersdelight:block/dark_oak_pantry_side",
    "front": "farmersdelight:block/dark_oak_pantry_front",
    "top": "farmersdelight:block/dark_oak_pantry_top"
  }
}