{
  "parent": "minecraft:block/slab_top",
  "textures": {
    "bottom": "block/custom/planks/dark_oak_b",
    "top": "block/custom/planks/dark_oak_b",
    "side": "block/custom/planks/dark_oak_b"
  }
}