{
  "parent": "minecraft:block/stairs",
  "textures": {
    "bottom": "block/custom/mossystonebricks/c",
    "top": "block/custom/mossystonebricks/c",
    "side": "block/custom/mossystonebricks/c"
  }
}