{
    "parent": "block/template_glass_pane_side_alt",
    "textures": {
        "edge": "block/light_gray_stained_glass_pane_top",
        "pane": "block/custom/glasspane/glasspane_light_gray"
    }
}
