{
    "variants": {
        "": [
			{ "model": "block/deepslate_redstone_ore", "weight": 101 },
			{ "model": "block/deepslateore/redstone_a", "weight": 100 },
			{ "model": "block/deepslateore/redstone_b", "weight": 100 },
			{ "model": "block/deepslateore/redstone_c", "weight": 100 }
		]
    }
}
