{
  "parent": "minecraft:recipes/root",
  "rewards": {
    "recipes": [
      "techreborn:extractor/white_dye_from_bone_meal"
    ]
  },
  "criteria": {
    "has_bone_meal": {
      "trigger": "minecraft:inventory_changed",
      "conditions": {
        "items": [
          {
            "items": [
              "minecraft:bone_meal"
            ]
          }
        ]
      }
    },
    "has_the_recipe": {
      "trigger": "minecraft:recipe_unlocked",
      "conditions": {
        "recipe": "techreborn:extractor/white_dye_from_bone_meal"
      }
    }
  },
  "requirements": [
    [
      "has_bone_meal",
      "has_the_recipe"
    ]
  ]
}