{
  "parent": "minecraft:recipes/root",
  "rewards": {
    "recipes": [
      "techreborn:grinder/green_concrete_powder_from_concrete"
    ]
  },
  "criteria": {
    "has_green_concrete": {
      "trigger": "minecraft:inventory_changed",
      "conditions": {
        "items": [
          {
            "items": [
              "minecraft:green_concrete"
            ]
          }
        ]
      }
    },
    "has_the_recipe": {
      "trigger": "minecraft:recipe_unlocked",
      "conditions": {
        "recipe": "techreborn:grinder/green_concrete_powder_from_concrete"
      }
    }
  },
  "requirements": [
    [
      "has_green_concrete",
      "has_the_recipe"
    ]
  ]
}