{
	"credit": "Made with Blockbench",
	"elements": [
		{
			"from": [1, 4, 7],
			"to": [1, 13, 9],
			"rotation": {"angle": 0, "axis": "y", "origin": [-24, -5, 8]},
			"faces": {
				"east": {"uv": [1, 2, 3, 11], "texture": "#0"},
				"west": {"uv": [0, 0, 2, 9], "texture": "#0"}
			}
		},
		{
			"from": [0, 8, 12],
			"to": [2, 13, 14],
			"rotation": {"angle": 0, "axis": "y", "origin": [7, -5, 8]},
			"faces": {
				"north": {"uv": [0, 0, 2, 5], "texture": "#0"},
				"east": {"uv": [0, 0, 2, 5], "texture": "#0"},
				"south": {"uv": [0, 0, 2, 5], "texture": "#0"},
				"west": {"uv": [1, 2, 3, 7], "texture": "#0"},
				"up": {"uv": [0, 0, 2, 2], "rotation": 270, "texture": "#0"},
				"down": {"uv": [0, 0, 2, 2], "rotation": 90, "texture": "#0"}
			}
		},
		{
			"from": [0, 4, 13],
			"to": [2, 8, 15],
			"rotation": {"angle": 0, "axis": "y", "origin": [7, -5, 8]},
			"faces": {
				"north": {"uv": [0, 0, 2, 4], "texture": "#0"},
				"east": {"uv": [0, 0, 2, 4], "texture": "#0"},
				"south": {"uv": [0, 0, 2, 4], "texture": "#0"},
				"west": {"uv": [1, 2, 3, 6], "texture": "#0"},
				"up": {"uv": [0, 0, 2, 2], "rotation": 270, "texture": "#0"},
				"down": {"uv": [0, 0, 2, 2], "rotation": 90, "texture": "#0"}
			}
		},
		{
			"from": [0, 13, 0],
			"to": [2, 15, 13],
			"rotation": {"angle": 0, "axis": "y", "origin": [7, -5, 8]},
			"faces": {
				"north": {"uv": [0, 0, 2, 2], "texture": "#0"},
				"east": {"uv": [0, 10, 13, 12], "texture": "#0"},
				"south": {"uv": [0, 0, 2, 2], "texture": "#0"},
				"west": {"uv": [0, 4, 13, 6], "texture": "#0"},
				"up": {"uv": [0, 0, 13, 2], "rotation": 270, "texture": "#0"},
				"down": {"uv": [0, 0, 13, 2], "rotation": 90, "texture": "#0"}
			}
		},
		{
			"from": [0, 3, 0],
			"to": [2, 4, 16],
			"faces": {
				"north": {"uv": [0, 0, 2, 1], "texture": "#0"},
				"east": {"uv": [0, 0, 16, 1], "texture": "#0"},
				"south": {"uv": [0, 0, 2, 1], "texture": "#0"},
				"west": {"uv": [0, 0, 16, 1], "texture": "#0"},
				"up": {"uv": [0, 0, 2, 16], "texture": "#0"}
			}
		}
	],
	"display": {
		"thirdperson_righthand": {
			"rotation": [57, 91, 0],
			"translation": [0, 1.25, 0.5],
			"scale": [0.15, 0.15, 0.15]
		},
		"thirdperson_lefthand": {
			"rotation": [64, 91, 0],
			"translation": [0, 1.25, 1],
			"scale": [0.15, 0.15, 0.15]
		},
		"firstperson_righthand": {
			"rotation": [-6, 80, -6],
			"translation": [1.75, 1.5, 0.5],
			"scale": [0.15, 0.15, 0.15]
		},
		"firstperson_lefthand": {
			"rotation": [-1, 78, 0],
			"translation": [2, 1, 0],
			"scale": [0.15, 0.15, 0.15]
		},
		"ground": {
			"translation": [0, -0.5, 0],
			"scale": [0.2, 0.2, 0.2]
		},
		"gui": {
			"rotation": [21, -39, 0],
			"translation": [0, 0.25, 0],
			"scale": [0.36, 0.36, 0.36]
		},
		"head": {
			"rotation": [-1, 0, 0],
			"translation": [0, 10.5, 0],
			"scale": [0.5, 0.5, 0.5]
		},
		"fixed": {
			"rotation": [1, 93, 0],
			"translation": [0.25, -0.25, -0.25],
			"scale": [0.66, 0.65, 0.43]
		}
	},
	"groups": [
		{
			"name": "middle_end",
			"origin": [8, 8, 8],
			"color": 0,
			"children": [
				{
					"name": "log_bridge_middle",
					"origin": [8, 8, 8],
					"color": 0,
					"children": [0]
				},
				{
					"name": "log_bridge_end",
					"origin": [8, 8, 8],
					"color": 0,
					"children": [1, 2, 3]
				}
			]
		}, 4]
}