{
    "__createdwith": "opl's Model Creator",
    "ambientocclusion": false,
    "textures": {
        "particle": "block/oak_trapdoor"
    },
    "elements": [
        {
            "from": [0,12,13],
            "to": [16,16,16],
            "faces": {
                "up": {
                    "uv": [0,12,16,15],
                    "texture": "#particle"
                },
                "down": {
                    "uv": [0,12,16,15],
                    "texture": "#particle"
                },
                "west": {
                    "uv": [12,0,15,4],
                    "texture": "#particle"
                },
                "east": {
                    "uv": [12,0,15,4],
                    "texture": "#particle"
                },
                "north": {
                    "texture": "#particle"
                },
                "south": {
                    "texture": "#particle"
                }
            }
        },
        {
            "from": [0,0,13],
            "to": [16,4,16],
            "faces": {
                "up": {
                    "uv": [0,12,16,15],
                    "texture": "#particle"
                },
                "down": {
                    "uv": [0,12,16,15],
                    "texture": "#particle"
                },
                "west": {
                    "uv": [12,12,15,16],
                    "texture": "#particle"
                },
                "east": {
                    "uv": [12,12,15,16],
                    "texture": "#particle"
                },
                "north": {
                    "texture": "#particle"
                },
                "south": {
                    "texture": "#particle"
                }
            }
        },
        {
            "from": [0,4,13],
            "to": [4,12,16],
            "faces": {
                "west": {
                    "uv": [12,4,15,12],
                    "texture": "#particle"
                },
                "east": {
                    "texture": "#particle"
                },
                "north": {
                    "texture": "#particle"
                },
                "south": {
                    "texture": "#particle"
                }
            }
        },
        {
            "from": [12,4,13],
            "to": [16,12,16],
            "faces": {
                "west": {
                    "uv": [12,4,16,12],
                    "texture": "#particle"
                },
                "east": {
                    "uv": [12,4,15,12],
                    "texture": "#particle"
                },
                "north": {
                    "texture": "#particle"
                },
                "south": {
                    "texture": "#particle"
                }
            }
        },
        {
            "from": [7,4,14],
            "to": [9,12,15],
            "faces": {
                "west": {
                    "texture": "#particle"
                },
                "east": {
                    "texture": "#particle"
                },
                "north": {
                    "texture": "#particle"
                },
                "south": {
                    "texture": "#particle"
                }
            }
        },
        {
            "from": [4,7,14],
            "to": [12,9,15],
            "faces": {
                "up": {
                    "texture": "#particle"
                },
                "down": {
                    "texture": "#particle"
                },
                "north": {
                    "texture": "#particle"
                },
                "south": {
                    "texture": "#particle"
                }
            }
        }
    ]
}