{
    "variants": {
        "": [
			{ "model": "block/emerald_ore", "weight": 101 },
			{ "model": "block/ore/emerald_a", "weight": 100 },
			{ "model": "block/ore/emerald_b", "weight": 100 },
			{ "model": "block/ore/emerald_c", "weight": 100 }
		]
    }
}
