{
	"credit": "Made with Blockbench",
	"elements": [
		{
			"from": [0, 0, 9.5],
			"to": [16, 2, 14.5],
			"faces": {
				"north": {"uv": [0, 0, 16, 2], "texture": "#2"},
				"east": {"uv": [0, 0, 5, 2], "texture": "#2"},
				"south": {"uv": [0, 0, 16, 2], "texture": "#2"},
				"west": {"uv": [0, 0, 5, 2], "texture": "#2"},
				"up": {"uv": [0, 0, 16, 5], "texture": "#2"},
				"down": {"uv": [0, 0, 16, 5], "texture": "#2"}
			}
		},
		{
			"from": [14.5, 2, 9.5],
			"to": [14.5, 15, 14.5],
			"faces": {
				"east": {"uv": [1, 0, 6, 13], "texture": "#0"},
				"west": {"uv": [1, 0, 6, 13], "texture": "#0"}
			}
		},
		{
			"from": [1.5, 2, 1.5],
			"to": [1.5, 15, 6.5],
			"faces": {
				"east": {"uv": [1, 0, 6, 13], "texture": "#0"},
				"west": {"uv": [1, 0, 6, 13], "texture": "#0"}
			}
		},
		{
			"from": [14, 15, 0],
			"to": [15, 16, 16],
			"faces": {
				"north": {"uv": [0, 0, 1, 1], "texture": "#1_4"},
				"east": {"uv": [0, 0, 16, 1], "texture": "#1_4"},
				"south": {"uv": [0, 0, 1, 1], "texture": "#1_4"},
				"west": {"uv": [0, 0, 16, 1], "texture": "#1_4"},
				"up": {"uv": [0, 0, 16, 1], "rotation": 90, "texture": "#1_4"},
				"down": {"uv": [0, 0, 16, 1], "rotation": 90, "texture": "#1_4"}
			}
		},
		{
			"from": [1, 0.5, 0],
			"to": [2, 1.5, 16],
			"faces": {
				"north": {"uv": [0, 0, 1, 1], "texture": "#4"},
				"east": {"uv": [0, 0, 16, 1], "texture": "#4"},
				"south": {"uv": [0, 0, 1, 1], "texture": "#4"},
				"west": {"uv": [0, 0, 16, 1], "texture": "#4"},
				"up": {"uv": [0, 0, 1, 16], "texture": "#4"},
				"down": {"uv": [0, 0, 1, 16], "texture": "#4"}
			}
		},
		{
			"from": [14, 0.5, 0],
			"to": [15, 1.5, 16],
			"faces": {
				"north": {"uv": [0, 0, 1, 1], "texture": "#4"},
				"east": {"uv": [0, 0, 16, 1], "texture": "#4"},
				"south": {"uv": [0, 0, 1, 1], "texture": "#4"},
				"west": {"uv": [0, 0, 16, 1], "texture": "#4"},
				"up": {"uv": [0, 0, 1, 16], "texture": "#4"},
				"down": {"uv": [0, 0, 1, 16], "texture": "#4"}
			}
		},
		{
			"from": [14.5, 2, 1.5],
			"to": [14.5, 15, 6.5],
			"faces": {
				"east": {"uv": [1, 0, 6, 13], "texture": "#0"},
				"west": {"uv": [1, 0, 6, 13], "texture": "#0"}
			}
		},
		{
			"from": [1, 15, 0],
			"to": [2, 16, 16],
			"faces": {
				"north": {"uv": [0, 0, 1, 1], "texture": "#1_4"},
				"east": {"uv": [0, 0, 16, 1], "texture": "#1_4"},
				"south": {"uv": [0, 0, 1, 1], "texture": "#1_4"},
				"west": {"uv": [0, 0, 16, 1], "texture": "#1_4"},
				"up": {"uv": [0, 0, 16, 1], "rotation": 90, "texture": "#1_4"},
				"down": {"uv": [0, 0, 16, 1], "rotation": 90, "texture": "#1_4"}
			}
		},
		{
			"from": [1.5, 2, 9.5],
			"to": [1.5, 15, 14.5],
			"faces": {
				"east": {"uv": [1, 0, 6, 13], "texture": "#0"},
				"west": {"uv": [1, 0, 6, 13], "texture": "#0"}
			}
		},
		{
			"from": [0, 0, 1.5],
			"to": [16, 2, 6.5],
			"faces": {
				"north": {"uv": [0, 0, 16, 2], "texture": "#2"},
				"east": {"uv": [0, 0, 5, 2], "texture": "#2"},
				"south": {"uv": [0, 0, 16, 2], "texture": "#2"},
				"west": {"uv": [0, 0, 5, 2], "texture": "#2"},
				"up": {"uv": [0, 2, 16, 7], "texture": "#2"},
				"down": {"uv": [0, 0, 16, 5], "texture": "#2"}
			}
		}
	],
	"display": {
		"thirdperson_righthand": {
			"rotation": [73, 8, 0],
			"translation": [-0.25, 0, 2.75],
			"scale": [0.4, 0.4, 0.4]
		},
		"thirdperson_lefthand": {
			"rotation": [73, 14, 0],
			"translation": [0, 0, 2.25],
			"scale": [0.4, 0.4, 0.4]
		},
		"firstperson_righthand": {
			"rotation": [0, 42, 0],
			"translation": [0, 0.75, 0],
			"scale": [0.4, 0.4, 0.4]
		},
		"firstperson_lefthand": {
			"rotation": [0, 23, 0],
			"translation": [0, 1.25, 0],
			"scale": [0.4, 0.4, 0.4]
		},
		"ground": {
			"scale": [0.31, 0.31, 0.31]
		},
		"gui": {
			"rotation": [25, 45, 0],
			"scale": [0.6, 0.6, 0.6]
		},
		"fixed": {
			"rotation": [0, 90, 0],
			"translation": [0, 0, 4.75]
		}
	}
}