{
  "block.cooking_pot.boil": {
    "category": "block",
    "subtitle": "farmersdelight.subtitles.cooking_pot.boil",
    "sounds": [
      {
        "name": "farmersdelight:block/cooking_pot_boil1",
        "stream": true
      },
      {
        "name": "farmersdelight:block/cooking_pot_boil2",
        "stream": true
      }
    ]
  },
  "block.cutting_board.knife": {
    "category": "block",
    "subtitle": "farmersdelight.subtitles.cutting_board.knife_cut",
    "sounds": [
      {
        "name": "farmersdelight:block/cutting_board_knife1",
        "stream": true
      },
      {
        "name": "farmersdelight:block/cutting_board_knife2",
        "stream": true
      }
    ]
  },
  "block.stove.crackle": {
    "category": "block",
    "subtitle": "farmersdelight.subtitles.stove.crackle",
    "sounds": [
      {
        "name": "block/campfire/crackle1",
        "stream": true
      },
      {
        "name": "block/campfire/crackle2",
        "stream": true
      },
      {
        "name": "block/campfire/crackle3",
        "stream": true
      },
      {
        "name": "block/campfire/crackle4",
        "stream": true
      },
      {
        "name": "block/campfire/crackle5",
        "stream": true
      },
      {
        "name": "block/campfire/crackle6",
        "stream": true
      }
    ]
  },
  "item.tomato.pick_from_bush": {
    "category": "block",
    "subtitle": "farmersdelight.subtitles.tomato.pick",
    "sounds": [
      {
        "name": "item/sweet_berries/pick_from_bush1",
        "stream": true
      },
      {
        "name": "item/sweet_berries/pick_from_bush2",
        "stream": true
      }
    ]
  }
}