{
  "type": "techreborn:extractor",
  "power": 10,
  "time": 150,
  "ingredients": [
    {
      "item": "minecraft:water_bucket",
      "count": 1
    }
  ],
  "results": [
    {
      "item": "minecraft:bucket"
    }
  ]
}