{
  "parent": "minecraft:recipes/root",
  "rewards": {
    "recipes": [
      "techreborn:industrial_grinder/diamond_dust_from_leggings_with_mercury"
    ]
  },
  "criteria": {
    "has_diamond_leggings": {
      "trigger": "minecraft:inventory_changed",
      "conditions": {
        "items": [
          {
            "items": [
              "minecraft:diamond_leggings"
            ]
          }
        ]
      }
    },
    "has_the_recipe": {
      "trigger": "minecraft:recipe_unlocked",
      "conditions": {
        "recipe": "techreborn:industrial_grinder/diamond_dust_from_leggings_with_mercury"
      }
    }
  },
  "requirements": [
    [
      "has_diamond_leggings",
      "has_the_recipe"
    ]
  ]
}