{
    "variants": {
        "": [
		{ "model": "block/sandstone", "weight":101 },
		{ "model": "block/sandstone/a", "weight":101 },
		{ "model": "block/sandstone/b", "weight":101 },
		{ "model": "block/sandstone/c", "weight":101 }
		]
    }
}
