{
    "parent": "block/grass_block",
    "textures": {
		"particle": "block/dirt",
		"bottom": "block/dirt",
		"top": "block/custom/grassblock/normal_b",
		"side": "block/grass_block_side",
		"overlay": "block/grass_block_side_overlay"
    }
}
