{
  "parent": "minecraft:recipes/root",
  "rewards": {
    "recipes": [
      "techreborn:industrial_grinder/sapphire_dust_from_hoe_with_mercury"
    ]
  },
  "criteria": {
    "has_sapphire_hoe": {
      "trigger": "minecraft:inventory_changed",
      "conditions": {
        "items": [
          {
            "items": [
              "techreborn:sapphire_hoe"
            ]
          }
        ]
      }
    },
    "has_the_recipe": {
      "trigger": "minecraft:recipe_unlocked",
      "conditions": {
        "recipe": "techreborn:industrial_grinder/sapphire_dust_from_hoe_with_mercury"
      }
    }
  },
  "requirements": [
    [
      "has_sapphire_hoe",
      "has_the_recipe"
    ]
  ]
}