{
  "type": "techreborn:industrial_grinder",
  "power": 128,
  "time": 140,
  "ingredients": [
    {
      "item": "techreborn:peridot_sword",
      "count": 1
    }
  ],
  "results": [
    {
      "item": "techreborn:peridot_dust"
    },
    {
      "item": "techreborn:peridot_small_dust"
    },
    {
      "item": "techreborn:saw_small_dust"
    }
  ],
  "tank": {
    "fluid": "techreborn:mercury",
    "amount": {
      "droplets": 40500
    }
  }
}