{
	"parent": "mcwbridges:block/stair/rope/parent/double",
	"textures": {
		"0": "mcwbridges:block/lead_knot_vert",
		"2": "minecraft:block/spruce_planks",
		"3": "mcwbridges:block/lead_knot",
		"4": "minecraft:block/spruce_log",
		"particle": "minecraft:block/spruce_log"
	}
}
