{
    "parent": "block/ladder",
    "display": {
        "gui": {
            "rotation": [ 30, 225, 0 ],
            "translation": [ 4, -2.5, 0],
            "scale":[ 0.75, 0.75, 0.75 ]
        },
        "ground": {
            "rotation": [ 0, 0, 0 ],
            "translation": [ 0, 3, -2.5],
            "scale":[ 0.35, 0.35, 0.35 ]
        },
        "fixed": {
            "rotation": [ 0, 0, 0 ],
            "translation": [ 0, 0, -5],
            "scale":[ 0.75, 0.75, 0.75 ]
        },
        "thirdperson_righthand": {
            "rotation": [ 45, 180, 0 ],
            "translation": [ 0, -2, 3.5],
            "scale": [ 0.5, 0.5, 0.5 ]
        },
        "firstperson_righthand": {
            "rotation": [ 0, 120, 0 ],
            "translation": [ -4, 3, 5 ],
            "scale": [ 0.4, 0.4, 0.4 ]
        },
        "firstperson_lefthand": {
            "rotation": [ 0, 120, 0 ],
            "translation": [ -4, 3, 5 ],
            "scale": [ 0.4, 0.4, 0.4 ]
        }
    }
}

