{
  "parent": "minecraft:recipes/root",
  "rewards": {
    "recipes": [
      "techreborn:crafting_table/dust/manganese_dust_from_small"
    ]
  },
  "criteria": {
    "has_manganese_small_dust": {
      "trigger": "minecraft:inventory_changed",
      "conditions": {
        "items": [
          {
            "items": [
              "techreborn:manganese_small_dust"
            ]
          }
        ]
      }
    },
    "has_the_recipe": {
      "trigger": "minecraft:recipe_unlocked",
      "conditions": {
        "recipe": "techreborn:crafting_table/dust/manganese_dust_from_small"
      }
    }
  },
  "requirements": [
    [
      "has_manganese_small_dust",
      "has_the_recipe"
    ]
  ]
}