{
  "type": "minecraft:crafting_shaped",
  "pattern": [
    "X",
    "#",
    "#"
  ],
  "key": {
    "X": {
      "tag": "c:bronze_ingots"
    },
    "#": {
      "item": "minecraft:stick"
    }
  },
  "result": {
    "item": "techreborn:bronze_spade"
  }
}