{
  "parent": "minecraft:recipes/root",
  "rewards": {
    "recipes": [
      "techreborn:crafting_table/gem/ruby_gem_from_block"
    ]
  },
  "criteria": {
    "has_ruby_storage_block": {
      "trigger": "minecraft:inventory_changed",
      "conditions": {
        "items": [
          {
            "items": [
              "techreborn:ruby_storage_block"
            ]
          }
        ]
      }
    },
    "has_the_recipe": {
      "trigger": "minecraft:recipe_unlocked",
      "conditions": {
        "recipe": "techreborn:crafting_table/gem/ruby_gem_from_block"
      }
    }
  },
  "requirements": [
    [
      "has_ruby_storage_block",
      "has_the_recipe"
    ]
  ]
}