{
  "multipart": [
    {
      "apply": { "model": "farmersdelight:block/rope_post" }
    },
    {
      "when": { "tied_to_bell": true },
      "apply": { "model": "farmersdelight:block/rope_bell_tie" }
    },
    {
      "when": { "north": true },
      "apply": { "model": "farmersdelight:block/rope_side" }
    },
    {
      "when": { "east": true },
      "apply": { "model": "farmersdelight:block/rope_side", "y": 90 }
    },
    {
      "when": { "south": true },
      "apply": { "model": "farmersdelight:block/rope_side_alt" }
    },
    {
      "when": { "west": true },
      "apply": { "model": "farmersdelight:block/rope_side_alt", "y": 90 }
    }
  ]
}
