{
	"credit": "Made with Blockbench",

	"textures": {
		"2": "mcwbridges:block/bridge_1",
		"particle": "mcwbridges:block/bridge_2"
	},
	"elements": [
		{
			"from": [15.1, 0.6686, 8.57743],
			"to": [15.9, 16.0686, 10.57743],
			"rotation": {"angle": -22.5, "axis": "x", "origin": [7.8, 8.2486, 9.47743]},
			"faces": {
				"north": {"uv": [0, 0, 0.8, 15.4], "texture": "#2"},
				"east": {"uv": [0, 0, 2, 15.4], "texture": "#2"},
				"south": {"uv": [0, 0, 0.8, 15.4], "texture": "#2"},
				"west": {"uv": [0, 0, 2, 15.4], "texture": "#2"},
				"up": {"uv": [0, 0, 0.8, 2], "texture": "#2"}
			}
		},
		{
			"from": [15, 13.9, 0],
			"to": [16, 15.9, 7.5],
			"rotation": {"angle": 0, "axis": "y", "origin": [7.9, 6.22049, 8.24841]},
			"faces": {
				"north": {"uv": [0, 0, 1, 2], "texture": "#2"},
				"east": {"uv": [0, 0, 7.5, 2], "texture": "#2"},
				"south": {"uv": [0, 0, 1, 2], "texture": "#2"},
				"west": {"uv": [0, 0, 7.5, 2], "texture": "#2"},
				"up": {"uv": [0, 0, 1, 7.5], "texture": "#2"},
				"down": {"uv": [0, 0, 1, 7.5], "texture": "#2"}
			}
		},
		{
			"from": [15.1, 2.52389, 3.61658],
			"to": [15.9, 16.52389, 5.61658],
			"rotation": {"angle": -22.5, "axis": "x", "origin": [7.9, 6.22049, 8.24841]},
			"faces": {
				"north": {"uv": [0, 0, 0.8, 14], "texture": "#2"},
				"east": {"uv": [0, 0, 2, 14], "texture": "#2"},
				"south": {"uv": [0, 0, 0.8, 14], "texture": "#2"},
				"west": {"uv": [0, 0, 2, 14], "texture": "#2"}
			}
		},
		{
			"from": [15, 0, 4],
			"to": [16, 2, 16],
			"rotation": {"angle": 0, "axis": "y", "origin": [7.9, 6.22049, 8.24841]},
			"faces": {
				"north": {"uv": [0, 0, 1, 2], "texture": "#2"},
				"east": {"uv": [0, 0, 11.9, 2], "texture": "#2"},
				"south": {"uv": [0, 0, 1, 2], "texture": "#2"},
				"west": {"uv": [0, 0, 11.9, 2], "texture": "#2"},
				"up": {"uv": [0, 0, 1, 11.9], "texture": "#2"},
				"down": {"uv": [0, 0, 1, 11.9], "texture": "#2"}
			}
		},
		{
			"from": [0, 8, 0],
			"to": [15, 9, 8],
			"rotation": {"angle": 0, "axis": "y", "origin": [8, 8.5, 4]},
			"faces": {
				"north": {"uv": [0, 0, 15, 1], "texture": "#particle"},
				"east": {"uv": [0, 0, 8, 1], "texture": "#particle"},
				"south": {"uv": [0, 0, 15, 1], "texture": "#particle"},
				"up": {"uv": [0, 0, 15, 8], "texture": "#particle"},
				"down": {"uv": [0, 0, 15, 8], "texture": "#particle"}
			}
		},
		{
			"from": [0, 0, 7.8],
			"to": [15, 1, 16],
			"rotation": {"angle": 0, "axis": "y", "origin": [8, 0.5, 12]},
			"faces": {
				"north": {"uv": [0, 0, 15, 1], "texture": "#particle"},
				"south": {"uv": [0, 0, 15, 1], "texture": "#particle"},
				"up": {"uv": [0, 0, 15, 8.2], "texture": "#particle"},
				"down": {"uv": [0, 0, 15, 8.2], "texture": "#particle"}
			}
		}
	],
	"groups": [
		{
			"name": "group",
			"origin": [8, 8, 8],
			"color": 0,
			"children": [0, 1, 2, 3, 4, 5]
		}
	]
}