{
    "variants": {
        "": [
		{ "model": "block/moss_block", "weight": 101 },
		{ "model": "block/moss_block", "weight":   25, "x": 90, "y": 90, "z": 90  },
		{ "model": "block/moss_block", "weight":   25, "x":180, "y":180, "z":180  },
		{ "model": "block/moss_block", "weight":   25, "x":270, "y":270, "z":270  },
		
		{ "model": "block/mossblock/a", "weight": 100 },
		{ "model": "block/mossblock/a", "weight":   25, "x": 90, "y": 90, "z": 90  },
		{ "model": "block/mossblock/a", "weight":   25, "x":180, "y":180, "z":180  },
		{ "model": "block/mossblock/a", "weight":   25, "x":270, "y":270, "z":270  }
		]
    }
}
