{
  "parent": "minecraft:block/orientable",
  "textures": {
    "side": "farmersdelight:block/spruce_pantry_side",
    "front": "farmersdelight:block/spruce_pantry_front_open",
    "top": "farmersdelight:block/spruce_pantry_top"
  }
}