{
  "type": "minecraft:crafting_shaped",
  "pattern": [
    "XXX"
  ],
  "key": {
    "X": {
      "tag": "c:tungstensteel_blocks"
    }
  },
  "result": {
    "item": "techreborn:tungstensteel_storage_block_slab",
    "count": 6
  }
}