{
  "type": "techreborn:chemical_reactor",
  "power": 25,
  "time": 250,
  "ingredients": [
    {
      "item": "minecraft:red_dye",
      "count": 1
    },
    {
      "item": "minecraft:blue_candle",
      "count": 2
    }
  ],
  "results": [
    {
      "item": "minecraft:purple_candle",
      "count": 2
    }
  ]
}