{
	"parent": "mcwbridges:block/bridge/rail/parent/side",
	"textures": {
		"0": "minecraft:block/spruce_log",
		"2": "minecraft:block/spruce_planks",
		"3": "minecraft:block/spruce_log_top",
		"particle": "minecraft:block/spruce_planks"
	}
}
