{
  "parent": "minecraft:recipes/root",
  "rewards": {
    "recipes": [
      "techreborn:industrial_sawmill/crimson_slab_from_stairs"
    ]
  },
  "criteria": {
    "has_crimson_stairs": {
      "trigger": "minecraft:inventory_changed",
      "conditions": {
        "items": [
          {
            "items": [
              "minecraft:crimson_stairs"
            ]
          }
        ]
      }
    },
    "has_the_recipe": {
      "trigger": "minecraft:recipe_unlocked",
      "conditions": {
        "recipe": "techreborn:industrial_sawmill/crimson_slab_from_stairs"
      }
    }
  },
  "requirements": [
    [
      "has_crimson_stairs",
      "has_the_recipe"
    ]
  ]
}