{
    "variants": {
        "": [
		{ "model": "block/acacia_planks", "weight": 50 },
		{ "model": "block/planks/acacia_a", "weight": 100 },
		{ "model": "block/planks/acacia_b", "weight": 100 },
		{ "model": "block/planks/acacia_c", "weight": 100 },
		{ "model": "block/planks/acacia_d", "weight": 100 }
		]
    }
}
