{
    "__createdwith": "opl's Model Creator",
    "ambientocclusion": false,
    "textures": {
        "particle": "block/dark_oak_trapdoor"
    },
    "elements": [
        {
            "from": [0,13,0],
            "to": [3,16,16],
            "faces": {
                "up": {
                    "texture": "#particle"
                },
                "down": {
                    "uv": [0,16,3,0],
                    "texture": "#particle"
                },
                "west": {
                    "texture": "#particle"
                },
                "east": {
                    "uv": [13,4,14,5],
                    "texture": "#particle"
                },
                "north": {
                    "uv": [13,0,16,3],
                    "texture": "#particle"
                },
                "south": {
                    "uv": [0,13,3,16],
                    "texture": "#particle"
                }
            }
        },
        {
            "from": [13,13,0],
            "to": [16,16,16],
            "faces": {
                "up": {
                    "texture": "#particle"
                },
                "down": {
                    "uv": [13,16,16,0],
                    "texture": "#particle"
                },
                "west": {
                    "uv": [13,4,14,5],
                    "texture": "#particle"
                },
                "east": {
                    "uv": [0,0,16,3],
                    "texture": "#particle"
                },
                "north": {
                    "uv": [0,0,3,3],
                    "texture": "#particle"
                },
                "south": {
                    "uv": [13,13,16,16],
                    "texture": "#particle"
                }
            }
        },
        {
            "from": [3,13,0],
            "to": [13,16,3],
            "faces": {
                "up": {
                    "uv": [3,13,13,16],
                    "texture": "#particle"
                },
                "down": {
                    "uv": [3,16,13,13],
                    "texture": "#particle"
                },
                "north": {
                    "texture": "#particle"
                },
                "south": {
                    "uv": [3,2,13,3],
                    "texture": "#particle"
                }
            }
        },
        {
            "from": [3,13,13],
            "to": [13,16,16],
            "faces": {
                "up": {
                    "texture": "#particle"
                },
                "down": {
                    "uv": [3,16,13,13],
                    "texture": "#particle"
                },
                "north": {
                    "uv": [1,3,2,4],
                    "texture": "#particle"
                },
                "south": {
                    "uv": [3,0,13,3],
                    "texture": "#particle"
                }
            }
        },
        {
            "from": [3,14,3],
            "to": [13,15,13],
            "faces": {
                "up": {
                    "texture": "#particle"
                },
                "down": {
                    "uv": [3,13,13,3],
                    "texture": "#particle"
                }
            }
        }
    ]
}