{
    "variants": {
        "snowy=false": [
		{ "model": "block/podzol/normal", "weight":100 },
		{ "model": "block/podzol/normal", "weight":100, "y":90},
		{ "model": "block/podzol/normal", "weight":100, "y":180},
		{ "model": "block/podzol/normal", "weight":100, "y":270}
		],
        "snowy=true": { "model": "block/podzol/snow" }
    }
}
