{
  "parent": "minecraft:block/slab",
  "textures": {
    "bottom": "block/custom/cobbleddeepslate/d",
    "top": "block/custom/cobbleddeepslate/d",
    "side": "block/custom/cobbleddeepslate/d"
  }
}