{
    "__createdwith": "opl's Model Creator",
    "ambientocclusion": false,
    "textures": {
        "particle": "block/pointed_dripstone_down_base"
    },
    "elements": [
        {
            "from": [4,-16,4],
            "to": [11,0,11],
            "faces": {
                "up": {
                    "texture": "#particle"
                },
                "west": {
                    "uv": [4.0,0.0,11.0,16.0],
                    "texture": "#particle"
                },
                "east": {
                    "uv": [5.0,0.0,12.0,16.0],
                    "texture": "#particle"
                },
                "north": {
                    "uv": [4.0,0.0,11.0,16.0],
                    "texture": "#particle"
                },
                "south": {
                    "uv": [4.5,0.0,11.5,16.0],
                    "texture": "#particle"
                }
            }
        },
        {
            "from": [5,0,4.5],
            "to": [10,6,9.5],
            "faces": {
                "up": {
                    "texture": "#particle"
                },
                "west": {
                    "uv": [6.0,0.0,11.0,6.0],
                    "texture": "#particle"
                },
                "east": {
                    "uv": [7.0,0.0,12.0,6.0],
                    "texture": "#particle"
                },
                "north": {
                    "uv": [4.0,0.0,9.0,6.0],
                    "texture": "#particle"
                },
                "south": {
                    "uv": [5.0,0.0,10.0,6.0],
                    "texture": "#particle"
                }
            }
        },
        {
            "from": [6,6,5],
            "to": [9,10,8],
            "faces": {
                "up": {
                    "texture": "#particle"
                },
                "west": {
                    "uv": [6.0,0.0,9.0,4.0],
                    "texture": "#particle"
                },
                "east": {
                    "uv": [6.0,0.0,9.0,4.0],
                    "texture": "#particle"
                },
                "north": {
                    "uv": [6.0,0.0,9.0,4.0],
                    "texture": "#particle"
                },
                "south": {
                    "uv": [8.0,0.0,11.0,4.0],
                    "texture": "#particle"
                }
            }
        }
    ]
}