{
    "variants": {
        "axis=y": [
		{ "model": "block/birch_log", "weight": 10 },
		{ "model": "block/log/birch_a", "weight": 10 },
		{ "model": "block/log/birch_b", "weight": 10 },
		{ "model": "block/log/birch_c", "weight": 10 }
		],
        "axis=z": [
		{ "model": "block/birch_log", "weight": 10, "x": 90 },
		{ "model": "block/log/birch_a", "weight": 10, "x": 90 },
		{ "model": "block/log/birch_b", "weight": 10, "x": 90 },
		{ "model": "block/log/birch_c", "weight": 10, "x": 90 }
		],
        "axis=x": [
		{ "model": "block/birch_log", "weight": 10, "x": 90, "y": 90 },
		{ "model": "block/log/birch_a", "weight": 10, "x": 90, "y": 90 },
		{ "model": "block/log/birch_b", "weight": 10, "x": 90, "y": 90 },
		{ "model": "block/log/birch_c", "weight": 10, "x": 90, "y": 90 }
		]
    }
}
