{
  "replace": false,
  "values": [
    "techreborn:aluminum_nugget",
    "techreborn:brass_nugget",
    "techreborn:bronze_nugget",
    "techreborn:chrome_nugget",
    "techreborn:copper_nugget",
    "techreborn:diamond_nugget",
    "techreborn:electrum_nugget",
    "techreborn:emerald_nugget",
    "techreborn:hot_tungstensteel_nugget",
    "techreborn:invar_nugget",
    "techreborn:iridium_nugget",
    "techreborn:lead_nugget",
    "techreborn:netherite_nugget",
    "techreborn:nickel_nugget",
    "techreborn:platinum_nugget",
    "techreborn:refined_iron_nugget",
    "techreborn:silver_nugget",
    "techreborn:steel_nugget",
    "techreborn:tin_nugget",
    "techreborn:titanium_nugget",
    "techreborn:tungsten_nugget",
    "techreborn:tungstensteel_nugget",
    "techreborn:zinc_nugget"
  ]
}