{
	"parent": "mcwbridges:block/bridge/bridge_wood/parent/inventory",
	"textures": {
		"0": "minecraft:block/dark_oak_log",
		"2": "minecraft:block/dark_oak_planks",
		"particle": "minecraft:block/dark_oak_log"
	}
}
