{
  "type": "techreborn:compressor",
  "power": 10,
  "time": 300,
  "ingredients": [
    {
      "tag": "c:emerald_dusts"
    }
  ],
  "results": [
    {
      "item": "techreborn:emerald_plate"
    }
  ]
}