{
	"parent": "mcwbridges:block/bridge/rail/parent/inventory",
	"textures": {
		"0": "minecraft:block/dark_oak_log",
		"2": "minecraft:block/dark_oak_planks",
		"3": "minecraft:block/dark_oak_log_top",
		"particle": "minecraft:block/dark_oak_planks"
	}
}
