{
  "type": "techreborn:chemical_reactor",
  "power": 25,
  "time": 250,
  "ingredients": [
    {
      "item": "minecraft:orange_dye",
      "count": 1
    },
    {
      "item": "minecraft:black_stained_glass",
      "count": 12
    }
  ],
  "results": [
    {
      "item": "minecraft:brown_stained_glass",
      "count": 12
    }
  ]
}