{
  "type": "techreborn:grinder",
  "power": 2,
  "time": 220,
  "ingredients": [
    {
      "tag": "c:peridot_ores"
    }
  ],
  "results": [
    {
      "item": "techreborn:peridot_dust",
      "count": 2
    }
  ]
}