{
    "__createdwith": "opl's Model Creator",
    "ambientocclusion": false,
    "textures": {
        "particle": "block/spruce_trapdoor"
    },
    "elements": [
        {
            "from": [0,0,15],
            "to": [16,16,16],
            "faces": {
                "up": {
                    "uv": [0,14,16,15],
                    "texture": "#particle"
                },
                "down": {
                    "uv": [16,15,0,16],
                    "texture": "#particle",
                    "rotation": 180
                },
                "west": {
                    "uv": [0,13,16,14],
                    "texture": "#particle"
                },
                "east": {
                    "uv": [0,13,16,14],
                    "texture": "#particle"
                },
                "north": {
                    "uv": [16,0,0,16],
                    "texture": "#particle"
                },
                "south": {
                    "uv": [0,0,16,16],
                    "texture": "#particle"
                }
            }
        },
        {
            "from": [0.01,11,14],
            "to": [15.99,14,17],
            "faces": {
                "up": {
                    "uv": [0,2,16,3],
                    "texture": "#particle"
                },
                "down": {
                    "uv": [0,4,16,5],
                    "texture": "#particle",
                    "rotation": 180
                },
                "west": {
                    "uv": [6,8,9,5],
                    "texture": "#particle"
                },
                "east": {
                    "uv": [10,8,13,5],
                    "texture": "#particle"
                },
                "north": {
                    "uv": [0,2,16,5],
                    "texture": "#particle"
                },
                "south": {
                    "uv": [0,2,16,5],
                    "texture": "#particle"
                }
            }
        },
        {
            "from": [0.01,2,14],
            "to": [15.99,5,17],
            "faces": {
                "up": {
                    "uv": [0,2,16,3],
                    "texture": "#particle"
                },
                "down": {
                    "uv": [0,13,16,14],
                    "texture": "#particle",
                    "rotation": 180
                },
                "west": {
                    "uv": [6,8,9,5],
                    "texture": "#particle"
                },
                "east": {
                    "uv": [2,8,5,5],
                    "texture": "#particle"
                },
                "north": {
                    "uv": [0,11,16,14],
                    "texture": "#particle"
                },
                "south": {
                    "uv": [0,11,16,14],
                    "texture": "#particle"
                }
            }
        }
    ]
}