{
	"credit": "Made with Blockbench",
	"ambientocclusion": false,
	"elements": [
		{
			"from": [0, 0.1, 6.5],
			"to": [16, 3, 9.5],
			"rotation": {"angle": 0, "axis": "y", "origin": [8, 7, 8]},
			"faces": {
				"north": {"uv": [0, 8, 16, 10.9], "texture": "#2"},
				"south": {"uv": [0, 8, 16, 10.9], "texture": "#2"},
				"up": {"uv": [0, 0, 16, 3], "texture": "#2"},
				"down": {"uv": [0, 0, 16, 3], "rotation": 180, "texture": "#2"}
			}
		},
		{
			"from": [6.5, 0.2, 6.5],
			"to": [9.5, 12, 9.5],
			"rotation": {"angle": 0, "axis": "y", "origin": [8, 7, 8]},
			"faces": {
				"north": {"uv": [11.8, 3, 0, 0], "rotation": 90, "texture": "#2"},
				"east": {"uv": [0, 3, 11.8, 0], "rotation": 90, "texture": "#2"},
				"south": {"uv": [11.8, 3, 0, 0], "rotation": 90, "texture": "#2"},
				"west": {"uv": [0, 3, 11.8, 0], "rotation": 90, "texture": "#2"},
				"up": {"uv": [1, 0, 4, 3], "texture": "#2"},
				"down": {"uv": [0, 0, 3, 3], "rotation": 180, "texture": "#2"}
			}
		},
		{
			"from": [6.5, 0, 0],
			"to": [9.5, 3, 16],
			"rotation": {"angle": 0, "axis": "y", "origin": [8, 24, 8]},
			"faces": {
				"east": {"uv": [0, 8, 16, 11], "texture": "#2"},
				"west": {"uv": [0, 8, 16, 11], "texture": "#2"},
				"up": {"uv": [17, 3, 1, 0], "rotation": 90, "texture": "#2"},
				"down": {"uv": [16, 3, 0, 0], "rotation": 90, "texture": "#2"}
			}
		}
	],
	"display": {
		"thirdperson_righthand": {
			"rotation": [73, 8, 0],
			"translation": [-0.25, 0, 2.75],
			"scale": [0.4, 0.4, 0.4]
		},
		"thirdperson_lefthand": {
			"rotation": [73, 14, 0],
			"translation": [0, 0, 2.25],
			"scale": [0.4, 0.4, 0.4]
		},
		"firstperson_righthand": {
			"rotation": [0, 42, 0],
			"translation": [0, 0.75, 0],
			"scale": [0.4, 0.4, 0.4]
		},
		"firstperson_lefthand": {
			"rotation": [0, 23, 0],
			"translation": [0, 1.25, 0],
			"scale": [0.4, 0.4, 0.4]
		},
		"ground": {
			"scale": [0.31, 0.31, 0.31]
		},
		"gui": {
			"rotation": [25, 45, 0],
			"scale": [0.6, 0.6, 0.6]
		},
		"head": {
			"rotation": [-1, 0, 0],
			"translation": [0, -8, 0],
			"scale": [0.5, 0.5, 0.5]
		},
		"fixed": {
			"rotation": [0, 90, 0],
			"translation": [0, 0, 4.75]
		}
	},
	"groups": [
		{
			"name": "side",
			"origin": [8, 8, 8],
			"color": 0,
			"children": [
				{
					"name": "middle",
					"origin": [8, 8, 8],
					"color": 0,
					"children": [
						{
							"name": "inventory",
							"origin": [8, 8, 8],
							"color": 0,
							"children": [0, 1]
						}
					]
				},
				{
					"name": "corner",
					"origin": [8, 8, 8],
					"color": 0,
					"children": [
						{
							"name": "side",
							"origin": [8, 8, 8],
							"color": 0,
							"children": [
								{
									"name": "middle",
									"origin": [8, 8, 8],
									"color": 0,
									"children": [
										{
											"name": "inventory",
											"origin": [8, 8, 8],
											"color": 0,
											"children": [2]
										}
									]
								}
							]
						}
					]
				}
			]
		}
	]
}