{
    "__createdwith": "opl's Model Creator",
    "ambientocclusion": false,
    "textures": {
        "particle": "block/pointed_dripstone_down_base"
    },
    "elements": [
        {
            "from": [3,0,3],
            "to": [12,16,12],
            "faces": {
                "up": {
                    "texture": "#particle"
                },
                "down": {
                    "texture": "#particle"
                },
                "west": {
                    "texture": "#particle"
                },
                "east": {
                    "texture": "#particle"
                },
                "north": {
                    "texture": "#particle"
                },
                "south": {
                    "texture": "#particle"
                }
            }
        },
        {
            "from": [3.5,1,4],
            "to": [13,9,13],
            "faces": {
                "up": {
                    "uv": [3.5,4,13,13],
                    "texture": "#particle"
                },
                "down": {
                    "texture": "#particle"
                },
                "west": {
                    "uv": [4,7,13,15],
                    "texture": "#particle"
                },
                "east": {
                    "uv": [4,7,13,15],
                    "texture": "#particle"
                },
                "north": {
                    "uv": [3.5,7,13,15],
                    "texture": "#particle"
                },
                "south": {
                    "uv": [3.5,7,13,15],
                    "texture": "#particle"
                }
            }
        },
        {
            "from": [2,7,2],
            "to": [11.5,15,11],
            "faces": {
                "up": {
                    "uv": [2,2,11.5,11],
                    "texture": "#particle"
                },
                "down": {
                    "texture": "#particle"
                },
                "west": {
                    "uv": [2,1,11,9],
                    "texture": "#particle"
                },
                "east": {
                    "uv": [2,1,11,9],
                    "texture": "#particle"
                },
                "north": {
                    "uv": [2,1,11.5,9],
                    "texture": "#particle"
                },
                "south": {
                    "uv": [2,1,11.5,9],
                    "texture": "#particle"
                }
            }
        }
    ]
}