{
  "type": "techreborn:chemical_reactor",
  "power": 25,
  "time": 250,
  "ingredients": [
    {
      "item": "minecraft:blue_dye",
      "count": 1
    },
    {
      "item": "minecraft:red_stained_glass",
      "count": 12
    }
  ],
  "results": [
    {
      "item": "minecraft:purple_stained_glass",
      "count": 12
    }
  ]
}