{
    "__createdwith": "opl's Model Creator",
    "ambientocclusion": false,
    "textures": {
        "particle": "block/oak_trapdoor"
    },
    "elements": [
        {
            "from": [0,0,0],
            "to": [4,3,16],
            "faces": {
                "up": {
                    "texture": "#particle"
                },
                "down": {
                    "texture": "#particle"
                },
                "west": {
                    "uv": [0,12,16,15],
                    "texture": "#particle"
                },
                "east": {
                    "uv": [0,12,16,15],
                    "texture": "#particle"
                },
                "north": {
                    "uv": [12,0,16,3],
                    "texture": "#particle"
                },
                "south": {
                    "uv": [0,12,4,15],
                    "texture": "#particle"
                }
            }
        },
        {
            "from": [12,0,0],
            "to": [16,3,16],
            "faces": {
                "up": {
                    "texture": "#particle"
                },
                "down": {
                    "texture": "#particle"
                },
                "west": {
                    "uv": [0,12,16,15],
                    "texture": "#particle"
                },
                "east": {
                    "uv": [0,12,16,15],
                    "texture": "#particle"
                },
                "north": {
                    "uv": [0,0,4,3],
                    "texture": "#particle"
                },
                "south": {
                    "uv": [12,12,16,15],
                    "texture": "#particle"
                }
            }
        },
        {
            "from": [4,0,0],
            "to": [12,3,4],
            "faces": {
                "up": {
                    "texture": "#particle"
                },
                "down": {
                    "uv": [4,12,12,16],
                    "texture": "#particle"
                },
                "north": {
                    "uv": [4,0,12,3],
                    "texture": "#particle"
                },
                "south": {
                    "uv": [4,12,12,15],
                    "texture": "#particle"
                }
            }
        },
        {
            "from": [4,0,12],
            "to": [12,3,16],
            "faces": {
                "up": {
                    "texture": "#particle"
                },
                "down": {
                    "uv": [4,0,12,4],
                    "texture": "#particle"
                },
                "north": {
                    "uv": [4,12,12,15],
                    "texture": "#particle"
                },
                "south": {
                    "uv": [4,12,12,15],
                    "texture": "#particle"
                }
            }
        },
        {
            "from": [7,1,4],
            "to": [9,2,12],
            "faces": {
                "up": {
                    "texture": "#particle"
                },
                "down": {
                    "texture": "#particle"
                },
                "west": {
                    "texture": "#particle"
                },
                "east": {
                    "texture": "#particle"
                }
            }
        },
        {
            "from": [4,1,7],
            "to": [12,2,9],
            "faces": {
                "up": {
                    "texture": "#particle"
                },
                "down": {
                    "texture": "#particle"
                },
                "north": {
                    "texture": "#particle"
                },
                "south": {
                    "texture": "#particle"
                }
            }
        }
    ]
}