{
  "type": "minecraft:crafting_shapeless",
  "ingredients": [
    {
      "item": "techreborn:emerald_nugget"
    },
    {
      "item": "techreborn:emerald_nugget"
    },
    {
      "item": "techreborn:emerald_nugget"
    },
    {
      "item": "techreborn:emerald_nugget"
    },
    {
      "item": "techreborn:emerald_nugget"
    },
    {
      "item": "techreborn:emerald_nugget"
    },
    {
      "item": "techreborn:emerald_nugget"
    },
    {
      "item": "techreborn:emerald_nugget"
    },
    {
      "item": "techreborn:emerald_nugget"
    }
  ],
  "result": {
    "item": "minecraft:emerald"
  }
}