{
  "type": "minecraft:crafting_shapeless",
  "ingredients": [
    {
      "item": "techreborn:red_garnet_storage_block"
    }
  ],
  "result": {
    "item": "techreborn:red_garnet_gem",
    "count": 9
  }
}