{
  "type": "techreborn:extractor",
  "power": 10,
  "time": 300,
  "ingredients": [
    {
      "item": "minecraft:rose_bush",
      "count": 1
    }
  ],
  "results": [
    {
      "item": "minecraft:red_dye",
      "count": 4
    }
  ]
}