{
  "type": "minecraft:crafting_shapeless",
  "ingredients": [
    {
      "item": "techreborn:sapphire_gem"
    },
    {
      "item": "techreborn:sapphire_gem"
    },
    {
      "item": "techreborn:sapphire_gem"
    },
    {
      "item": "techreborn:sapphire_gem"
    },
    {
      "item": "techreborn:sapphire_gem"
    },
    {
      "item": "techreborn:sapphire_gem"
    },
    {
      "item": "techreborn:sapphire_gem"
    },
    {
      "item": "techreborn:sapphire_gem"
    },
    {
      "item": "techreborn:sapphire_gem"
    }
  ],
  "result": {
    "item": "techreborn:sapphire_storage_block"
  }
}