{
    "variants": {
        "": [
		{ "model": "block/jungle_planks", "weight": 50 },
		{ "model": "block/planks/jungle_a", "weight": 100 },
		{ "model": "block/planks/jungle_b", "weight": 100 },
		{ "model": "block/planks/jungle_c", "weight": 100 }
		]
    }
}
