{
	"credit": "Made with Blockbench",

	"textures": {
		"2": "mcwbridges:block/bridge_1",
		"particle": "mcwbridges:block/bridge_2"
	},
	"elements": [
		{
			"from": [15.1, 0.6686, 8.57743],
			"to": [15.9, 16.0686, 10.57743],
			"rotation": {"angle": -22.5, "axis": "x", "origin": [7.8, 8.2486, 9.47743]},
			"faces": {
				"north": {"uv": [0, 0, 0.8, 15.4], "texture": "#2"},
				"east": {"uv": [0, 0, 2, 15.4], "texture": "#2"},
				"south": {"uv": [0, 0, 0.8, 15.4], "texture": "#2"},
				"west": {"uv": [0, 0, 2, 15.4], "texture": "#2"},
				"up": {"uv": [0, 0, 0.8, 2], "texture": "#2"}
			}
		},
		{
			"from": [15, 13.9, 0],
			"to": [16, 15.9, 7.5],
			"rotation": {"angle": 0, "axis": "y", "origin": [7.9, 6.22049, 8.24841]},
			"faces": {
				"north": {"uv": [0, 0, 1, 2], "texture": "#2"},
				"east": {"uv": [0, 0, 7.5, 2], "texture": "#2"},
				"south": {"uv": [0, 0, 1, 2], "texture": "#2"},
				"west": {"uv": [0, 0, 7.5, 2], "texture": "#2"},
				"up": {"uv": [0, 0, 1, 7.5], "texture": "#2"},
				"down": {"uv": [0, 0, 1, 7.5], "texture": "#2"}
			}
		},
		{
			"from": [15.1, 2.52389, 3.61658],
			"to": [15.9, 16.52389, 5.61658],
			"rotation": {"angle": -22.5, "axis": "x", "origin": [7.9, 6.22049, 8.24841]},
			"faces": {
				"north": {"uv": [0, 0, 0.8, 14], "texture": "#2"},
				"east": {"uv": [0, 0, 2, 14], "texture": "#2"},
				"south": {"uv": [0, 0, 0.8, 14], "texture": "#2"},
				"west": {"uv": [0, 0, 2, 14], "texture": "#2"}
			}
		},
		{
			"from": [0, 13.9, 0],
			"to": [1, 15.9, 7.5],
			"rotation": {"angle": 0, "axis": "y", "origin": [8, 6.22049, 8.24841]},
			"faces": {
				"north": {"uv": [0, 0, 1, 2], "texture": "#2"},
				"east": {"uv": [0, 0, 7.5, 2], "texture": "#2"},
				"south": {"uv": [0, 0, 1, 2], "texture": "#2"},
				"west": {"uv": [0, 0, 7.5, 2], "texture": "#2"},
				"up": {"uv": [0, 0, 1, 7.5], "texture": "#2"},
				"down": {"uv": [0, 0, 1, 7.5], "texture": "#2"}
			}
		},
		{
			"from": [0.1, 0.6686, 8.57743],
			"to": [0.9, 16.0686, 10.57743],
			"rotation": {"angle": -22.5, "axis": "x", "origin": [8.2, 8.2486, 9.47743]},
			"faces": {
				"north": {"uv": [0, 0, 0.8, 15.4], "texture": "#2"},
				"east": {"uv": [0, 0, 2, 15.4], "texture": "#2"},
				"south": {"uv": [0, 0, 0.8, 15.4], "texture": "#2"},
				"west": {"uv": [0, 0, 2, 15.4], "texture": "#2"},
				"up": {"uv": [0, 0, 0.8, 2], "texture": "#2"}
			}
		},
		{
			"from": [0.1, 2.52389, 3.61658],
			"to": [0.9, 16.52389, 5.61658],
			"rotation": {"angle": -22.5, "axis": "x", "origin": [8, 6.22049, 8.24841]},
			"faces": {
				"north": {"uv": [0, 0, 0.8, 14], "texture": "#2"},
				"east": {"uv": [0, 0, 2, 14], "texture": "#2"},
				"south": {"uv": [0, 0, 0.8, 14], "texture": "#2"},
				"west": {"uv": [0, 0, 2, 14], "texture": "#2"}
			}
		},
		{
			"from": [1, 0, 8],
			"to": [15, 1, 16],
			"rotation": {"angle": 0, "axis": "y", "origin": [8, 0.5, 12]},
			"faces": {
				"north": {"uv": [0, 0, 14, 1], "texture": "#particle"},
				"south": {"uv": [0, 0, 14, 1], "texture": "#particle"},
				"up": {"uv": [0, 0, 14, 8], "texture": "#particle"},
				"down": {"uv": [0, 0, 14, 8], "texture": "#particle"}
			}
		},
		{
			"from": [1, 8, 0],
			"to": [15, 9, 8],
			"rotation": {"angle": 0, "axis": "y", "origin": [8, 8.5, 4]},
			"faces": {
				"north": {"uv": [0, 0, 14, 1], "texture": "#particle"},
				"east": {"uv": [0, 0, 8, 1], "texture": "#particle"},
				"south": {"uv": [0, 0, 14, 1], "texture": "#particle"},
				"west": {"uv": [0, 0, 8, 1], "texture": "#particle"},
				"up": {"uv": [0, 0, 14, 8], "texture": "#particle"},
				"down": {"uv": [0, 0, 14, 8], "texture": "#particle"}
			}
		},
		{
			"from": [0, 0, 4],
			"to": [1, 2, 16],
			"rotation": {"angle": 0, "axis": "y", "origin": [8, 6.22049, 8.24841]},
			"faces": {
				"north": {"uv": [0, 0, 1, 2], "texture": "#2"},
				"east": {"uv": [0, 0, 11.9, 2], "texture": "#2"},
				"south": {"uv": [0, 0, 1, 2], "texture": "#2"},
				"west": {"uv": [0, 0, 11.9, 2], "texture": "#2"},
				"up": {"uv": [0, 0, 1, 11.9], "texture": "#2"},
				"down": {"uv": [0, 0, 1, 11.9], "texture": "#2"}
			}
		},
		{
			"from": [15, 0, 4],
			"to": [16, 2, 16],
			"rotation": {"angle": 0, "axis": "y", "origin": [7.9, 6.22049, 8.24841]},
			"faces": {
				"north": {"uv": [0, 0, 1, 2], "texture": "#2"},
				"east": {"uv": [0, 0, 11.9, 2], "texture": "#2"},
				"south": {"uv": [0, 0, 1, 2], "texture": "#2"},
				"west": {"uv": [0, 0, 11.9, 2], "texture": "#2"},
				"up": {"uv": [0, 0, 1, 11.9], "texture": "#2"},
				"down": {"uv": [0, 0, 1, 11.9], "texture": "#2"}
			}
		}
	],
	"display": {
		"thirdperson_righthand": {
			"rotation": [73, -180, 0],
			"translation": [-0.25, 0, 2.75],
			"scale": [0.4, 0.4, 0.4]
		},
		"thirdperson_lefthand": {
			"rotation": [73, -180, 0],
			"translation": [0, 0, 2.25],
			"scale": [0.4, 0.4, 0.4]
		},
		"firstperson_righthand": {
			"rotation": [0, -75, 0],
			"translation": [0, 1.75, 0],
			"scale": [0.4, 0.4, 0.4]
		},
		"firstperson_lefthand": {
			"rotation": [0, -73, 0],
			"translation": [0, 1.5, 0],
			"scale": [0.4, 0.4, 0.4]
		},
		"ground": {
			"scale": [0.31, 0.31, 0.31]
		},
		"gui": {
			"rotation": [25, 45, 0],
			"scale": [0.6, 0.6, 0.6]
		},
		"fixed": {
			"rotation": [0, 90, 0],
			"translation": [0, 0, 4.75]
		}
	}
}