{
  "parent": "minecraft:block/slab_top",
  "textures": {
    "bottom": "block/custom/deepslatebricks/d",
    "top": "block/custom/deepslatebricks/d",
    "side": "block/custom/deepslatebricks/d"
  }
}