{
    "variants": {
        "": [
		{ "model": "block/crimson_nylium", "weight":100 },
		{ "model": "block/crimson_nylium", "weight":100, "y":90},
		{ "model": "block/crimson_nylium", "weight":100, "y":180},
		{ "model": "block/crimson_nylium", "weight":100, "y":270}
		]
    }
}
