{
  "parent": "minecraft:block/slab_top",
  "textures": {
    "bottom": "block/custom/deepslatebricks/b",
    "top": "block/custom/deepslatebricks/b",
    "side": "block/custom/deepslatebricks/b"
  }
}