{
    "parent": "block/cube_bottom_top",
    "textures": {
        "bottom": "block/custom/terracotta/normal_top",
        "top": "block/custom/terracotta/normal_top",
        "side": "block/custom/terracotta/normal_side"
    }
}
