{
  "type": "techreborn:extractor",
  "power": 10,
  "time": 300,
  "ingredients": [
    {
      "item": "minecraft:orange_tulip",
      "count": 1
    }
  ],
  "results": [
    {
      "item": "minecraft:orange_tulip",
      "count": 2
    }
  ]
}