{
    "__createdwith": "opl's Model Creator",
    "ambientocclusion": true,
    "textures": {
        "particle": "block/custom/fence/jungle"
    },
    "elements": [
        {
            "from": [6,0,6],
            "to": [10,16,10],
            "faces": {
                "up": {
                    "uv": [6,0,10,4],
                    "texture": "#particle"
                },
                "down": {
                    "uv": [6,0,10,4],
                    "texture": "#particle"
                },
                "west": {
                    "texture": "#particle"
                },
                "east": {
                    "texture": "#particle"
                },
                "north": {
                    "texture": "#particle"
                },
                "south": {
                    "texture": "#particle"
                }
            }
        },
        {
            "from": [7,0,0],
            "to": [9,15,16],
            "faces": {
                "up": {
                    "uv": [6,0,10,4],
                    "texture": "#particle"
                },
                "down": {
                    "uv": [6,0,10,4],
                    "texture": "#particle"
                },
                "west": {
                    "uv": [0,0,16,15],
                    "texture": "#particle"
                },
                "east": {
                    "uv": [0,0,16,15],
                    "texture": "#particle"
                },
                "north": {
                    "texture": "#particle"
                },
                "south": {
                    "texture": "#particle"
                }
            }
        }
    ]
}