{
    "multipart": [
        {   "apply": { "model": "block/fence/jungle_post" }},
        {   "when": { "north": "true" },
            "apply": { "model": "block/fence/jungle_north" }
        },
        {   "when": { "east": "true" },
            "apply": { "model": "block/fence/jungle_north", "y": 90, "uvlock": false }
        },
        {   "when": { "south": "true" },
            "apply": { "model": "block/fence/jungle_south" }
        },
        {   "when": { "west": "true" },
            "apply": { "model": "block/fence/jungle_south", "y": 90, "uvlock": false }
        }
    ]
}
