{
  "parent": "minecraft:recipes/root",
  "rewards": {
    "recipes": [
      "techreborn:industrial_grinder/peridot_small_dust_from_shovel_with_water"
    ]
  },
  "criteria": {
    "has_peridot_spade": {
      "trigger": "minecraft:inventory_changed",
      "conditions": {
        "items": [
          {
            "items": [
              "techreborn:peridot_spade"
            ]
          }
        ]
      }
    },
    "has_the_recipe": {
      "trigger": "minecraft:recipe_unlocked",
      "conditions": {
        "recipe": "techreborn:industrial_grinder/peridot_small_dust_from_shovel_with_water"
      }
    }
  },
  "requirements": [
    [
      "has_peridot_spade",
      "has_the_recipe"
    ]
  ]
}