{
  "parent": "minecraft:recipes/root",
  "rewards": {
    "recipes": [
      "techreborn:blast_furnace/iron_nugget_from_hoe"
    ]
  },
  "criteria": {
    "has_iron_hoe": {
      "trigger": "minecraft:inventory_changed",
      "conditions": {
        "items": [
          {
            "items": [
              "minecraft:iron_hoe"
            ]
          }
        ]
      }
    },
    "has_the_recipe": {
      "trigger": "minecraft:recipe_unlocked",
      "conditions": {
        "recipe": "techreborn:blast_furnace/iron_nugget_from_hoe"
      }
    }
  },
  "requirements": [
    [
      "has_iron_hoe",
      "has_the_recipe"
    ]
  ]
}