{
    "variants": {
        "": [
		{ "model": "block/spruce_leaves", "weight":101 },
		{ "model": "block/spruce_leaves", "weight":100, "x":90, "y":90, "z":90 },
		{ "model": "block/spruce_leaves", "weight":100, "x":180, "y":180, "z":180 },
		{ "model": "block/spruce_leaves", "weight":100, "x":270, "y":270, "z":270 }
		]
    }
}