{
  "parent": "minecraft:recipes/root",
  "rewards": {
    "recipes": [
      "techreborn:grinder/aluminum_dust_from_block"
    ]
  },
  "criteria": {
    "has_tag_c_aluminum_blocks": {
      "trigger": "minecraft:inventory_changed",
      "conditions": {
        "items": [
          {
            "tag": "c:aluminum_blocks"
          }
        ]
      }
    },
    "has_the_recipe": {
      "trigger": "minecraft:recipe_unlocked",
      "conditions": {
        "recipe": "techreborn:grinder/aluminum_dust_from_block"
      }
    }
  },
  "requirements": [
    [
      "has_tag_c_aluminum_blocks",
      "has_the_recipe"
    ]
  ]
}