{
  "parent": "minecraft:recipes/root",
  "rewards": {
    "recipes": [
      "techreborn:extractor/black_dye_from_wither_rose"
    ]
  },
  "criteria": {
    "has_wither_rose": {
      "trigger": "minecraft:inventory_changed",
      "conditions": {
        "items": [
          {
            "items": [
              "minecraft:wither_rose"
            ]
          }
        ]
      }
    },
    "has_the_recipe": {
      "trigger": "minecraft:recipe_unlocked",
      "conditions": {
        "recipe": "techreborn:extractor/black_dye_from_wither_rose"
      }
    }
  },
  "requirements": [
    [
      "has_wither_rose",
      "has_the_recipe"
    ]
  ]
}