{	
    "parent": "block/cube_bottom_top",
    "textures": {
		"particle": "block/dirt",
		"bottom": "block/dirt",
		"top": "block/custom/grassblock/normal_a",
		"side": "block/grass_block_snow"
    }
}
