{
	"parent": "mcwbridges:block/bridge/bridge_wood/parent/inventory",
	"textures": {
		"0": "minecraft:block/jungle_log",
		"2": "minecraft:block/jungle_planks",
		"particle": "minecraft:block/jungle_log"
	}
}
