{
    "__createdwith": "opl's Model Creator",
    "ambientocclusion": true,
    "textures": {
        "cake": "block/custom/cake",
        "particle": "block/custom/cake"
    },
    "elements": [
        {
            "from": [5,0,1],
            "to": [15,6,15],
            "faces": {
                "up": {
                    "uv": [2.5,0.5,7.5,7.5],
                    "texture": "#cake"
                },
                "down": {
                    "uv": [10.5,0.5,15.5,7.5],
                    "texture": "#cake"
                },
                "west": {
                    "uv": [0.5,11.5,7.5,14.5],
                    "texture": "#cake"
                },
                "east": {
                    "uv": [0.5,11.5,7.5,14.5],
                    "texture": "#cake"
                },
                "north": {
                    "uv": [2.5,11.5,7.5,14.5],
                    "texture": "#cake"
                },
                "south": {
                    "uv": [2.5,11.5,7.5,14.5],
                    "texture": "#cake"
                }
            }
        },
        {
            "from": [11,6,11],
            "to": [13,8,13],
            "faces": {
                "up": {
                    "uv": [3.0,9.0,4.0,10.0],
                    "texture": "#cake"
                },
                "west": {
                    "uv": [3.0,10.0,4.0,11.0],
                    "texture": "#cake"
                },
                "east": {
                    "uv": [2.0,9.0,3.0,10.0],
                    "texture": "#cake"
                },
                "north": {
                    "uv": [2.0,9.0,3.0,10.0],
                    "texture": "#cake"
                },
                "south": {
                    "uv": [3.0,10.0,4.0,11.0],
                    "texture": "#cake"
                }
            }
        },
        {
            "from": [11,6,3],
            "to": [13,8,5],
            "faces": {
                "up": {
                    "uv": [3.0,9.0,4.0,10.0],
                    "texture": "#cake"
                },
                "west": {
                    "uv": [3.0,10.0,4.0,11.0],
                    "texture": "#cake"
                },
                "east": {
                    "uv": [2.0,9.0,3.0,10.0],
                    "texture": "#cake"
                },
                "north": {
                    "uv": [2.0,9.0,3.0,10.0],
                    "texture": "#cake"
                },
                "south": {
                    "uv": [3.0,10.0,4.0,11.0],
                    "texture": "#cake"
                }
            }
        },
        {
            "from": [7,6,2],
            "to": [9,8,4],
            "faces": {
                "up": {
                    "uv": [3.0,9.0,4.0,10.0],
                    "texture": "#cake"
                },
                "west": {
                    "uv": [3.0,10.0,4.0,11.0],
                    "texture": "#cake"
                },
                "east": {
                    "uv": [2.0,9.0,3.0,10.0],
                    "texture": "#cake"
                },
                "north": {
                    "uv": [2.0,9.0,3.0,10.0],
                    "texture": "#cake"
                },
                "south": {
                    "uv": [3.0,10.0,4.0,11.0],
                    "texture": "#cake"
                }
            }
        },
        {
            "from": [12,6,7],
            "to": [14,8,9],
            "faces": {
                "up": {
                    "uv": [3.0,9.0,4.0,10.0],
                    "texture": "#cake"
                },
                "west": {
                    "uv": [3.0,10.0,4.0,11.0],
                    "texture": "#cake"
                },
                "east": {
                    "uv": [2.0,9.0,3.0,10.0],
                    "texture": "#cake"
                },
                "north": {
                    "uv": [2.0,9.0,3.0,10.0],
                    "texture": "#cake"
                },
                "south": {
                    "uv": [3.0,10.0,4.0,11.0],
                    "texture": "#cake"
                }
            }
        },
        {
            "from": [7,6,12],
            "to": [9,8,14],
            "faces": {
                "up": {
                    "uv": [3.0,9.0,4.0,10.0],
                    "texture": "#cake"
                },
                "west": {
                    "uv": [3.0,10.0,4.0,11.0],
                    "texture": "#cake"
                },
                "east": {
                    "uv": [2.0,9.0,3.0,10.0],
                    "texture": "#cake"
                },
                "north": {
                    "uv": [2.0,9.0,3.0,10.0],
                    "texture": "#cake"
                },
                "south": {
                    "uv": [3.0,10.0,4.0,11.0],
                    "texture": "#cake"
                }
            }
        },
        {
            "from": [10.5,6,2.5],
            "to": [13.5,6.5,5.5],
            "faces": {
                "up": {
                    "uv": [7.0,9.0,7.5,10.0],
                    "texture": "#cake"
                },
                "west": {
                    "uv": [6.0,9.0,7.0,10.0],
                    "texture": "#cake"
                },
                "east": {
                    "uv": [6.0,9.0,7.0,10.0],
                    "texture": "#cake"
                },
                "north": {
                    "uv": [6.0,9.0,7.0,10.0],
                    "texture": "#cake"
                },
                "south": {
                    "uv": [6.0,9.0,7.0,10.0],
                    "texture": "#cake"
                }
            }
        },
        {
            "from": [6.5,6,11.5],
            "to": [9.5,6.5,14.5],
            "faces": {
                "up": {
                    "uv": [7.0,9.0,7.5,10.0],
                    "texture": "#cake"
                },
                "west": {
                    "uv": [6.0,9.0,7.0,10.0],
                    "texture": "#cake"
                },
                "east": {
                    "uv": [6.0,9.0,7.0,10.0],
                    "texture": "#cake"
                },
                "north": {
                    "uv": [6.0,9.0,7.0,10.0],
                    "texture": "#cake"
                },
                "south": {
                    "uv": [6.0,9.0,7.0,10.0],
                    "texture": "#cake"
                }
            }
        },
        {
            "from": [11.5,6,6.5],
            "to": [14.5,6.5,9.5],
            "faces": {
                "up": {
                    "uv": [7.0,9.0,7.5,10.0],
                    "texture": "#cake"
                },
                "west": {
                    "uv": [6.0,9.0,7.0,10.0],
                    "texture": "#cake"
                },
                "east": {
                    "uv": [6.0,9.0,7.0,10.0],
                    "texture": "#cake"
                },
                "north": {
                    "uv": [6.0,9.0,7.0,10.0],
                    "texture": "#cake"
                },
                "south": {
                    "uv": [6.0,9.0,7.0,10.0],
                    "texture": "#cake"
                }
            }
        },
        {
            "from": [10.5,6,10.5],
            "to": [13.5,6.5,13.5],
            "faces": {
                "up": {
                    "uv": [7.0,9.0,7.5,10.0],
                    "texture": "#cake"
                },
                "west": {
                    "uv": [6.0,9.0,7.0,10.0],
                    "texture": "#cake"
                },
                "east": {
                    "uv": [6.0,9.0,7.0,10.0],
                    "texture": "#cake"
                },
                "north": {
                    "uv": [6.0,9.0,7.0,10.0],
                    "texture": "#cake"
                },
                "south": {
                    "uv": [6.0,9.0,7.0,10.0],
                    "texture": "#cake"
                }
            }
        },
        {
            "from": [6.5,6,1.5],
            "to": [9.5,6.5,4.5],
            "faces": {
                "up": {
                    "uv": [7.0,9.0,7.5,10.0],
                    "texture": "#cake"
                },
                "west": {
                    "uv": [6.0,9.0,7.0,10.0],
                    "texture": "#cake"
                },
                "east": {
                    "uv": [6.0,9.0,7.0,10.0],
                    "texture": "#cake"
                },
                "north": {
                    "uv": [6.0,9.0,7.0,10.0],
                    "texture": "#cake"
                },
                "south": {
                    "uv": [6.0,9.0,7.0,10.0],
                    "texture": "#cake"
                }
            }
        }
    ]
}