{
  "parent": "minecraft:recipes/root",
  "rewards": {
    "recipes": [
      "minecraft:smelting/refined_iron_plate_from_c_iron_plates"
    ]
  },
  "criteria": {
    "has_tag_c_iron_plates": {
      "trigger": "minecraft:inventory_changed",
      "conditions": {
        "items": [
          {
            "tag": "c:iron_plates"
          }
        ]
      }
    },
    "has_the_recipe": {
      "trigger": "minecraft:recipe_unlocked",
      "conditions": {
        "recipe": "minecraft:smelting/refined_iron_plate_from_c_iron_plates"
      }
    }
  },
  "requirements": [
    [
      "has_tag_c_iron_plates",
      "has_the_recipe"
    ]
  ]
}