{
	"parent": "mcwbridges:block/bridge/bridge_stone/parent/base_torch",
	"textures": {
		"1": "minecraft:block/stone_bricks",
		"3": "minecraft:block/torch",
		"particle": "minecraft:block/stone_bricks"
	}
}
