{
	"credit": "Made with Blockbench",
	"elements": [
		{
			"from": [0, 3, 0],
			"to": [3, 4, 16],
			"rotation": {"angle": 0, "axis": "y", "origin": [8, 8, 13]},
			"faces": {
				"north": {"uv": [2, 12, 5, 12.9], "texture": "#2"},
				"east": {"uv": [0, 12, 16, 12.9], "texture": "#2"},
				"south": {"uv": [3, 12, 6, 12.9], "texture": "#2"},
				"west": {"uv": [16, 12, 0, 12.9], "texture": "#2"},
				"up": {"uv": [16, 4, 0, 1], "rotation": 90, "texture": "#2"}
			}
		},
		{
			"from": [0.5, 4, 4],
			"to": [2.5, 12, 12],
			"rotation": {"angle": 0, "axis": "y", "origin": [8, 8, 13]},
			"faces": {
				"north": {"uv": [5, 7, 7, 15], "texture": "#2"},
				"east": {"uv": [4, 7, 12, 15], "texture": "#2"},
				"south": {"uv": [7, 7, 9, 15], "texture": "#2"},
				"west": {"uv": [7, 7, 15, 15], "texture": "#2"}
			}
		},
		{
			"from": [0.5, 12, 0],
			"to": [2.5, 16, 16],
			"rotation": {"angle": 0, "axis": "y", "origin": [8, 8, 13]},
			"faces": {
				"north": {"uv": [11, 3, 9, 7], "texture": "#2"},
				"east": {"uv": [0, 7, 16, 11], "texture": "#2"},
				"south": {"uv": [13, 3, 11, 7], "texture": "#2"},
				"west": {"uv": [0, 3, 16, 7], "texture": "#2"},
				"up": {"uv": [0, 4, 16, 6], "rotation": 90, "texture": "#2"},
				"down": {"uv": [0, 0, 2, 16], "rotation": 180, "texture": "#2"}
			}
		},
		{
			"from": [13.5, 12, 0],
			"to": [15.5, 16, 16],
			"rotation": {"angle": 0, "axis": "y", "origin": [8, 8, 13]},
			"faces": {
				"north": {"uv": [11, 3, 9, 7], "texture": "#2"},
				"east": {"uv": [0, 7, 16, 11], "texture": "#2"},
				"south": {"uv": [13, 3, 11, 7], "texture": "#2"},
				"west": {"uv": [0, 3, 16, 7], "texture": "#2"},
				"up": {"uv": [0, 4, 16, 6], "rotation": 90, "texture": "#2"},
				"down": {"uv": [0, 0, 2, 16], "rotation": 180, "texture": "#2"}
			}
		},
		{
			"from": [13, 3, 0],
			"to": [16, 4, 16],
			"rotation": {"angle": 0, "axis": "y", "origin": [8, 8, 13]},
			"faces": {
				"north": {"uv": [4, 12, 7, 12.9], "texture": "#2"},
				"east": {"uv": [0, 12, 16, 12.9], "texture": "#2"},
				"south": {"uv": [2, 12, 5, 12.9], "texture": "#2"},
				"west": {"uv": [16, 12, 0, 12.9], "texture": "#2"},
				"up": {"uv": [16, 4, 0, 1], "rotation": 90, "texture": "#2"}
			}
		},
		{
			"from": [13.5, 4, 4],
			"to": [15.5, 12, 12],
			"rotation": {"angle": 0, "axis": "y", "origin": [8, 8, 13]},
			"faces": {
				"north": {"uv": [5, 7, 7, 15], "texture": "#2"},
				"east": {"uv": [4, 7, 12, 15], "texture": "#2"},
				"south": {"uv": [7, 7, 9, 15], "texture": "#2"},
				"west": {"uv": [7, 7, 15, 15], "texture": "#2"}
			}
		}
	],
	"display": {
		"thirdperson_righthand": {
			"rotation": [57, 91, 0],
			"translation": [0, 1.25, 0.5],
			"scale": [0.15, 0.15, 0.15]
		},
		"thirdperson_lefthand": {
			"rotation": [64, 91, 0],
			"translation": [0, 1.25, 1],
			"scale": [0.15, 0.15, 0.15]
		},
		"firstperson_righthand": {
			"rotation": [-6, 80, -6],
			"translation": [1.75, 1.5, 0.5],
			"scale": [0.15, 0.15, 0.15]
		},
		"firstperson_lefthand": {
			"rotation": [-1, 78, 0],
			"translation": [2, 1, 0],
			"scale": [0.15, 0.15, 0.15]
		},
		"ground": {
			"translation": [0, -0.5, 0],
			"scale": [0.2, 0.2, 0.2]
		},
		"gui": {
			"rotation": [21, -39, 0],
			"translation": [0, 0.25, 0],
			"scale": [0.36, 0.36, 0.36]
		},
		"head": {
			"rotation": [-1, 0, 0],
			"translation": [0, 10.5, 0],
			"scale": [0.5, 0.5, 0.5]
		},
		"fixed": {
			"rotation": [1, 93, 0],
			"translation": [0.25, -0.25, -0.25],
			"scale": [0.66, 0.65, 0.43]
		}
	}
}