{
  "parent": "minecraft:recipes/root",
  "rewards": {
    "recipes": [
      "techreborn:blast_furnace/bronze_ingot_from_pickaxe"
    ]
  },
  "criteria": {
    "has_bronze_pickaxe": {
      "trigger": "minecraft:inventory_changed",
      "conditions": {
        "items": [
          {
            "items": [
              "techreborn:bronze_pickaxe"
            ]
          }
        ]
      }
    },
    "has_the_recipe": {
      "trigger": "minecraft:recipe_unlocked",
      "conditions": {
        "recipe": "techreborn:blast_furnace/bronze_ingot_from_pickaxe"
      }
    }
  },
  "requirements": [
    [
      "has_bronze_pickaxe",
      "has_the_recipe"
    ]
  ]
}