{
  "type": "techreborn:chemical_reactor",
  "power": 25,
  "time": 250,
  "ingredients": [
    {
      "item": "minecraft:orange_dye",
      "count": 1
    },
    {
      "item": "minecraft:yellow_terracotta",
      "count": 8
    }
  ],
  "results": [
    {
      "item": "minecraft:orange_terracotta",
      "count": 8
    }
  ]
}