{
    "parent": "block/grassblock/flowers",
    "textures": {
		"particle": "block/dirt",
		"bottom": "block/dirt",
		"overlay": "block/grass_block_side_overlay",
		"top": "block/custom/grassblock/normal_a",
		"side": "block/grass_block_side",
		"float": "block/custom/grassblock/flowers_c"
    }
}
