{
  "type": "techreborn:industrial_grinder",
  "power": 128,
  "time": 140,
  "ingredients": [
    {
      "item": "minecraft:diamond_axe",
      "count": 1
    }
  ],
  "results": [
    {
      "item": "techreborn:diamond_small_dust",
      "count": 3
    },
    {
      "item": "techreborn:saw_small_dust"
    }
  ],
  "tank": {
    "fluid": "minecraft:water",
    "amount": {
      "droplets": 40500
    }
  }
}