{
    "variants": {
        "": [
			{ "model": "block/nether_gold_ore", "weight": 101 },
			{ "model": "block/nethergoldore/a", "weight": 100 },
			{ "model": "block/nethergoldore/b", "weight": 100 },
			{ "model": "block/nethergoldore/c", "weight": 100 }
		]
    }
}
