{
	"credit": "Made with Blockbench",
	"textures": {
		"0": "minecraft:block/bamboo_stalk",
		"2": "minecraft:block/bamboo_large_leaves",
		"particle": "minecraft:block/bamboo_stalk"
	},
	"elements": [
		{
			"from": [13, 0, 0],
			"to": [16, 3, 16],
			"faces": {
				"north": {"uv": [13, 0, 16, 3], "texture": "#0"},
				"east": {"uv": [3, 0, 6, 16], "rotation": 270, "texture": "#0"},
				"south": {"uv": [13, 4, 16, 7], "texture": "#0"},
				"west": {"uv": [3, 0, 6, 16], "rotation": 90, "texture": "#0"},
				"up": {"uv": [3, 0, 6, 16], "rotation": 180, "texture": "#0"},
				"down": {"uv": [3, 0, 6, 16], "texture": "#0"}
			}
		},
		{
			"from": [9, 0, 0],
			"to": [12, 3, 16],
			"rotation": {"angle": 0, "axis": "y", "origin": [-12, 8, 8]},
			"faces": {
				"north": {"uv": [13, 4, 16, 7], "texture": "#0"},
				"east": {"uv": [0, 0, 3, 16], "rotation": 270, "texture": "#0"},
				"south": {"uv": [13, 0, 16, 3], "texture": "#0"},
				"west": {"uv": [0, 0, 3, 16], "rotation": 90, "texture": "#0"},
				"up": {"uv": [0, 0, 3, 16], "rotation": 180, "texture": "#0"},
				"down": {"uv": [0, 0, 3, 16], "texture": "#0"}
			}
		},
		{
			"from": [0, 3.1, 6.5],
			"to": [16, 3.1, 9.5],
			"faces": {
				"up": {"uv": [2, 0, 5, 16], "rotation": 90, "texture": "#2"},
				"down": {"uv": [3, 0, 6, 16], "rotation": 90, "texture": "#2"}
			}
		},
		{
			"from": [0, -0.1, 6.5],
			"to": [16, -0.1, 9.5],
			"faces": {
				"up": {"uv": [2, 0, 5, 16], "rotation": 90, "texture": "#2"},
				"down": {"uv": [3, 0, 6, 16], "rotation": 90, "texture": "#2"}
			}
		},
		{
			"from": [4, 0, 0],
			"to": [7, 3, 16],
			"faces": {
				"north": {"uv": [13, 0, 16, 3], "texture": "#0"},
				"east": {"uv": [6, 0, 9, 16], "rotation": 270, "texture": "#0"},
				"south": {"uv": [13, 4, 16, 7], "texture": "#0"},
				"west": {"uv": [6, 0, 9, 16], "rotation": 90, "texture": "#0"},
				"up": {"uv": [6, 0, 9, 16], "rotation": 180, "texture": "#0"},
				"down": {"uv": [6, 0, 9, 16], "texture": "#0"}
			}
		},
		{
			"from": [0, 0, 0],
			"to": [3, 3, 16],
			"rotation": {"angle": 0, "axis": "y", "origin": [-12, 8, 8]},
			"faces": {
				"north": {"uv": [13, 4, 16, 7], "texture": "#0"},
				"east": {"uv": [9, 0, 12, 16], "rotation": 270, "texture": "#0"},
				"south": {"uv": [13, 0, 16, 3], "texture": "#0"},
				"west": {"uv": [9, 0, 12, 16], "rotation": 90, "texture": "#0"},
				"up": {"uv": [9, 0, 12, 16], "rotation": 180, "texture": "#0"},
				"down": {"uv": [9, 0, 12, 16], "texture": "#0"}
			}
		}
	],
	"display": {
		"thirdperson_righthand": {
			"rotation": [57, 91, 0],
			"translation": [0, 1.25, 0.5],
			"scale": [0.15, 0.15, 0.15]
		},
		"thirdperson_lefthand": {
			"rotation": [64, 91, 0],
			"translation": [0, 1.25, 1],
			"scale": [0.15, 0.15, 0.15]
		},
		"firstperson_righthand": {
			"rotation": [-6, 80, -6],
			"translation": [1.75, 1.75, 0.5],
			"scale": [0.15, 0.15, 0.15]
		},
		"firstperson_lefthand": {
			"rotation": [-1, 78, 0],
			"translation": [2, 1.75, 0],
			"scale": [0.15, 0.15, 0.15]
		},
		"ground": {
			"translation": [0, -0.5, 0],
			"scale": [0.2, 0.2, 0.2]
		},
		"gui": {
			"rotation": [21, -39, 0],
			"translation": [0.25, 0.25, 0],
			"scale": [0.45, 0.45, 0.45]
		},
		"head": {
			"rotation": [-1, 0, 0],
			"translation": [2.75, 2.25, -1.75],
			"scale": [0.5, 0.5, 0.5]
		},
		"fixed": {
			"rotation": [1, 93, 0],
			"translation": [0.25, -0.25, -0.25],
			"scale": [0.66, 0.65, 0.43]
		}
	}
}