{
  "type": "techreborn:compressor",
  "power": 10,
  "time": 300,
  "ingredients": [
    {
      "item": "minecraft:coal_block",
      "count": 1
    }
  ],
  "results": [
    {
      "item": "techreborn:coal_plate",
      "count": 9
    }
  ]
}