(kicad_pcb (version 20221018) (generator pcbnew)

  (general
    (thickness 1.6)
  )

  (paper "A4")
  (layers
    (0 "F.Cu" signal)
    (31 "B.Cu" signal)
    (32 "B.Adhes" user "B.Adhesive")
    (33 "F.Adhes" user "F.Adhesive")
    (34 "B.Paste" user)
    (35 "F.Paste" user)
    (36 "B.SilkS" user "B.Silkscreen")
    (37 "F.SilkS" user "F.Silkscreen")
    (38 "B.Mask" user)
    (39 "F.Mask" user)
    (40 "Dwgs.User" user "User.Drawings")
    (41 "Cmts.User" user "User.Comments")
    (42 "Eco1.User" user "User.Eco1")
    (43 "Eco2.User" user "User.Eco2")
    (44 "Edge.Cuts" user)
    (45 "Margin" user)
    (46 "B.CrtYd" user "B.Courtyard")
    (47 "F.CrtYd" user "F.Courtyard")
    (48 "B.Fab" user)
    (49 "F.Fab" user)
    (50 "User.1" user)
    (51 "User.2" user)
    (52 "User.3" user)
    (53 "User.4" user)
    (54 "User.5" user)
    (55 "User.6" user)
    (56 "User.7" user)
    (57 "User.8" user)
    (58 "User.9" user)
  )

  (setup
    (pad_to_mask_clearance 0)
    (pcbplotparams
      (layerselection 0x00010fc_ffffffff)
      (plot_on_all_layers_selection 0x0000000_00000000)
      (disableapertmacros false)
      (usegerberextensions false)
      (usegerberattributes true)
      (usegerberadvancedattributes true)
      (creategerberjobfile true)
      (dashed_line_dash_ratio 12.000000)
      (dashed_line_gap_ratio 3.000000)
      (svgprecision 4)
      (plotframeref false)
      (viasonmask true)
      (mode 1)
      (useauxorigin false)
      (hpglpennumber 1)
      (hpglpenspeed 20)
      (hpglpendiameter 15.000000)
      (dxfpolygonmode true)
      (dxfimperialunits true)
      (dxfusepcbnewfont true)
      (psnegative false)
      (psa4output false)
      (plotreference true)
      (plotvalue true)
      (plotinvisibletext false)
      (sketchpadsonfab false)
      (subtractmaskfromsilk false)
      (outputformat 1)
      (mirror false)
      (drillshape 1)
      (scaleselection 1)
      (outputdirectory "")
    )
  )

  (net 0 "")

  (footprint "Library:R_0805_2012Metric" (layer "F.Cu")
    (tstamp 3772d2f7-f4e3-43f8-afcc-101ad9b2ba6f)
    (at 77 63)
    (descr "Resistor SMD 0805 (2012 Metric), square (rectangular) end terminal, IPC_7351 nominal, (Body size source: IPC-SM-782 page 72, https://www.pcb-3d.com/wordpress/wp-content/uploads/ipc-sm-782a_amendment_1_and_2.pdf), generated with kicad-footprint-generator")
    (tags "resistor")
    (attr smd)
    (fp_text reference "R1" (at 0 -1.65) (layer "F.SilkS")
        (effects (font (size 1 1) (thickness 0.15)))
      (tstamp ebfd9c84-d26b-4ccc-b9cb-a436d87535fc)
    )
    (fp_text value "R_0805_2012Metric" (at 0 1.65) (layer "F.Fab")
        (effects (font (size 1 1) (thickness 0.15)))
      (tstamp 72b68cae-cc26-4660-8bfd-b54a06330ab0)
    )
    (fp_text user "${REFERENCE}" (at 0 0) (layer "F.Fab")
        (effects (font (size 0.5 0.5) (thickness 0.08)))
      (tstamp 72b52b5b-7ca8-4a93-8aca-8fd58611fdea)
    )
    (fp_line (start -1.425 -0.7) (end -0.4 -0.7)
      (stroke (width 0.01) (type default)) (layer "F.Cu") (tstamp bd0766c0-629f-4653-9eff-7752cfe30582))
    (fp_line (start -0.4 0.7) (end -1.425 0.7)
      (stroke (width 0.01) (type default)) (layer "F.Cu") (tstamp 73d5459a-d26d-476d-be98-8590cc358b57))
    (fp_line (start -0.4 0.7) (end -0.4 -0.7)
      (stroke (width 0.01) (type default)) (layer "F.Cu") (tstamp 9a5ba92a-4756-4ac0-a72c-9cba9dd99ddf))
    (fp_line (start 0.4 -0.7) (end 1.425 -0.7)
      (stroke (width 0.01) (type default)) (layer "F.Cu") (tstamp a3e51e4b-1e9a-4dba-9595-a3d8f8933b65))
    (fp_line (start 0.4 0.7) (end 0.4 -0.7)
      (stroke (width 0.01) (type default)) (layer "F.Cu") (tstamp 86db646c-7811-46d5-ae1c-8907e0b7f4d5))
    (fp_line (start 1.425 0.7) (end 0.4 0.7)
      (stroke (width 0.01) (type default)) (layer "F.Cu") (tstamp 6b08a9a2-a3ad-4989-b80e-bcf04bd83a39))
    (fp_line (start -0.227064 -0.735) (end 0.227064 -0.735)
      (stroke (width 0.12) (type solid)) (layer "F.SilkS") (tstamp 1ba7ad53-bc14-434f-9621-34db5f1e74ba))
    (fp_line (start -0.227064 0.735) (end 0.227064 0.735)
      (stroke (width 0.12) (type solid)) (layer "F.SilkS") (tstamp 860d8560-324d-4537-a4b8-d5fc408b6e3e))
    (fp_line (start -1.68 -0.95) (end 1.68 -0.95)
      (stroke (width 0.05) (type solid)) (layer "F.CrtYd") (tstamp 927268e6-aa2d-46ff-ab51-85a15a8415ea))
    (fp_line (start -1.68 0.95) (end -1.68 -0.95)
      (stroke (width 0.05) (type solid)) (layer "F.CrtYd") (tstamp 2672b4e1-14fe-4fde-9b77-238326095aa4))
    (fp_line (start 1.68 -0.95) (end 1.68 0.95)
      (stroke (width 0.05) (type solid)) (layer "F.CrtYd") (tstamp 88bcc340-92c7-47f0-bae4-611eb5c41584))
    (fp_line (start 1.68 0.95) (end -1.68 0.95)
      (stroke (width 0.05) (type solid)) (layer "F.CrtYd") (tstamp 48a81df6-44b3-43d9-a88d-b497778df3b1))
    (fp_line (start -1 -0.625) (end 1 -0.625)
      (stroke (width 0.1) (type solid)) (layer "F.Fab") (tstamp 466c734e-c93d-4bf5-b54d-3d72931ccfd2))
    (fp_line (start -1 0.625) (end -1 -0.625)
      (stroke (width 0.1) (type solid)) (layer "F.Fab") (tstamp 30a68807-e45a-4ead-9af2-560c6cd30196))
    (fp_line (start 1 -0.625) (end 1 0.625)
      (stroke (width 0.1) (type solid)) (layer "F.Fab") (tstamp 277b24ef-20a7-4b22-9266-7c90f99885d8))
    (fp_line (start 1 0.625) (end -1 0.625)
      (stroke (width 0.1) (type solid)) (layer "F.Fab") (tstamp c94de169-734d-4a86-8933-4a81fe740afa))
    (pad "1" smd rect (at -0.9125 0) (size 1.025 1.4) (layers "F.Cu" "F.Paste" "F.Mask")
      (zone_connect 2) (thermal_bridge_width 0.381) (tstamp 14d17aa7-791d-45cc-90b5-11f74a512142))
    (pad "2" smd rect (at 0.9125 0) (size 1.025 1.4) (layers "F.Cu" "F.Paste" "F.Mask") (tstamp 1fd2093f-b468-42bc-a695-38fb62562a6b))
    (zone (net 0) (net_name "") (layer "F.Cu") (tstamp 477c2431-e772-4bc6-b1cb-fab00d2e211f) (hatch edge 0.5)
      (connect_pads (clearance 0))
      (min_thickness 0.25) (filled_areas_thickness no)
      (keepout (tracks allowed) (vias allowed) (pads allowed) (copperpour not_allowed) (footprints allowed))
      (fill (thermal_gap 0.5) (thermal_bridge_width 0.5))
      (polygon
        (pts
          (xy 75.5 62.3)
          (xy 76.6 62.3)
          (xy 76.6 63.7)
          (xy 75.5 63.7)
          (xy 75.5 63.8)
          (xy 78.5 63.8)
          (xy 78.5 63.7)
          (xy 77.4 63.7)
          (xy 77.4 62.3)
          (xy 78.5 62.3)
          (xy 78.5 62.2)
          (xy 75.5 62.2)
        )
      )
    )
    (model "${KICAD6_3DMODEL_DIR}/Resistor_SMD.3dshapes/R_0805_2012Metric.wrl"
      (offset (xyz 0 0 0))
      (scale (xyz 1 1 1))
      (rotate (xyz 0 0 0))
    )
  )

  (footprint "Library:R_0805_2012Metric" (layer "B.Cu")
    (tstamp 82cdeae3-20e8-4e4e-ab7c-ff7a4c781e4c)
    (at 74.83 70.47 180)
    (descr "Resistor SMD 0805 (2012 Metric), square (rectangular) end terminal, IPC_7351 nominal, (Body size source: IPC-SM-782 page 72, https://www.pcb-3d.com/wordpress/wp-content/uploads/ipc-sm-782a_amendment_1_and_2.pdf), generated with kicad-footprint-generator")
    (tags "resistor")
    (attr smd)
    (fp_text reference "R2" (at 0 1.65) (layer "B.SilkS")
        (effects (font (size 1 1) (thickness 0.15)) (justify mirror))
      (tstamp cfb9691c-dd3a-4019-b704-999f8eec05a2)
    )
    (fp_text value "R_0805_2012Metric" (at 0 -1.65) (layer "B.Fab")
        (effects (font (size 1 1) (thickness 0.15)) (justify mirror))
      (tstamp a090bca5-5db7-459b-9b75-5fd592c21680)
    )
    (fp_text user "${REFERENCE}" (at 0 0) (layer "B.Fab")
        (effects (font (size 0.5 0.5) (thickness 0.08)) (justify mirror))
      (tstamp f1211f9f-5ec7-427d-b1a1-3a3152f03fe7)
    )
    (fp_line (start -1.425 0.7) (end -0.4 0.7)
      (stroke (width 0.01) (type default)) (layer "B.Cu") (tstamp 3df831dd-b607-4fe2-99da-c7265f129db6))
    (fp_line (start -0.4 -0.7) (end -1.425 -0.7)
      (stroke (width 0.01) (type default)) (layer "B.Cu") (tstamp 1f803422-b577-4b76-8097-29eb36ac534f))
    (fp_line (start -0.4 -0.7) (end -0.4 0.7)
      (stroke (width 0.01) (type default)) (layer "B.Cu") (tstamp f4d077a3-f2de-4b61-b9b6-39e18daf1313))
    (fp_line (start 0.4 -0.7) (end 0.4 0.7)
      (stroke (width 0.01) (type default)) (layer "B.Cu") (tstamp 00dc20e5-a170-45c1-bc9f-c8f9b08b6f48))
    (fp_line (start 0.4 0.7) (end 1.425 0.7)
      (stroke (width 0.01) (type default)) (layer "B.Cu") (tstamp e5ded03b-e216-444d-bb84-960a3e1c839d))
    (fp_line (start 1.425 -0.7) (end 0.4 -0.7)
      (stroke (width 0.01) (type default)) (layer "B.Cu") (tstamp bb8fa1fc-51f2-4b79-a39a-5ff67ebeaf20))
    (fp_line (start -0.227064 -0.735) (end 0.227064 -0.735)
      (stroke (width 0.12) (type solid)) (layer "B.SilkS") (tstamp 5ec48b32-1974-46ca-bd83-64d396c77d60))
    (fp_line (start -0.227064 0.735) (end 0.227064 0.735)
      (stroke (width 0.12) (type solid)) (layer "B.SilkS") (tstamp 28c95555-325a-4e93-b56c-e309a6a6d2b2))
    (fp_line (start -1.68 -0.95) (end -1.68 0.95)
      (stroke (width 0.05) (type solid)) (layer "B.CrtYd") (tstamp 51630925-ed9f-4a35-93ae-dcbcb7c49b4c))
    (fp_line (start -1.68 0.95) (end 1.68 0.95)
      (stroke (width 0.05) (type solid)) (layer "B.CrtYd") (tstamp 7f0bf8aa-78fe-49cb-893a-cf2b9e4d5877))
    (fp_line (start 1.68 -0.95) (end -1.68 -0.95)
      (stroke (width 0.05) (type solid)) (layer "B.CrtYd") (tstamp e90dd9b8-6076-4aea-863e-cc15e6104166))
    (fp_line (start 1.68 0.95) (end 1.68 -0.95)
      (stroke (width 0.05) (type solid)) (layer "B.CrtYd") (tstamp c92b2293-2890-44ea-a943-03c58da115ca))
    (fp_line (start -1 -0.625) (end -1 0.625)
      (stroke (width 0.1) (type solid)) (layer "B.Fab") (tstamp 7375ecc3-f6ad-4c2b-b930-fbc62a2d11fd))
    (fp_line (start -1 0.625) (end 1 0.625)
      (stroke (width 0.1) (type solid)) (layer "B.Fab") (tstamp b7009439-ae41-49f4-afdc-d2c5a1affbdf))
    (fp_line (start 1 -0.625) (end -1 -0.625)
      (stroke (width 0.1) (type solid)) (layer "B.Fab") (tstamp f4189b18-5d50-4036-97e2-c7a31287f7d7))
    (fp_line (start 1 0.625) (end 1 -0.625)
      (stroke (width 0.1) (type solid)) (layer "B.Fab") (tstamp f43ea100-664a-4b4c-a08f-e9899ae12bc1))
    (pad "1" smd rect (at -0.9125 0 180) (size 1.025 1.4) (layers "B.Cu" "B.Paste" "B.Mask")
      (zone_connect 2) (thermal_bridge_width 0.381) (tstamp 8cfde3b4-e5c4-4c1a-a7d0-97012dd8e78f))
    (pad "2" smd rect (at 0.9125 0 180) (size 1.025 1.4) (layers "B.Cu" "B.Paste" "B.Mask") (tstamp fabab37b-1314-476b-be30-4c33eeb42ec0))
    (zone (net 0) (net_name "") (layer "B.Cu") (tstamp d0cc39f0-ab0a-4049-930d-b182f052ee0e) (hatch edge 0.5)
      (connect_pads (clearance 0))
      (min_thickness 0.25) (filled_areas_thickness no)
      (keepout (tracks allowed) (vias allowed) (pads allowed) (copperpour not_allowed) (footprints allowed))
      (fill (thermal_gap 0.5) (thermal_bridge_width 0.5))
      (polygon
        (pts
          (xy 76.33 69.77)
          (xy 75.23 69.77)
          (xy 75.23 71.17)
          (xy 76.33 71.17)
          (xy 76.33 71.27)
          (xy 73.33 71.27)
          (xy 73.33 71.17)
          (xy 74.43 71.17)
          (xy 74.43 69.77)
          (xy 73.33 69.77)
          (xy 73.33 69.67)
          (xy 76.33 69.67)
        )
      )
    )
    (model "${KICAD6_3DMODEL_DIR}/Resistor_SMD.3dshapes/R_0805_2012Metric.wrl"
      (offset (xyz 0 0 0))
      (scale (xyz 1 1 1))
      (rotate (xyz 0 0 0))
    )
  )

  (gr_line (start 20 120) (end 20 20)
    (stroke (width 0.15) (type default)) (layer "Cmts.User") (tstamp 14b4be7f-123f-4979-9985-4e428b980cd8))
  (gr_line (start 180 120) (end 240 120)
    (stroke (width 0.15) (type default)) (layer "Cmts.User") (tstamp 2046d070-457d-4e8e-98e7-8f1985b9d717))
  (gr_line (start 180 120) (end 120 120)
    (stroke (width 0.15) (type default)) (layer "Cmts.User") (tstamp 242ae742-c04e-4232-9805-d5f80acc3bc4))
  (gr_line (start 20 20) (end 120 20)
    (stroke (width 0.15) (type default)) (layer "Cmts.User") (tstamp 4a4bee38-05ec-47d8-ac8d-57127da18ced))
  (gr_line (start 240 120) (end 240 20)
    (stroke (width 0.15) (type default)) (layer "Cmts.User") (tstamp 64e5a258-0c64-4773-97c5-239511716812))
  (gr_line (start 120 120) (end 20 120)
    (stroke (width 0.15) (type default)) (layer "Cmts.User") (tstamp 7798d595-dc3a-462a-889c-e5cf87dfe5de))
  (gr_line (start 180 20) (end 180 120)
    (stroke (width 0.15) (type default)) (layer "Cmts.User") (tstamp 860817f9-0a09-480a-b25e-775aff40890e))
  (gr_line (start 180 120) (end 180 164.45)
    (stroke (width 0.15) (type default)) (layer "Cmts.User") (tstamp 8ef40020-cc51-465e-a466-df53a1c86cf9))
  (gr_line (start 240 164.45) (end 240 120)
    (stroke (width 0.15) (type default)) (layer "Cmts.User") (tstamp 93f764a1-6014-43cd-88ce-50aa50e024bd))
  (gr_line (start 180 164.45) (end 240 164.45)
    (stroke (width 0.15) (type default)) (layer "Cmts.User") (tstamp 9d73151e-ec8f-4d41-9783-da9e37ea3098))
  (gr_line (start 120 20) (end 120 120)
    (stroke (width 0.15) (type default)) (layer "Cmts.User") (tstamp a28e4360-4f25-456b-abad-c2abef116933))
  (gr_line (start 120 164.45) (end 180 164.45)
    (stroke (width 0.15) (type default)) (layer "Cmts.User") (tstamp a5437449-b2ec-4eea-a620-e6f511dce053))
  (gr_line (start 20 120) (end 20 164.45)
    (stroke (width 0.15) (type default)) (layer "Cmts.User") (tstamp b074d872-c264-43b2-8401-e54615b95ccc))
  (gr_line (start 120 20) (end 180 20)
    (stroke (width 0.15) (type default)) (layer "Cmts.User") (tstamp bd2dd897-b0d9-4e64-bdb3-ee6cec5ec34a))
  (gr_line (start 120 164.45) (end 120 120)
    (stroke (width 0.15) (type default)) (layer "Cmts.User") (tstamp c5da0bb6-05b7-4749-be48-f111854b5ef2))
  (gr_line (start 240 20) (end 180 20)
    (stroke (width 0.15) (type default)) (layer "Cmts.User") (tstamp da4ba6be-aec6-45af-a948-9bc0fc7a24ed))
  (gr_line (start 20 164.45) (end 120 164.45)
    (stroke (width 0.15) (type default)) (layer "Cmts.User") (tstamp e1c88fb4-6c1a-4fd7-b88d-9a150df177e1))
  (gr_line (start 120 20) (end 120 120)
    (stroke (width 0.1) (type default)) (layer "Edge.Cuts") (tstamp 6f1c0bf9-7d39-4548-8982-f6e2586f8e43))
  (gr_line (start 20 20) (end 120 20)
    (stroke (width 0.1) (type default)) (layer "Edge.Cuts") (tstamp 7fa3c641-5e51-4631-a3db-3f4909052f25))
  (gr_line (start 120 120) (end 20 120)
    (stroke (width 0.1) (type default)) (layer "Edge.Cuts") (tstamp 835e1df0-a71a-4ec8-be8a-4378dcace78c))
  (gr_line (start 20 120) (end 20 20)
    (stroke (width 0.1) (type default)) (layer "Edge.Cuts") (tstamp cf82c270-5e24-46f5-8ce5-b13c0eb592d7))

  (segment (start 74.0875 59.6725) (end 73.47 59.055) (width 0.2) (layer "F.Cu") (net 0) (tstamp 018387c8-5f65-497d-b2a9-783f0042cadf))
  (segment (start 77.9125 63) (end 79.5 63) (width 0.9) (layer "F.Cu") (net 0) (tstamp 02be3ac8-477e-485e-a18d-360e0e5a3b3a))
  (segment (start 74.0875 62) (end 73.94 62) (width 0.2) (layer "F.Cu") (net 0) (tstamp 0d8286ef-8bbe-4e67-b891-e9e6bd3eda64))
  (segment (start 74.94125 62.85375) (end 75.0875 63) (width 0.25) (layer "F.Cu") (net 0) (tstamp 27ee33ae-bd79-497d-81e8-82f5a76b083b))
  (segment (start 80.5 62) (end 81 62) (width 0.9) (layer "F.Cu") (net 0) (tstamp 319f9e01-ded2-44aa-870f-73fe969a7f1e))
  (segment (start 73.92 61.98) (end 73.9 62) (width 0.2) (layer "F.Cu") (net 0) (tstamp 32b9ac9c-0217-4b69-a3fe-751d9490d0bb))
  (segment (start 73.47 59.055) (end 73.025 59.055) (width 0.2) (layer "F.Cu") (net 0) (tstamp 417af13e-45f8-4e79-84a6-41dfcf6ccd7f))
  (segment (start 73.9 62) (end 71.5 62) (width 0.2) (layer "F.Cu") (net 0) (tstamp 672393b3-0ba1-4c3e-9b78-659ad205e8a2))
  (segment (start 73.94 62) (end 73.92 61.98) (width 0.2) (layer "F.Cu") (net 0) (tstamp 687a1ef4-5420-4b7b-88dc-b7dca61568a1))
  (segment (start 71.5 62) (end 71.43 61.93) (width 0.2) (layer "F.Cu") (net 0) (tstamp 88876d77-f1da-487d-b057-280feeb30619))
  (segment (start 79.5 63) (end 80.5 62) (width 0.9) (layer "F.Cu") (net 0) (tstamp 91440fbd-0f5b-47e0-9c8a-49fc2550acfe))
  (segment (start 76.0875 63) (end 75.0875 63) (width 0.2) (layer "F.Cu") (net 0) (tstamp a9222813-0ac7-4af0-9651-ad0d68bfa54c))
  (segment (start 74.0875 59.6725) (end 74.705 59.055) (width 0.2) (layer "F.Cu") (net 0) (tstamp b2097ce4-e27a-4e6a-948c-7531ce91e34d))
  (segment (start 74.0875 59.6725) (end 74.0875 62) (width 0.2) (layer "F.Cu") (net 0) (tstamp b8c86701-a265-4525-b31d-2b05e0d1d112))
  (segment (start 74.94125 62.85375) (end 74.0875 62) (width 0.25) (layer "F.Cu") (net 0) (tstamp f27c8cf9-c123-4313-bbca-2939225215b3))
  (segment (start 74.705 59.055) (end 74.93 59.055) (width 0.2) (layer "F.Cu") (net 0) (tstamp fcd07560-103e-4826-9fba-46e602be7ad3))
  (via (at 74.94125 62.85375) (size 0.8) (drill 0.4) (layers "F.Cu" "B.Cu") (net 0) (tstamp 0aa739e6-9579-4845-b270-9a61f0cab590))
  (via (at 115.03 116.08) (size 0.8) (drill 0.4) (layers "F.Cu" "B.Cu") (net 0) (tstamp 4fe97d84-cf9a-42ad-8043-a3846bc8f7fd))
  (via (at 74.0875 59.6725) (size 0.8) (drill 0.4) (layers "F.Cu" "B.Cu") (net 0) (tstamp 9e7e488e-7b7c-4e75-b346-17d9ce94a86b))
  (via (at 77.7425 67.1425) (size 0.8) (drill 0.4) (layers "F.Cu" "B.Cu") (net 0) (tstamp bf53dd2a-e987-4c8d-a82c-29e7f1d07874))
  (via (at 109.07 114.5) (size 0.8) (drill 0.4) (layers "F.Cu" "B.Cu") (net 0) (tstamp e8e60aa9-1ca4-4826-9908-a7175fa9a71e))
  (segment (start 77.89 69.47) (end 77.91 69.45) (width 0.2) (layer "B.Cu") (net 0) (tstamp 0567fbd4-b28c-4d4e-a5ac-70f7c875637e))
  (segment (start 77.93 69.47) (end 80.33 69.47) (width 0.2) (layer "B.Cu") (net 0) (tstamp 082330ce-3a01-4ed9-80a5-e5cdbb01f516))
  (segment (start 71.43 60.82) (end 72.31 59.94) (width 0.2) (layer "B.Cu") (net 0) (tstamp 0fafcc6c-25af-4907-b6f4-bc8f72d1971f))
  (segment (start 77.7425 67.1425) (end 78.36 66.525) (width 0.2) (layer "B.Cu") (net 0) (tstamp 0fc86377-4bc3-4b0a-8dd9-0a9691e8b5ef))
  (segment (start 75.7425 70.47) (end 76.7425 70.47) (width 0.2) (layer "B.Cu") (net 0) (tstamp 11811c84-2f03-4615-920c-8e95ff8bb8de))
  (segment (start 80.33 69.47) (end 80.4 69.4) (width 0.2) (layer "B.Cu") (net 0) (tstamp 2254b59b-57a8-4494-873b-86fe035d1527))
  (segment (start 71.43 61.22) (end 71.43 60.59) (width 0.2) (layer "B.Cu") (net 0) (tstamp 289bcc10-b580-4669-96e9-a47e77cfd7dd))
  (segment (start 78.36 66.525) (end 78.805 66.525) (width 0.2) (layer "B.Cu") (net 0) (tstamp 34ee51b2-8fa3-4e3c-89ea-928a760cb605))
  (segment (start 77.7425 67.1425) (end 77.125 66.525) (width 0.2) (layer "B.Cu") (net 0) (tstamp 87bfb0ab-c651-4cf9-90cc-98e1ff6b3d63))
  (segment (start 77.91 69.45) (end 77.93 69.47) (width 0.2) (layer "B.Cu") (net 0) (tstamp a5266ae0-c878-4180-bc5f-eb5348478ec0))
  (segment (start 71.33 69.47) (end 70.83 69.47) (width 0.9) (layer "B.Cu") (net 0) (tstamp a5e16331-980e-4d30-abd7-b09ed519f43e))
  (segment (start 72.33 70.47) (end 71.33 69.47) (width 0.9) (layer "B.Cu") (net 0) (tstamp b9ec102b-ffde-4488-8a46-775a76075e6d))
  (segment (start 76.7425 70.47) (end 77.7425 69.47) (width 0.2) (layer "B.Cu") (net 0) (tstamp bfa3cfb6-0afc-4ac6-b397-8668d4dae796))
  (segment (start 77.7425 69.47) (end 77.89 69.47) (width 0.2) (layer "B.Cu") (net 0) (tstamp c2ee3b49-2b83-4d08-b738-3905a2c7af09))
  (segment (start 71.43 61.22) (end 71.43 60.82) (width 0.2) (layer "B.Cu") (net 0) (tstamp c5d5fe10-c32e-4faf-82bf-0cc324913d1b))
  (segment (start 73.9175 70.47) (end 72.33 70.47) (width 0.25) (layer "B.Cu") (net 0) (tstamp db960f58-c444-4540-b026-cc0f57eb2774))
  (segment (start 77.125 66.525) (end 76.9 66.525) (width 0.2) (layer "B.Cu") (net 0) (tstamp e31d7310-4dd2-48c8-ba53-820dbe5c314b))
  (segment (start 77.7425 67.1425) (end 77.7425 69.47) (width 0.2) (layer "B.Cu") (net 0) (tstamp e89496c6-4836-4f80-ab5c-ed46e9342eb9))
  (segment (start 71.43 61.93) (end 71.43 61.22) (width 0.2) (layer "B.Cu") (net 0) (tstamp ff464762-3799-4e0b-8d67-7a6a39608f60))

  (zone (net 0) (net_name "") (layer "F.Cu") (tstamp fc035474-c432-4de7-a6e6-fd7d34580712) (hatch edge 0.381)
    (connect_pads (clearance 0.5))
    (min_thickness 0.25) (filled_areas_thickness no)
    (fill yes (mode hatch) (thermal_gap 0.5) (thermal_bridge_width 0.5) (island_removal_mode 1) (island_area_min 10)
      (hatch_thickness 0.381) (hatch_gap 0.381) (hatch_orientation 45)
      (hatch_smoothing_level 3) (hatch_smoothing_value 1)
      (hatch_border_algorithm min_thickness) (hatch_min_hole_area 0.3))
    (polygon
      (pts
        (xy 112 114)
        (xy 122 114)
        (xy 122 122)
        (xy 112 122)
      )
    )
    (filled_polygon
      (layer "F.Cu")
      (island)
      (pts
        (xy 119.942539 114.019685)
        (xy 119.988294 114.072489)
        (xy 119.9995 114.124)
        (xy 119.9995 119.8755)
        (xy 119.979815 119.942539)
        (xy 119.927011 119.988294)
        (xy 119.8755 119.9995)
        (xy 112.124 119.9995)
        (xy 112.056961 119.979815)
        (xy 112.011206 119.927011)
        (xy 112 119.8755)
        (xy 112 119.457041)
        (xy 112.399 119.457041)
        (xy 112.399 119.7265)
        (xy 112.615717 119.7265)
        (xy 112.625297 119.709906)
        (xy 112.625297 119.709905)
        (xy 113.229356 119.709905)
        (xy 113.238937 119.7265)
        (xy 113.693348 119.7265)
        (xy 113.702928 119.709906)
        (xy 114.306987 119.709906)
        (xy 114.316567 119.7265)
        (xy 114.770978 119.7265)
        (xy 114.780558 119.709906)
        (xy 115.384618 119.709906)
        (xy 115.394198 119.7265)
        (xy 115.848609 119.7265)
        (xy 115.858189 119.709906)
        (xy 116.462249 119.709906)
        (xy 116.471829 119.7265)
        (xy 116.92624 119.7265)
        (xy 116.93582 119.709906)
        (xy 117.539879 119.709906)
        (xy 117.549459 119.7265)
        (xy 118.003871 119.7265)
        (xy 118.013451 119.709906)
        (xy 118.61751 119.709906)
        (xy 118.62709 119.7265)
        (xy 119.081501 119.7265)
        (xy 119.091081 119.709906)
        (xy 119.091081 119.677747)
        (xy 119.06655 119.635259)
        (xy 118.912862 119.48157)
        (xy 118.870376 119.457041)
        (xy 118.838216 119.457041)
        (xy 118.795728 119.481571)
        (xy 118.64204 119.635259)
        (xy 118.61751 119.677747)
        (xy 118.61751 119.709906)
        (xy 118.013451 119.709906)
        (xy 118.013451 119.677747)
        (xy 117.98892 119.635259)
        (xy 117.835232 119.481571)
        (xy 117.792745 119.457041)
        (xy 117.760585 119.457041)
        (xy 117.718097 119.481571)
        (xy 117.564409 119.635259)
        (xy 117.539879 119.677747)
        (xy 117.539879 119.709906)
        (xy 116.93582 119.709906)
        (xy 116.93582 119.677747)
        (xy 116.911289 119.635259)
        (xy 116.757601 119.481571)
        (xy 116.715114 119.457041)
        (xy 116.682954 119.457041)
        (xy 116.640467 119.48157)
        (xy 116.486779 119.635259)
        (xy 116.462249 119.677747)
        (xy 116.462249 119.709906)
        (xy 115.858189 119.709906)
        (xy 115.858189 119.677747)
        (xy 115.833658 119.635259)
        (xy 115.679969 119.48157)
        (xy 115.637483 119.457041)
        (xy 115.605324 119.457041)
        (xy 115.562837 119.48157)
        (xy 115.409148 119.635259)
        (xy 115.384618 119.677747)
        (xy 115.384618 119.709906)
        (xy 114.780558 119.709906)
        (xy 114.780558 119.677747)
        (xy 114.756027 119.635259)
        (xy 114.602339 119.48157)
        (xy 114.559853 119.457041)
        (xy 114.527693 119.457041)
        (xy 114.485205 119.481571)
        (xy 114.331517 119.635259)
        (xy 114.306987 119.677747)
        (xy 114.306987 119.709906)
        (xy 113.702928 119.709906)
        (xy 113.702928 119.677747)
        (xy 113.678397 119.635259)
        (xy 113.524709 119.481571)
        (xy 113.482222 119.457041)
        (xy 113.450062 119.457041)
        (xy 113.407575 119.48157)
        (xy 113.253888 119.635258)
        (xy 113.229356 119.677748)
        (xy 113.229356 119.709905)
        (xy 112.625297 119.709905)
        (xy 112.625297 119.677747)
        (xy 112.600766 119.635259)
        (xy 112.447078 119.481571)
        (xy 112.404591 119.457041)
        (xy 112.399 119.457041)
        (xy 112 119.457041)
        (xy 112 119.17109)
        (xy 112.690541 119.17109)
        (xy 112.715071 119.213578)
        (xy 112.868759 119.367266)
        (xy 112.911247 119.391797)
        (xy 112.943407 119.391797)
        (xy 112.985893 119.367267)
        (xy 113.139581 119.213578)
        (xy 113.164112 119.17109)
        (xy 113.768172 119.17109)
        (xy 113.792702 119.213578)
        (xy 113.946391 119.367267)
        (xy 113.988878 119.391797)
        (xy 114.021037 119.391797)
        (xy 114.063523 119.367267)
        (xy 114.217212 119.213578)
        (xy 114.241743 119.17109)
        (xy 114.845803 119.17109)
        (xy 114.870333 119.213578)
        (xy 115.024021 119.367267)
        (xy 115.066508 119.391797)
        (xy 115.098668 119.391797)
        (xy 115.141155 119.367266)
        (xy 115.294843 119.213578)
        (xy 115.319374 119.17109)
        (xy 115.923433 119.17109)
        (xy 115.947963 119.213578)
        (xy 116.101651 119.367266)
        (xy 116.144139 119.391797)
        (xy 116.176299 119.391797)
        (xy 116.218785 119.367267)
        (xy 116.372472 119.213579)
        (xy 116.397004 119.17109)
        (xy 117.001064 119.17109)
        (xy 117.025594 119.213578)
        (xy 117.179282 119.367266)
        (xy 117.22177 119.391797)
        (xy 117.253929 119.391797)
        (xy 117.296415 119.367267)
        (xy 117.450104 119.213578)
        (xy 117.474635 119.17109)
        (xy 118.078695 119.17109)
        (xy 118.103225 119.213578)
        (xy 118.256914 119.367267)
        (xy 118.299401 119.391797)
        (xy 118.33156 119.391797)
        (xy 118.374046 119.367267)
        (xy 118.527735 119.213578)
        (xy 118.552266 119.17109)
        (xy 118.552266 119.171089)
        (xy 119.156325 119.171089)
        (xy 119.180857 119.213579)
        (xy 119.334544 119.367267)
        (xy 119.377031 119.391797)
        (xy 119.409191 119.391797)
        (xy 119.451678 119.367266)
        (xy 119.605366 119.213578)
        (xy 119.629897 119.17109)
        (xy 119.629897 119.138931)
        (xy 119.605367 119.096444)
        (xy 119.451678 118.942756)
        (xy 119.409191 118.918226)
        (xy 119.377031 118.918226)
        (xy 119.334543 118.942756)
        (xy 119.180857 119.096442)
        (xy 119.156325 119.138932)
        (xy 119.156325 119.171089)
        (xy 118.552266 119.171089)
        (xy 118.552266 119.138931)
        (xy 118.527736 119.096444)
        (xy 118.374046 118.942755)
        (xy 118.33156 118.918226)
        (xy 118.299401 118.918226)
        (xy 118.256914 118.942755)
        (xy 118.103224 119.096444)
        (xy 118.078695 119.138931)
        (xy 118.078695 119.17109)
        (xy 117.474635 119.17109)
        (xy 117.474635 119.138931)
        (xy 117.450105 119.096444)
        (xy 117.296415 118.942755)
        (xy 117.253929 118.918226)
        (xy 117.22177 118.918226)
        (xy 117.179282 118.942756)
        (xy 117.025593 119.096444)
        (xy 117.001064 119.138931)
        (xy 117.001064 119.17109)
        (xy 116.397004 119.17109)
        (xy 116.397005 119.171089)
        (xy 116.397005 119.138932)
        (xy 116.372472 119.096442)
        (xy 116.218786 118.942756)
        (xy 116.176299 118.918226)
        (xy 116.144139 118.918226)
        (xy 116.101651 118.942756)
        (xy 115.947962 119.096444)
        (xy 115.923433 119.138931)
        (xy 115.923433 119.17109)
        (xy 115.319374 119.17109)
        (xy 115.319374 119.138931)
        (xy 115.294844 119.096444)
        (xy 115.141155 118.942756)
        (xy 115.098668 118.918226)
        (xy 115.066508 118.918226)
        (xy 115.02402 118.942756)
        (xy 114.870333 119.096443)
        (xy 114.845803 119.138931)
        (xy 114.845803 119.17109)
        (xy 114.241743 119.17109)
        (xy 114.241743 119.138931)
        (xy 114.217213 119.096444)
        (xy 114.063523 118.942755)
        (xy 114.021037 118.918226)
        (xy 113.988878 118.918226)
        (xy 113.946391 118.942755)
        (xy 113.792701 119.096444)
        (xy 113.768172 119.138931)
        (xy 113.768172 119.17109)
        (xy 113.164112 119.17109)
        (xy 113.164112 119.138931)
        (xy 113.139581 119.096443)
        (xy 112.985894 118.942756)
        (xy 112.943407 118.918226)
        (xy 112.911247 118.918226)
        (xy 112.868759 118.942756)
        (xy 112.71507 119.096444)
        (xy 112.690541 119.138931)
        (xy 112.690541 119.17109)
        (xy 112 119.17109)
        (xy 112 118.37941)
        (xy 112.399 118.37941)
        (xy 112.399 118.852982)
        (xy 112.404589 118.852982)
        (xy 112.447079 118.828449)
        (xy 112.600767 118.674762)
        (xy 112.625297 118.632275)
        (xy 112.625297 118.632274)
        (xy 113.229356 118.632274)
        (xy 113.253888 118.674764)
        (xy 113.407573 118.828449)
        (xy 113.450064 118.852982)
        (xy 113.48222 118.852982)
        (xy 113.52471 118.828449)
        (xy 113.678398 118.674762)
        (xy 113.702928 118.632275)
        (xy 114.306987 118.632275)
        (xy 114.331516 118.674762)
        (xy 114.485204 118.828449)
        (xy 114.527695 118.852982)
        (xy 114.559851 118.852982)
        (xy 114.602341 118.828449)
        (xy 114.756027 118.674763)
        (xy 114.780558 118.632275)
        (xy 115.384618 118.632275)
        (xy 115.409147 118.674762)
        (xy 115.562838 118.828452)
        (xy 115.605324 118.852982)
        (xy 115.637483 118.852982)
        (xy 115.679968 118.828452)
        (xy 115.833659 118.674762)
        (xy 115.858189 118.632275)
        (xy 116.462249 118.632275)
        (xy 116.486779 118.674763)
        (xy 116.640465 118.828449)
        (xy 116.682956 118.852982)
        (xy 116.715112 118.852982)
        (xy 116.757602 118.828449)
        (xy 116.91129 118.674762)
        (xy 116.93582 118.632275)
        (xy 117.539879 118.632275)
        (xy 117.564408 118.674762)
        (xy 117.718096 118.828449)
        (xy 117.760587 118.852982)
        (xy 117.792743 118.852982)
        (xy 117.835233 118.828449)
        (xy 117.988921 118.674762)
        (xy 118.013451 118.632275)
        (xy 118.61751 118.632275)
        (xy 118.642039 118.674762)
        (xy 118.795727 118.828449)
        (xy 118.838218 118.852982)
        (xy 118.870374 118.852982)
        (xy 118.912864 118.828449)
        (xy 119.06655 118.674763)
        (xy 119.091081 118.632275)
        (xy 119.695141 118.632275)
        (xy 119.71967 118.674762)
        (xy 119.7265 118.681591)
        (xy 119.7265 118.5508)
        (xy 119.719671 118.557628)
        (xy 119.695141 118.600116)
        (xy 119.695141 118.632275)
        (xy 119.091081 118.632275)
        (xy 119.091081 118.600116)
        (xy 119.06655 118.557628)
        (xy 118.912862 118.403939)
        (xy 118.870376 118.37941)
        (xy 118.838216 118.37941)
        (xy 118.795728 118.40394)
        (xy 118.64204 118.557628)
        (xy 118.61751 118.600116)
        (xy 118.61751 118.632275)
        (xy 118.013451 118.632275)
        (xy 118.013451 118.600116)
        (xy 117.98892 118.557628)
        (xy 117.835232 118.40394)
        (xy 117.792745 118.37941)
        (xy 117.760585 118.37941)
        (xy 117.718097 118.40394)
        (xy 117.564409 118.557628)
        (xy 117.539879 118.600116)
        (xy 117.539879 118.632275)
        (xy 116.93582 118.632275)
        (xy 116.93582 118.600116)
        (xy 116.911289 118.557628)
        (xy 116.757601 118.40394)
        (xy 116.715114 118.37941)
        (xy 116.682954 118.37941)
        (xy 116.640467 118.403939)
        (xy 116.486779 118.557628)
        (xy 116.462249 118.600116)
        (xy 116.462249 118.632275)
        (xy 115.858189 118.632275)
        (xy 115.858189 118.600116)
        (xy 115.833658 118.557628)
        (xy 115.679969 118.403939)
        (xy 115.637483 118.37941)
        (xy 115.605324 118.37941)
        (xy 115.562837 118.403939)
        (xy 115.409148 118.557628)
        (xy 115.384618 118.600116)
        (xy 115.384618 118.632275)
        (xy 114.780558 118.632275)
        (xy 114.780558 118.600116)
        (xy 114.756027 118.557628)
        (xy 114.602339 118.403939)
        (xy 114.559853 118.37941)
        (xy 114.527693 118.37941)
        (xy 114.485205 118.40394)
        (xy 114.331517 118.557628)
        (xy 114.306987 118.600116)
        (xy 114.306987 118.632275)
        (xy 113.702928 118.632275)
        (xy 113.702928 118.600116)
        (xy 113.678397 118.557628)
        (xy 113.524709 118.40394)
        (xy 113.482222 118.37941)
        (xy 113.450062 118.37941)
        (xy 113.407575 118.403939)
        (xy 113.253888 118.557627)
        (xy 113.229356 118.600117)
        (xy 113.229356 118.632274)
        (xy 112.625297 118.632274)
        (xy 112.625297 118.600116)
        (xy 112.600766 118.557628)
        (xy 112.447078 118.40394)
        (xy 112.404591 118.37941)
        (xy 112.399 118.37941)
        (xy 112 118.37941)
        (xy 112 118.09346)
        (xy 112.690541 118.09346)
        (xy 112.71507 118.135946)
        (xy 112.868759 118.289635)
        (xy 112.911247 118.314166)
        (xy 112.943407 118.314166)
        (xy 112.985893 118.289636)
        (xy 113.139582 118.135946)
        (xy 113.164112 118.09346)
        (xy 113.768172 118.09346)
        (xy 113.792701 118.135946)
        (xy 113.946391 118.289636)
        (xy 113.988878 118.314166)
        (xy 114.021037 118.314166)
        (xy 114.063523 118.289636)
        (xy 114.217213 118.135946)
        (xy 114.241743 118.09346)
        (xy 114.845803 118.09346)
        (xy 114.870332 118.135946)
        (xy 115.024021 118.289636)
        (xy 115.066508 118.314166)
        (xy 115.098668 118.314166)
        (xy 115.141155 118.289635)
        (xy 115.294844 118.135946)
        (xy 115.319374 118.09346)
        (xy 115.923433 118.09346)
        (xy 115.947962 118.135946)
        (xy 116.101651 118.289635)
        (xy 116.144139 118.314166)
        (xy 116.176299 118.314166)
        (xy 116.218785 118.289636)
        (xy 116.372475 118.135945)
        (xy 116.397005 118.09346)
        (xy 117.001064 118.09346)
        (xy 117.025593 118.135946)
        (xy 117.179282 118.289635)
        (xy 117.22177 118.314166)
        (xy 117.253929 118.314166)
        (xy 117.296415 118.289636)
        (xy 117.450105 118.135946)
        (xy 117.474635 118.09346)
        (xy 118.078695 118.09346)
        (xy 118.103224 118.135946)
        (xy 118.256914 118.289636)
        (xy 118.299401 118.314166)
        (xy 118.33156 118.314166)
        (xy 118.374046 118.289636)
        (xy 118.527736 118.135946)
        (xy 118.552266 118.09346)
        (xy 119.156325 118.09346)
        (xy 119.180854 118.135945)
        (xy 119.334544 118.289636)
        (xy 119.377031 118.314166)
        (xy 119.409191 118.314166)
        (xy 119.451678 118.289635)
        (xy 119.605367 118.135946)
        (xy 119.629897 118.09346)
        (xy 119.629897 118.0613)
        (xy 119.605367 118.018814)
        (xy 119.451678 117.865125)
        (xy 119.409191 117.840595)
        (xy 119.377031 117.840595)
        (xy 119.334544 117.865124)
        (xy 119.180854 118.018815)
        (xy 119.156325 118.0613)
        (xy 119.156325 118.09346)
        (xy 118.552266 118.09346)
        (xy 118.552266 118.0613)
        (xy 118.527736 118.018814)
        (xy 118.374046 117.865124)
        (xy 118.33156 117.840595)
        (xy 118.299401 117.840595)
        (xy 118.256914 117.865124)
        (xy 118.103224 118.018814)
        (xy 118.078695 118.0613)
        (xy 118.078695 118.09346)
        (xy 117.474635 118.09346)
        (xy 117.474635 118.0613)
        (xy 117.450105 118.018814)
        (xy 117.296415 117.865124)
        (xy 117.253929 117.840595)
        (xy 117.22177 117.840595)
        (xy 117.179282 117.865125)
        (xy 117.025593 118.018814)
        (xy 117.001064 118.0613)
        (xy 117.001064 118.09346)
        (xy 116.397005 118.09346)
        (xy 116.397005 118.0613)
        (xy 116.372475 118.018815)
        (xy 116.218785 117.865124)
        (xy 116.176299 117.840595)
        (xy 116.144139 117.840595)
        (xy 116.101651 117.865125)
        (xy 115.947962 118.018814)
        (xy 115.923433 118.0613)
        (xy 115.923433 118.09346)
        (xy 115.319374 118.09346)
        (xy 115.319374 118.0613)
        (xy 115.294844 118.018814)
        (xy 115.141155 117.865125)
        (xy 115.098668 117.840595)
        (xy 115.066508 117.840595)
        (xy 115.024021 117.865124)
        (xy 114.870332 118.018814)
        (xy 114.845803 118.0613)
        (xy 114.845803 118.09346)
        (xy 114.241743 118.09346)
        (xy 114.241743 118.0613)
        (xy 114.217213 118.018814)
        (xy 114.063523 117.865124)
        (xy 114.021037 117.840595)
        (xy 113.988878 117.840595)
        (xy 113.946391 117.865124)
        (xy 113.792701 118.018814)
        (xy 113.768172 118.0613)
        (xy 113.768172 118.09346)
        (xy 113.164112 118.09346)
        (xy 113.164112 118.0613)
        (xy 113.139582 118.018814)
        (xy 112.985893 117.865124)
        (xy 112.943407 117.840595)
        (xy 112.911247 117.840595)
        (xy 112.868759 117.865125)
        (xy 112.71507 118.018814)
        (xy 112.690541 118.0613)
        (xy 112.690541 118.09346)
        (xy 112 118.09346)
        (xy 112 117.30178)
        (xy 112.399 117.30178)
        (xy 112.399 117.775351)
        (xy 112.404591 117.775351)
        (xy 112.447078 117.75082)
        (xy 112.600766 117.597132)
        (xy 112.625297 117.554644)
        (xy 112.625297 117.554643)
        (xy 113.229356 117.554643)
        (xy 113.253888 117.597133)
        (xy 113.407575 117.750821)
        (xy 113.450062 117.775351)
        (xy 113.482222 117.775351)
        (xy 113.524709 117.75082)
        (xy 113.678397 117.597132)
        (xy 113.702928 117.554644)
        (xy 114.306987 117.554644)
        (xy 114.331517 117.597132)
        (xy 114.485205 117.75082)
        (xy 114.527693 117.775351)
        (xy 114.559853 117.775351)
        (xy 114.602339 117.750821)
        (xy 114.756027 117.597132)
        (xy 114.780558 117.554644)
        (xy 115.384618 117.554644)
        (xy 115.409148 117.597132)
        (xy 115.562837 117.750821)
        (xy 115.605324 117.775351)
        (xy 115.637483 117.775351)
        (xy 115.679969 117.750821)
        (xy 115.833658 117.597132)
        (xy 115.858189 117.554644)
        (xy 116.462249 117.554644)
        (xy 116.486779 117.597132)
        (xy 116.640467 117.750821)
        (xy 116.682954 117.775351)
        (xy 116.715114 117.775351)
        (xy 116.757601 117.75082)
        (xy 116.911289 117.597132)
        (xy 116.93582 117.554644)
        (xy 117.539879 117.554644)
        (xy 117.564409 117.597132)
        (xy 117.718097 117.75082)
        (xy 117.760585 117.775351)
        (xy 117.792745 117.775351)
        (xy 117.835232 117.75082)
        (xy 117.98892 117.597132)
        (xy 118.013451 117.554644)
        (xy 118.61751 117.554644)
        (xy 118.64204 117.597132)
        (xy 118.795728 117.75082)
        (xy 118.838216 117.775351)
        (xy 118.870376 117.775351)
        (xy 118.912862 117.750821)
        (xy 119.06655 117.597132)
        (xy 119.091081 117.554644)
        (xy 119.695141 117.554644)
        (xy 119.719671 117.597132)
        (xy 119.7265 117.603961)
        (xy 119.7265 117.473169)
        (xy 119.71967 117.479998)
        (xy 119.695141 117.522485)
        (xy 119.695141 117.554644)
        (xy 119.091081 117.554644)
        (xy 119.091081 117.522485)
        (xy 119.06655 117.479997)
        (xy 118.912863 117.32631)
        (xy 118.870376 117.30178)
        (xy 118.838216 117.30178)
        (xy 118.795728 117.32631)
        (xy 118.642039 117.479998)
        (xy 118.61751 117.522485)
        (xy 118.61751 117.554644)
        (xy 118.013451 117.554644)
        (xy 118.013451 117.522485)
        (xy 117.988921 117.479998)
        (xy 117.835232 117.32631)
        (xy 117.792745 117.30178)
        (xy 117.760585 117.30178)
        (xy 117.718097 117.32631)
        (xy 117.564408 117.479998)
        (xy 117.539879 117.522485)
        (xy 117.539879 117.554644)
        (xy 116.93582 117.554644)
        (xy 116.93582 117.522485)
        (xy 116.91129 117.479998)
        (xy 116.757601 117.32631)
        (xy 116.715114 117.30178)
        (xy 116.682954 117.30178)
        (xy 116.640466 117.32631)
        (xy 116.486779 117.479997)
        (xy 116.462249 117.522485)
        (xy 116.462249 117.554644)
        (xy 115.858189 117.554644)
        (xy 115.858189 117.522485)
        (xy 115.833659 117.479998)
        (xy 115.679969 117.326309)
        (xy 115.637483 117.30178)
        (xy 115.605324 117.30178)
        (xy 115.562837 117.326309)
        (xy 115.409147 117.479998)
        (xy 115.384618 117.522485)
        (xy 115.384618 117.554644)
        (xy 114.780558 117.554644)
        (xy 114.780558 117.522485)
        (xy 114.756027 117.479997)
        (xy 114.60234 117.32631)
        (xy 114.559853 117.30178)
        (xy 114.527693 117.30178)
        (xy 114.485205 117.32631)
        (xy 114.331516 117.479998)
        (xy 114.306987 117.522485)
        (xy 114.306987 117.554644)
        (xy 113.702928 117.554644)
        (xy 113.702928 117.522485)
        (xy 113.678398 117.479998)
        (xy 113.524709 117.32631)
        (xy 113.482222 117.30178)
        (xy 113.450062 117.30178)
        (xy 113.407574 117.32631)
        (xy 113.253888 117.479996)
        (xy 113.229356 117.522486)
        (xy 113.229356 117.554643)
        (xy 112.625297 117.554643)
        (xy 112.625297 117.522485)
        (xy 112.600767 117.479998)
        (xy 112.447078 117.32631)
        (xy 112.404591 117.30178)
        (xy 112.399 117.30178)
        (xy 112 117.30178)
        (xy 112 117.015829)
        (xy 112.690541 117.015829)
        (xy 112.71507 117.058316)
        (xy 112.868758 117.212003)
        (xy 112.911249 117.236536)
        (xy 112.943405 117.236536)
        (xy 112.985895 117.212003)
        (xy 113.139581 117.058317)
        (xy 113.164112 117.015829)
        (xy 113.768172 117.015829)
        (xy 113.792701 117.058316)
        (xy 113.946392 117.212006)
        (xy 113.988878 117.236536)
        (xy 114.021037 117.236536)
        (xy 114.063522 117.212006)
        (xy 114.217213 117.058316)
        (xy 114.241743 117.015829)
        (xy 115.923433 117.015829)
        (xy 115.947962 117.058316)
        (xy 116.10165 117.212003)
        (xy 116.144141 117.236536)
        (xy 116.176297 117.236536)
        (xy 116.218787 117.212003)
        (xy 116.372472 117.058318)
        (xy 116.397004 117.015829)
        (xy 117.001064 117.015829)
        (xy 117.025593 117.058316)
        (xy 117.179281 117.212003)
        (xy 117.221772 117.236536)
        (xy 117.253929 117.236536)
        (xy 117.296414 117.212006)
        (xy 117.450105 117.058316)
        (xy 117.474635 117.015829)
        (xy 118.078695 117.015829)
        (xy 118.103224 117.058316)
        (xy 118.256915 117.212006)
        (xy 118.299401 117.236536)
        (xy 118.33156 117.236536)
        (xy 118.374045 117.212006)
        (xy 118.527736 117.058316)
        (xy 118.552266 117.015829)
        (xy 118.552266 117.015828)
        (xy 119.156325 117.015828)
        (xy 119.180857 117.058318)
        (xy 119.334542 117.212003)
        (xy 119.377033 117.236536)
        (xy 119.409189 117.236536)
        (xy 119.451679 117.212003)
        (xy 119.605367 117.058316)
        (xy 119.629897 117.015829)
        (xy 119.629897 116.98367)
        (xy 119.605366 116.941182)
        (xy 119.451678 116.787494)
        (xy 119.409191 116.762964)
        (xy 119.377031 116.762964)
        (xy 119.334544 116.787493)
        (xy 119.180857 116.941181)
        (xy 119.156325 116.983671)
        (xy 119.156325 117.015828)
        (xy 118.552266 117.015828)
        (xy 118.552266 116.98367)
        (xy 118.527735 116.941182)
        (xy 118.374046 116.787493)
        (xy 118.33156 116.762964)
        (xy 118.299401 116.762964)
        (xy 118.256914 116.787493)
        (xy 118.103225 116.941182)
        (xy 118.078695 116.98367)
        (xy 118.078695 117.015829)
        (xy 117.474635 117.015829)
        (xy 117.474635 116.98367)
        (xy 117.450104 116.941182)
        (xy 117.296415 116.787493)
        (xy 117.253929 116.762964)
        (xy 117.22177 116.762964)
        (xy 117.179282 116.787494)
        (xy 117.025594 116.941182)
        (xy 117.001064 116.98367)
        (xy 117.001064 117.015829)
        (xy 116.397004 117.015829)
        (xy 116.397005 117.015828)
        (xy 116.397005 116.983671)
        (xy 116.372472 116.941181)
        (xy 116.218785 116.787493)
        (xy 116.176299 116.762964)
        (xy 116.144139 116.762964)
        (xy 116.101651 116.787494)
        (xy 115.947963 116.941182)
        (xy 115.923433 116.98367)
        (xy 115.923433 117.015829)
        (xy 114.241743 117.015829)
        (xy 114.241743 116.98367)
        (xy 114.217212 116.941182)
        (xy 114.063523 116.787493)
        (xy 114.021037 116.762964)
        (xy 113.988878 116.762964)
        (xy 113.946391 116.787493)
        (xy 113.792702 116.941182)
        (xy 113.768172 116.98367)
        (xy 113.768172 117.015829)
        (xy 113.164112 117.015829)
        (xy 113.164112 116.98367)
        (xy 113.139581 116.941182)
        (xy 112.985893 116.787493)
        (xy 112.943407 116.762964)
        (xy 112.911247 116.762964)
        (xy 112.868759 116.787494)
        (xy 112.715071 116.941182)
        (xy 112.690541 116.98367)
        (xy 112.690541 117.015829)
        (xy 112 117.015829)
        (xy 112 116.224149)
        (xy 112.399 116.224149)
        (xy 112.399 116.69772)
        (xy 112.404591 116.69772)
        (xy 112.447078 116.673189)
        (xy 112.600767 116.5195)
        (xy 112.625297 116.477014)
        (xy 113.229356 116.477014)
        (xy 113.253885 116.519499)
        (xy 113.407575 116.67319)
        (xy 113.450062 116.69772)
        (xy 113.482222 116.69772)
        (xy 113.524709 116.673189)
        (xy 113.678398 116.5195)
        (xy 113.702928 116.477014)
        (xy 113.702928 116.444854)
        (xy 113.678398 116.402368)
        (xy 113.524709 116.248679)
        (xy 113.482222 116.224149)
        (xy 113.450062 116.224149)
        (xy 113.407575 116.248678)
        (xy 113.253885 116.402369)
        (xy 113.229356 116.444854)
        (xy 113.229356 116.477014)
        (xy 112.625297 116.477014)
        (xy 112.625297 116.444854)
        (xy 112.600767 116.402368)
        (xy 112.447078 116.248679)
        (xy 112.404591 116.224149)
        (xy 112.399 116.224149)
        (xy 112 116.224149)
        (xy 112 115.938198)
        (xy 112.690541 115.938198)
        (xy 112.715071 115.980686)
        (xy 112.868759 116.134374)
        (xy 112.911247 116.158905)
        (xy 112.943407 116.158905)
        (xy 112.985893 116.134375)
        (xy 113.040268 116.08)
        (xy 114.12454 116.08)
        (xy 114.144326 116.268256)
        (xy 114.144327 116.268259)
        (xy 114.202818 116.448277)
        (xy 114.202821 116.448284)
        (xy 114.297467 116.612216)
        (xy 114.424129 116.752888)
        (xy 114.577265 116.864148)
        (xy 114.57727 116.864151)
        (xy 114.750192 116.941142)
        (xy 114.750197 116.941144)
        (xy 114.935354 116.9805)
        (xy 114.935355 116.9805)
        (xy 115.124644 116.9805)
        (xy 115.124646 116.9805)
        (xy 115.309803 116.941144)
        (xy 115.48273 116.864151)
        (xy 115.635871 116.752888)
        (xy 115.762533 116.612216)
        (xy 115.840592 116.477014)
        (xy 116.462249 116.477014)
        (xy 116.486778 116.5195)
        (xy 116.640467 116.67319)
        (xy 116.682954 116.69772)
        (xy 116.715114 116.69772)
        (xy 116.757601 116.673189)
        (xy 116.91129 116.5195)
        (xy 116.93582 116.477014)
        (xy 117.539879 116.477014)
        (xy 117.564408 116.5195)
        (xy 117.718097 116.673189)
        (xy 117.760585 116.69772)
        (xy 117.792745 116.69772)
        (xy 117.835232 116.673189)
        (xy 117.988921 116.5195)
        (xy 118.013451 116.477014)
        (xy 118.61751 116.477014)
        (xy 118.642039 116.5195)
        (xy 118.795728 116.673189)
        (xy 118.838216 116.69772)
        (xy 118.870376 116.69772)
        (xy 118.912862 116.67319)
        (xy 119.066551 116.5195)
        (xy 119.091081 116.477014)
        (xy 119.695141 116.477014)
        (xy 119.71967 116.5195)
        (xy 119.7265 116.52633)
        (xy 119.7265 116.395539)
        (xy 119.71967 116.402368)
        (xy 119.695141 116.444854)
        (xy 119.695141 116.477014)
        (xy 119.091081 116.477014)
        (xy 119.091081 116.444854)
        (xy 119.066551 116.402368)
        (xy 118.912862 116.248678)
        (xy 118.870376 116.224149)
        (xy 118.838216 116.224149)
        (xy 118.795728 116.248679)
        (xy 118.642039 116.402368)
        (xy 118.61751 116.444854)
        (xy 118.61751 116.477014)
        (xy 118.013451 116.477014)
        (xy 118.013451 116.444854)
        (xy 117.988921 116.402368)
        (xy 117.835232 116.248679)
        (xy 117.792745 116.224149)
        (xy 117.760585 116.224149)
        (xy 117.718097 116.248679)
        (xy 117.564408 116.402368)
        (xy 117.539879 116.444854)
        (xy 117.539879 116.477014)
        (xy 116.93582 116.477014)
        (xy 116.93582 116.444854)
        (xy 116.91129 116.402368)
        (xy 116.757601 116.248679)
        (xy 116.715114 116.224149)
        (xy 116.682954 116.224149)
        (xy 116.640467 116.248678)
        (xy 116.486778 116.402368)
        (xy 116.462249 116.444854)
        (xy 116.462249 116.477014)
        (xy 115.840592 116.477014)
        (xy 115.857179 116.448284)
        (xy 115.915674 116.268256)
        (xy 115.93546 116.08)
        (xy 115.915674 115.891744)
        (xy 115.857179 115.711716)
        (xy 115.844328 115.689457)
        (xy 116.136996 115.689457)
        (xy 116.178024 115.815728)
        (xy 116.178946 115.818839)
        (xy 116.180126 115.823241)
        (xy 116.180885 115.826403)
        (xy 116.184533 115.843569)
        (xy 116.185122 115.846749)
        (xy 116.185835 115.851247)
        (xy 116.186261 115.854476)
        (xy 116.20788 116.060181)
        (xy 116.208134 116.063394)
        (xy 116.208374 116.067943)
        (xy 116.20846 116.071212)
        (xy 116.20846 116.088788)
        (xy 116.208374 116.092057)
        (xy 116.208134 116.096606)
        (xy 116.20788 116.099819)
        (xy 116.203309 116.14331)
        (xy 116.218785 116.134375)
        (xy 116.372472 115.980687)
        (xy 116.397004 115.938198)
        (xy 117.001064 115.938198)
        (xy 117.025594 115.980686)
        (xy 117.179282 116.134374)
        (xy 117.22177 116.158905)
        (xy 117.253929 116.158905)
        (xy 117.296415 116.134375)
        (xy 117.450104 115.980686)
        (xy 117.474635 115.938198)
        (xy 118.078695 115.938198)
        (xy 118.103225 115.980686)
        (xy 118.256914 116.134375)
        (xy 118.299401 116.158905)
        (xy 118.33156 116.158905)
        (xy 118.374046 116.134375)
        (xy 118.527735 115.980686)
        (xy 118.552266 115.938198)
        (xy 118.552266 115.938197)
        (xy 119.156325 115.938197)
        (xy 119.180857 115.980687)
        (xy 119.334544 116.134375)
        (xy 119.377031 116.158905)
        (xy 119.409191 116.158905)
        (xy 119.451678 116.134374)
        (xy 119.605366 115.980686)
        (xy 119.629897 115.938198)
        (xy 119.629897 115.906039)
        (xy 119.605367 115.863552)
        (xy 119.451679 115.709865)
        (xy 119.409189 115.685333)
        (xy 119.377033 115.685333)
        (xy 119.334542 115.709865)
        (xy 119.180857 115.86355)
        (xy 119.156325 115.90604)
        (xy 119.156325 115.938197)
        (xy 118.552266 115.938197)
        (xy 118.552266 115.906039)
        (xy 118.527736 115.863552)
        (xy 118.374045 115.709862)
        (xy 118.33156 115.685333)
        (xy 118.299401 115.685333)
        (xy 118.256915 115.709862)
        (xy 118.103224 115.863552)
        (xy 118.078695 115.906039)
        (xy 118.078695 115.938198)
        (xy 117.474635 115.938198)
        (xy 117.474635 115.906039)
        (xy 117.450105 115.863552)
        (xy 117.296414 115.709862)
        (xy 117.253929 115.685333)
        (xy 117.221772 115.685333)
        (xy 117.179281 115.709865)
        (xy 117.025593 115.863552)
        (xy 117.001064 115.906039)
        (xy 117.001064 115.938198)
        (xy 116.397004 115.938198)
        (xy 116.397005 115.938197)
        (xy 116.397005 115.90604)
        (xy 116.372472 115.86355)
        (xy 116.218787 115.709865)
        (xy 116.176297 115.685333)
        (xy 116.144141 115.685333)
        (xy 116.136996 115.689457)
        (xy 115.844328 115.689457)
        (xy 115.762533 115.547784)
        (xy 115.635871 115.407112)
        (xy 115.625233 115.399383)
        (xy 116.462249 115.399383)
        (xy 116.486779 115.441871)
        (xy 116.640466 115.595558)
        (xy 116.682954 115.620089)
        (xy 116.715114 115.620089)
        (xy 116.757601 115.595558)
        (xy 116.91129 115.44187)
        (xy 116.93582 115.399383)
        (xy 117.539879 115.399383)
        (xy 117.564408 115.44187)
        (xy 117.718097 115.595558)
        (xy 117.760585 115.620089)
        (xy 117.792745 115.620089)
        (xy 117.835232 115.595558)
        (xy 117.988921 115.44187)
        (xy 118.013451 115.399383)
        (xy 118.61751 115.399383)
        (xy 118.642039 115.44187)
        (xy 118.795728 115.595558)
        (xy 118.838216 115.620089)
        (xy 118.870376 115.620089)
        (xy 118.912863 115.595558)
        (xy 119.06655 115.441871)
        (xy 119.091081 115.399383)
        (xy 119.695141 115.399383)
        (xy 119.71967 115.44187)
        (xy 119.7265 115.448699)
        (xy 119.7265 115.317908)
        (xy 119.719671 115.324736)
        (xy 119.695141 115.367224)
        (xy 119.695141 115.399383)
        (xy 119.091081 115.399383)
        (xy 119.091081 115.367224)
        (xy 119.06655 115.324736)
        (xy 118.912862 115.171047)
        (xy 118.870376 115.146518)
        (xy 118.838216 115.146518)
        (xy 118.795728 115.171048)
        (xy 118.64204 115.324736)
        (xy 118.61751 115.367224)
        (xy 118.61751 115.399383)
        (xy 118.013451 115.399383)
        (xy 118.013451 115.367224)
        (xy 117.98892 115.324736)
        (xy 117.835232 115.171048)
        (xy 117.792745 115.146518)
        (xy 117.760585 115.146518)
        (xy 117.718097 115.171048)
        (xy 117.564409 115.324736)
        (xy 117.539879 115.367224)
        (xy 117.539879 115.399383)
        (xy 116.93582 115.399383)
        (xy 116.93582 115.367224)
        (xy 116.911289 115.324736)
        (xy 116.757601 115.171048)
        (xy 116.715114 115.146518)
        (xy 116.682954 115.146518)
        (xy 116.640467 115.171047)
        (xy 116.486779 115.324736)
        (xy 116.462249 115.367224)
        (xy 116.462249 115.399383)
        (xy 115.625233 115.399383)
        (xy 115.625232 115.399382)
        (xy 115.482734 115.295851)
        (xy 115.482729 115.295848)
        (xy 115.309807 115.218857)
        (xy 115.309802 115.218855)
        (xy 115.164001 115.187865)
        (xy 115.124646 115.1795)
        (xy 114.935354 115.1795)
        (xy 114.902897 115.186398)
        (xy 114.750197 115.218855)
        (xy 114.750192 115.218857)
        (xy 114.57727 115.295848)
        (xy 114.577265 115.295851)
        (xy 114.424129 115.407111)
        (xy 114.297466 115.547785)
        (xy 114.202821 115.711715)
        (xy 114.202818 115.711722)
        (xy 114.153486 115.863552)
        (xy 114.144326 115.891744)
        (xy 114.12454 116.08)
        (xy 113.040268 116.08)
        (xy 113.139581 115.980686)
        (xy 113.164112 115.938198)
        (xy 113.768172 115.938198)
        (xy 113.792702 115.980686)
        (xy 113.854029 116.042013)
        (xy 113.873739 115.854476)
        (xy 113.874165 115.851247)
        (xy 113.874878 115.846749)
        (xy 113.875467 115.843569)
        (xy 113.879115 115.826403)
        (xy 113.879874 115.823241)
        (xy 113.881054 115.818839)
        (xy 113.881976 115.815728)
        (xy 113.901925 115.754329)
        (xy 113.792701 115.863552)
        (xy 113.768172 115.906039)
        (xy 113.768172 115.938198)
        (xy 113.164112 115.938198)
        (xy 113.164112 115.906039)
        (xy 113.139581 115.863551)
        (xy 112.985895 115.709865)
        (xy 112.943405 115.685333)
        (xy 112.911249 115.685333)
        (xy 112.868758 115.709865)
        (xy 112.71507 115.863552)
        (xy 112.690541 115.906039)
        (xy 112.690541 115.938198)
        (xy 112 115.938198)
        (xy 112 115.146518)
        (xy 112.399 115.146518)
        (xy 112.399 115.620089)
        (xy 112.404591 115.620089)
        (xy 112.447078 115.595558)
        (xy 112.600767 115.44187)
        (xy 112.625297 115.399383)
        (xy 112.625297 115.399382)
        (xy 113.229356 115.399382)
        (xy 113.253888 115.441872)
        (xy 113.407574 115.595558)
        (xy 113.450062 115.620089)
        (xy 113.482222 115.620089)
        (xy 113.524709 115.595558)
        (xy 113.678398 115.44187)
        (xy 113.702928 115.399383)
        (xy 113.702928 115.367224)
        (xy 113.678397 115.324736)
        (xy 113.524709 115.171048)
        (xy 113.482222 115.146518)
        (xy 113.450062 115.146518)
        (xy 113.407575 115.171047)
        (xy 113.253888 115.324735)
        (xy 113.229356 115.367225)
        (xy 113.229356 115.399382)
        (xy 112.625297 115.399382)
        (xy 112.625297 115.367224)
        (xy 112.600766 115.324736)
        (xy 112.447078 115.171048)
        (xy 112.404591 115.146518)
        (xy 112.399 115.146518)
        (xy 112 115.146518)
        (xy 112 114.860567)
        (xy 112.690541 114.860567)
        (xy 112.715071 114.903055)
        (xy 112.868759 115.056743)
        (xy 112.911247 115.081274)
        (xy 112.943407 115.081274)
        (xy 112.985893 115.056744)
        (xy 113.139581 114.903055)
        (xy 113.164112 114.860567)
        (xy 113.768172 114.860567)
        (xy 113.792702 114.903055)
        (xy 113.946391 115.056744)
        (xy 113.988878 115.081274)
        (xy 114.021037 115.081274)
        (xy 114.063523 115.056744)
        (xy 114.217212 114.903055)
        (xy 114.241743 114.860567)
        (xy 114.845803 114.860567)
        (xy 114.870331 114.903053)
        (xy 114.879542 114.912264)
        (xy 114.887175 114.910642)
        (xy 114.890357 114.910052)
        (xy 114.894857 114.909339)
        (xy 114.898086 114.908913)
        (xy 114.915536 114.90708)
        (xy 114.91875 114.906826)
        (xy 114.923299 114.906586)
        (xy 114.926566 114.9065)
        (xy 115.133434 114.9065)
        (xy 115.136701 114.906586)
        (xy 115.14125 114.906826)
        (xy 115.144464 114.90708)
        (xy 115.161914 114.908913)
        (xy 115.165143 114.909339)
        (xy 115.169643 114.910052)
        (xy 115.172826 114.910642)
        (xy 115.267196 114.930701)
        (xy 115.294845 114.903052)
        (xy 115.319374 114.860567)
        (xy 115.923433 114.860567)
        (xy 115.947963 114.903055)
        (xy 116.101651 115.056743)
        (xy 116.144139 115.081274)
        (xy 116.176299 115.081274)
        (xy 116.218785 115.056744)
        (xy 116.372472 114.903056)
        (xy 116.397004 114.860567)
        (xy 117.001064 114.860567)
        (xy 117.025594 114.903055)
        (xy 117.179282 115.056743)
        (xy 117.22177 115.081274)
        (xy 117.253929 115.081274)
        (xy 117.296415 115.056744)
        (xy 117.450104 114.903055)
        (xy 117.474635 114.860567)
        (xy 118.078695 114.860567)
        (xy 118.103225 114.903055)
        (xy 118.256914 115.056744)
        (xy 118.299401 115.081274)
        (xy 118.33156 115.081274)
        (xy 118.374046 115.056744)
        (xy 118.527735 114.903055)
        (xy 118.552266 114.860567)
        (xy 118.552266 114.860566)
        (xy 119.156325 114.860566)
        (xy 119.180857 114.903056)
        (xy 119.334544 115.056744)
        (xy 119.377031 115.081274)
        (xy 119.409191 115.081274)
        (xy 119.451678 115.056743)
        (xy 119.605366 114.903055)
        (xy 119.629897 114.860567)
        (xy 119.629897 114.828408)
        (xy 119.605367 114.785922)
        (xy 119.451678 114.632233)
        (xy 119.409191 114.607703)
        (xy 119.377031 114.607703)
        (xy 119.334544 114.632232)
        (xy 119.180854 114.785923)
        (xy 119.156325 114.828408)
        (xy 119.156325 114.860566)
        (xy 118.552266 114.860566)
        (xy 118.552266 114.828408)
        (xy 118.527736 114.785922)
        (xy 118.374046 114.632232)
        (xy 118.33156 114.607703)
        (xy 118.299401 114.607703)
        (xy 118.256914 114.632232)
        (xy 118.103224 114.785922)
        (xy 118.078695 114.828408)
        (xy 118.078695 114.860567)
        (xy 117.474635 114.860567)
        (xy 117.474635 114.828408)
        (xy 117.450105 114.785922)
        (xy 117.296415 114.632232)
        (xy 117.253929 114.607703)
        (xy 117.22177 114.607703)
        (xy 117.179282 114.632233)
        (xy 117.025593 114.785922)
        (xy 117.001064 114.828408)
        (xy 117.001064 114.860567)
        (xy 116.397004 114.860567)
        (xy 116.397005 114.860566)
        (xy 116.397005 114.828408)
        (xy 116.372475 114.785923)
        (xy 116.218785 114.632232)
        (xy 116.176299 114.607703)
        (xy 116.144139 114.607703)
        (xy 116.101651 114.632233)
        (xy 115.947962 114.785922)
        (xy 115.923433 114.828408)
        (xy 115.923433 114.860567)
        (xy 115.319374 114.860567)
        (xy 115.319374 114.828408)
        (xy 115.294844 114.785922)
        (xy 115.141155 114.632233)
        (xy 115.098668 114.607703)
        (xy 115.066508 114.607703)
        (xy 115.024021 114.632232)
        (xy 114.870332 114.785922)
        (xy 114.845803 114.828408)
        (xy 114.845803 114.860567)
        (xy 114.241743 114.860567)
        (xy 114.241743 114.828408)
        (xy 114.217213 114.785922)
        (xy 114.063523 114.632232)
        (xy 114.021037 114.607703)
        (xy 113.988878 114.607703)
        (xy 113.946391 114.632232)
        (xy 113.792701 114.785922)
        (xy 113.768172 114.828408)
        (xy 113.768172 114.860567)
        (xy 113.164112 114.860567)
        (xy 113.164112 114.828408)
        (xy 113.139582 114.785922)
        (xy 112.985893 114.632232)
        (xy 112.943407 114.607703)
        (xy 112.911247 114.607703)
        (xy 112.868759 114.632233)
        (xy 112.71507 114.785922)
        (xy 112.690541 114.828408)
        (xy 112.690541 114.860567)
        (xy 112 114.860567)
        (xy 112 114.399)
        (xy 112.399 114.399)
        (xy 112.399 114.542459)
        (xy 112.404591 114.542459)
        (xy 112.447078 114.517928)
        (xy 112.566007 114.399)
        (xy 113.288647 114.399)
        (xy 113.407575 114.517929)
        (xy 113.450062 114.542459)
        (xy 113.482222 114.542459)
        (xy 113.524709 114.517928)
        (xy 113.643638 114.399)
        (xy 114.366277 114.399)
        (xy 114.485205 114.517928)
        (xy 114.527693 114.542459)
        (xy 114.559853 114.542459)
        (xy 114.602339 114.517929)
        (xy 114.721268 114.399)
        (xy 115.443908 114.399)
        (xy 115.562837 114.517929)
        (xy 115.605324 114.542459)
        (xy 115.637483 114.542459)
        (xy 115.679969 114.517929)
        (xy 115.798899 114.399)
        (xy 116.521539 114.399)
        (xy 116.640467 114.517929)
        (xy 116.682954 114.542459)
        (xy 116.715114 114.542459)
        (xy 116.757601 114.517928)
        (xy 116.87653 114.399)
        (xy 117.599169 114.399)
        (xy 117.718097 114.517928)
        (xy 117.760585 114.542459)
        (xy 117.792745 114.542459)
        (xy 117.835232 114.517928)
        (xy 117.954161 114.399)
        (xy 118.6768 114.399)
        (xy 118.795728 114.517928)
        (xy 118.838216 114.542459)
        (xy 118.870376 114.542459)
        (xy 118.912862 114.517929)
        (xy 119.031791 114.399)
        (xy 118.6768 114.399)
        (xy 117.954161 114.399)
        (xy 117.599169 114.399)
        (xy 116.87653 114.399)
        (xy 116.521539 114.399)
        (xy 115.798899 114.399)
        (xy 115.443908 114.399)
        (xy 114.721268 114.399)
        (xy 114.366277 114.399)
        (xy 113.643638 114.399)
        (xy 113.288647 114.399)
        (xy 112.566007 114.399)
        (xy 112.399 114.399)
        (xy 112 114.399)
        (xy 112 114.124)
        (xy 112.019685 114.056961)
        (xy 112.072489 114.011206)
        (xy 112.124 114)
        (xy 119.8755 114)
      )
    )
  )
)
