<svg xmlns="http://www.w3.org/2000/svg" xmlns:xlink="http://www.w3.org/1999/xlink" width="100" height="100" viewBox="0 0 100 100">
    <defs>
        <circle id="b" cx="32" cy="32" r="32"/>
        <filter id="a" width="185.9%" height="185.9%" x="-43%" y="-41.4%" filterUnits="objectBoundingBox">
            <feOffset dy="1" in="SourceAlpha" result="shadowOffsetOuter1"/>
            <feGaussianBlur in="shadowOffsetOuter1" result="shadowBlurOuter1" stdDeviation="9"/>
            <feColorMatrix in="shadowBlurOuter1" values="0 0 0 0 0 0 0 0 0 0 0 0 0 0 0 0 0 0 0.25 0"/>
        </filter>
    </defs>
    <g fill="none" fill-rule="evenodd">
        <g transform="translate(18 17)">
            <use fill="#000" filter="url(#a)" xlink:href="#b"/>
            <use fill="#E2E7ED" xlink:href="#b"/>
        </g>
        <path fill="#323F56" fill-rule="nonzero" d="M60.485 43.597a1.112 1.112 0 0 1 0 1.587 1.12 1.12 0 0 1-1.571 0l-8.047-8.047V63.69c0 .619-.492 1.127-1.111 1.127a1.131 1.131 0 0 1-1.127-1.127V37.137l-8.032 8.047c-.444.429-1.16.429-1.587 0a1.112 1.112 0 0 1 0-1.587l9.952-9.952a1.12 1.12 0 0 1 1.57 0l9.953 9.952z"/>
    </g>
</svg>
