Using pre-set license
Built from '2021.3/staging' branch; Version is '2021.3.15f1 (e8e88683f834) revision 15263878'; Using compiler version '192829333'; Build Type 'Release'
OS: 'Windows 11  (10.0.22621) 64bit Core' Language: 'es' Physical Memory: 32469 MB
BatchMode: 1, IsHumanControllingUs: 0, StartBugReporterOnCrash: 0, Is64bit: 1, IsPro: 1

COMMAND LINE ARGUMENTS:
C:\Program Files\Unity\Hub\Editor\2021.3.15f1\Editor\Unity.exe
-adb2
-batchMode
-noUpm
-name
AssetImportWorker4
-projectPath
C:/Repositorios/Cornell box
-logFile
Logs/AssetImportWorker4.log
-srvPort
55242
Successfully changed project path to: C:/Repositorios/Cornell box
C:/Repositorios/Cornell box
[UnityMemory] Configuration Parameters - Can be set up in boot.config
    "memorysetup-bucket-allocator-granularity=16"
    "memorysetup-bucket-allocator-bucket-count=8"
    "memorysetup-bucket-allocator-block-size=33554432"
    "memorysetup-bucket-allocator-block-count=8"
    "memorysetup-main-allocator-block-size=16777216"
    "memorysetup-thread-allocator-block-size=16777216"
    "memorysetup-gfx-main-allocator-block-size=16777216"
    "memorysetup-gfx-thread-allocator-block-size=16777216"
    "memorysetup-cache-allocator-block-size=4194304"
    "memorysetup-typetree-allocator-block-size=2097152"
    "memorysetup-profiler-bucket-allocator-granularity=16"
    "memorysetup-profiler-bucket-allocator-bucket-count=8"
    "memorysetup-profiler-bucket-allocator-block-size=33554432"
    "memorysetup-profiler-bucket-allocator-block-count=8"
    "memorysetup-profiler-allocator-block-size=16777216"
    "memorysetup-profiler-editor-allocator-block-size=1048576"
    "memorysetup-temp-allocator-size-main=16777216"
    "memorysetup-job-temp-allocator-block-size=2097152"
    "memorysetup-job-temp-allocator-block-size-background=1048576"
    "memorysetup-job-temp-allocator-reduction-small-platforms=262144"
    "memorysetup-temp-allocator-size-background-worker=32768"
    "memorysetup-temp-allocator-size-job-worker=262144"
    "memorysetup-temp-allocator-size-preload-manager=33554432"
    "memorysetup-temp-allocator-size-nav-mesh-worker=65536"
    "memorysetup-temp-allocator-size-audio-worker=65536"
    "memorysetup-temp-allocator-size-cloud-worker=32768"
    "memorysetup-temp-allocator-size-gi-baking-worker=262144"
    "memorysetup-temp-allocator-size-gfx=262144"
Player connection [27448] Host "[IP] 192.168.0.32 [Port] 0 [Flags] 2 [Guid] 1531105453 [EditorId] 1531105453 [Version] 1048832 [Id] WindowsEditor(7,DESKTOP-2FVUK6H) [Debug] 1 [PackageName] WindowsEditor [ProjectName] Editor" joined multi-casting on [225.0.0.222:54997]...

Player connection [27448] Host "[IP] 192.168.0.32 [Port] 0 [Flags] 2 [Guid] 1531105453 [EditorId] 1531105453 [Version] 1048832 [Id] WindowsEditor(7,DESKTOP-2FVUK6H) [Debug] 1 [PackageName] WindowsEditor [ProjectName] Editor" joined alternative multi-casting on [225.0.0.222:34997]...

Refreshing native plugins compatible for Editor in 102.50 ms, found 3 plugins.
Preloading 0 native plugins for Editor in 0.00 ms.
Initialize engine version: 2021.3.15f1 (e8e88683f834)
[Subsystems] Discovering subsystems at path C:/Program Files/Unity/Hub/Editor/2021.3.15f1/Editor/Data/Resources/UnitySubsystems
[Subsystems] Discovering subsystems at path C:/Repositorios/Cornell box/Assets
GfxDevice: creating device client; threaded=0; jobified=0
Direct3D:
    Version:  Direct3D 11.0 [level 11.1]
    Renderer: NVIDIA GeForce RTX 3070 Laptop GPU (ID=0x249d)
    Vendor:   NVIDIA
    VRAM:     8033 MB
    Driver:   31.0.15.3129
Initialize mono
Mono path[0] = 'C:/Program Files/Unity/Hub/Editor/2021.3.15f1/Editor/Data/Managed'
Mono path[1] = 'C:/Program Files/Unity/Hub/Editor/2021.3.15f1/Editor/Data/MonoBleedingEdge/lib/mono/unityjit-win32'
Mono config path = 'C:/Program Files/Unity/Hub/Editor/2021.3.15f1/Editor/Data/MonoBleedingEdge/etc'
Using monoOptions --debugger-agent=transport=dt_socket,embedding=1,server=y,suspend=n,address=127.0.0.1:56528
Begin MonoManager ReloadAssembly
Registering precompiled unity dll's ...
Register platform support module: C:/Program Files/Unity/Hub/Editor/2021.3.15f1/Editor/Data/PlaybackEngines/WindowsStandaloneSupport/UnityEditor.WindowsStandalone.Extensions.dll
Registered in 0.004570 seconds.
Native extension for WindowsStandalone target not found
Refreshing native plugins compatible for Editor in 95.99 ms, found 3 plugins.
Preloading 0 native plugins for Editor in 0.00 ms.
Mono: successfully reloaded assembly
- Completed reload, in  0.615 seconds
Domain Reload Profiling:
	ReloadAssembly (615ms)
		BeginReloadAssembly (63ms)
			ExecutionOrderSort (0ms)
			DisableScriptedObjects (0ms)
			BackupInstance (0ms)
			ReleaseScriptingObjects (0ms)
			CreateAndSetChildDomain (1ms)
		EndReloadAssembly (451ms)
			LoadAssemblies (61ms)
			RebuildTransferFunctionScriptingTraits (0ms)
			SetupTypeCache (103ms)
			ReleaseScriptCaches (0ms)
			RebuildScriptCaches (26ms)
			SetupLoadedEditorAssemblies (276ms)
				LogAssemblyErrors (0ms)
				InitializePlatformSupportModulesInManaged (6ms)
				SetLoadedEditorAssemblies (0ms)
				RefreshPlugins (96ms)
				BeforeProcessingInitializeOnLoad (1ms)
				ProcessInitializeOnLoadAttributes (135ms)
				ProcessInitializeOnLoadMethodAttributes (37ms)
				AfterProcessingInitializeOnLoad (0ms)
				EditorAssembliesLoaded (0ms)
			ExecutionOrderSort2 (0ms)
			AwakeInstancesAfterBackupRestoration (0ms)
Platform modules already initialized, skipping
Registering precompiled user dll's ...
Registered in 0.005356 seconds.
Begin MonoManager ReloadAssembly
Symbol file LoadedFromMemory doesn't match image C:\Repositorios\Cornell box\Library\PackageCache\com.unity.visualscripting@1.7.8\Editor\VisualScripting.Core\Dependencies\YamlDotNet\Unity.VisualScripting.YamlDotNet.dll
Symbol file LoadedFromMemory doesn't match image C:\Repositorios\Cornell box\Library\PackageCache\com.unity.visualscripting@1.7.8\Editor\VisualScripting.Core\Dependencies\DotNetZip\Unity.VisualScripting.IonicZip.dll
Native extension for WindowsStandalone target not found
Refreshing native plugins compatible for Editor in 101.71 ms, found 3 plugins.
Preloading 0 native plugins for Editor in 0.00 ms.
Mono: successfully reloaded assembly
- Completed reload, in  1.228 seconds
Domain Reload Profiling:
	ReloadAssembly (1229ms)
		BeginReloadAssembly (100ms)
			ExecutionOrderSort (0ms)
			DisableScriptedObjects (5ms)
			BackupInstance (0ms)
			ReleaseScriptingObjects (0ms)
			CreateAndSetChildDomain (19ms)
		EndReloadAssembly (1020ms)
			LoadAssemblies (76ms)
			RebuildTransferFunctionScriptingTraits (0ms)
			SetupTypeCache (294ms)
			ReleaseScriptCaches (1ms)
			RebuildScriptCaches (61ms)
			SetupLoadedEditorAssemblies (549ms)
				LogAssemblyErrors (0ms)
				InitializePlatformSupportModulesInManaged (5ms)
				SetLoadedEditorAssemblies (0ms)
				RefreshPlugins (102ms)
				BeforeProcessingInitializeOnLoad (101ms)
				ProcessInitializeOnLoadAttributes (252ms)
				ProcessInitializeOnLoadMethodAttributes (84ms)
				AfterProcessingInitializeOnLoad (4ms)
				EditorAssembliesLoaded (0ms)
			ExecutionOrderSort2 (0ms)
			AwakeInstancesAfterBackupRestoration (6ms)
Platform modules already initialized, skipping
========================================================================
Worker process is ready to serve import requests
Launched and connected shader compiler UnityShaderCompiler.exe after 0.04 seconds
Refreshing native plugins compatible for Editor in 1.23 ms, found 3 plugins.
Preloading 0 native plugins for Editor in 0.00 ms.
Unloading 5022 Unused Serialized files (Serialized files now loaded: 0)
Unloading 45 unused Assets / (1.1 MB). Loaded Objects now: 5462.
Memory consumption went from 198.5 MB to 197.3 MB.
Total: 3.948500 ms (FindLiveObjects: 0.487500 ms CreateObjectMapping: 0.235100 ms MarkObjects: 2.797900 ms  DeleteObjects: 0.426900 ms)

AssetImportParameters requested are different than current active one (requested -> active):
  custom:video-decoder-ogg-theora: a1e56fd34408186e4bbccfd4996cb3dc -> 
  custom:container-muxer-webm: aa71ff27fc2769a1b78a27578f13a17b -> 
  custom:container-demuxer-webm: 4f35f7cbe854078d1ac9338744f61a02 -> 
  custom:video-encoder-webm-vp8: eb34c28f22e8b96e1ab97ce403110664 -> 
  custom:audio-encoder-webm-vorbis: bf7c407c2cedff20999df2af8eb42d56 -> 
  custom:framework-win-MediaFoundation: 216162199b28c13a410421893ffa2e32 -> 
  custom:container-demuxer-ogg: 62fdf1f143b41e24485cea50d1cbac27 -> 
  custom:video-decoder-webm-vp8: 9c59270c3fd7afecdb556c50c9e8de78 -> 
  custom:audio-decoder-ogg-vorbis: bf7c407c2cedff20999df2af8eb42d56 -> 
========================================================================
Received Import Request.
  Time since last request: 185321.330892 seconds.
  path: Assets/ScriptableRenderPasses/BlurryRefractions/BlurMat.mat
  artifactKey: Guid(3de48661fa991a345935aedeb880bd18) Importer(815301076,1909f56bfc062723c751e8b465ee728b)
Start importing Assets/ScriptableRenderPasses/BlurryRefractions/BlurMat.mat using Guid(3de48661fa991a345935aedeb880bd18) Importer(815301076,1909f56bfc062723c751e8b465ee728b)  -> (artifact id: 'f6885a729164fc373af55aa3e073e794') in 0.263695 seconds 
========================================================================
Received Import Request.
  Time since last request: 0.000036 seconds.
  path: Assets/ExampleAssets/Spiderbot/Animations/Materials/Bug_Red_d.mat
  artifactKey: Guid(87a8c2a70f6e71746b390706e4e752dc) Importer(815301076,1909f56bfc062723c751e8b465ee728b)
Start importing Assets/ExampleAssets/Spiderbot/Animations/Materials/Bug_Red_d.mat using Guid(87a8c2a70f6e71746b390706e4e752dc) Importer(815301076,1909f56bfc062723c751e8b465ee728b)  -> (artifact id: 'ef2b650a405bdc2f89a8dc143e0599d4') in 1.018580 seconds 
========================================================================
Received Import Request.
  Time since last request: 5.028064 seconds.
  path: Assets/RenderPipeline/LightweightRenderPipelineAsset.asset
  artifactKey: Guid(a378d70e1ec48454c832844631815c50) Importer(815301076,1909f56bfc062723c751e8b465ee728b)
Start importing Assets/RenderPipeline/LightweightRenderPipelineAsset.asset using Guid(a378d70e1ec48454c832844631815c50) Importer(815301076,1909f56bfc062723c751e8b465ee728b)  -> (artifact id: '830a70e0583ad417184f22f737111a0d') in 0.007088 seconds 
========================================================================
Received Import Request.
  Time since last request: 24.146647 seconds.
  path: Assets/NewShaderVariants.shadervariants
  artifactKey: Guid(16631a9803d1dbd409ca355bea57c98b) Importer(815301076,1909f56bfc062723c751e8b465ee728b)
Start importing Assets/NewShaderVariants.shadervariants using Guid(16631a9803d1dbd409ca355bea57c98b) Importer(815301076,1909f56bfc062723c751e8b465ee728b)  -> (artifact id: '22a9e1d0e413e6628ca0ab44bdb5455d') in 0.003653 seconds 
========================================================================
Received Import Request.
  Time since last request: 205.860954 seconds.
  path: Assets
  artifactKey: Guid(00000000000000001000000000000000) Importer(815301076,1909f56bfc062723c751e8b465ee728b)
Start importing Assets using Guid(00000000000000001000000000000000) Importer(815301076,1909f56bfc062723c751e8b465ee728b)  -> (artifact id: '79842766b460edbeab6a34051e857a80') in 0.001259 seconds 
========================================================================
Received Import Request.
  Time since last request: 5.700225 seconds.
  path: Assets/cosas
  artifactKey: Guid(d91e0012e96ad6e4283fe887654de685) Importer(815301076,1909f56bfc062723c751e8b465ee728b)
Start importing Assets/cosas using Guid(d91e0012e96ad6e4283fe887654de685) Importer(815301076,1909f56bfc062723c751e8b465ee728b)  -> (artifact id: '0937180c26e8df08ec8d3e606e33fdea') in 0.001676 seconds 
========================================================================
Received Import Request.
  Time since last request: 2.392567 seconds.
  path: Assets/_DemoScenes
  artifactKey: Guid(963fa247ad016274280a263065cda807) Importer(815301076,1909f56bfc062723c751e8b465ee728b)
Start importing Assets/_DemoScenes using Guid(963fa247ad016274280a263065cda807) Importer(815301076,1909f56bfc062723c751e8b465ee728b)  -> (artifact id: '4b076e1597a9abebd1189a9fe345a0bd') in 0.001190 seconds 
========================================================================
Received Import Request.
  Time since last request: 3.621091 seconds.
  path: Assets/ExampleAssets
  artifactKey: Guid(7ebfb19a715acee489216a934d185477) Importer(815301076,1909f56bfc062723c751e8b465ee728b)
Start importing Assets/ExampleAssets using Guid(7ebfb19a715acee489216a934d185477) Importer(815301076,1909f56bfc062723c751e8b465ee728b)  -> (artifact id: 'abce85d4198781872fa216a01999ff4f') in 0.001084 seconds 
========================================================================
Received Import Request.
  Time since last request: 1.441986 seconds.
  path: Assets/RenderPipeline
  artifactKey: Guid(8c3b078626dd92a42bbda100233a1cd6) Importer(815301076,1909f56bfc062723c751e8b465ee728b)
Start importing Assets/RenderPipeline using Guid(8c3b078626dd92a42bbda100233a1cd6) Importer(815301076,1909f56bfc062723c751e8b465ee728b)  -> (artifact id: 'bf46af2f10ed99c25995696b8ba9cdf5') in 0.001281 seconds 
========================================================================
Received Import Request.
  Time since last request: 2.232598 seconds.
  path: Assets/Settings
  artifactKey: Guid(709f11a7f3c4041caa4ef136ea32d874) Importer(815301076,1909f56bfc062723c751e8b465ee728b)
Start importing Assets/Settings using Guid(709f11a7f3c4041caa4ef136ea32d874) Importer(815301076,1909f56bfc062723c751e8b465ee728b)  -> (artifact id: 'dfaa9b38051423c63420310940c3f677') in 0.001275 seconds 
========================================================================
Received Prepare
Registering precompiled user dll's ...
Registered in 0.004550 seconds.
Begin MonoManager ReloadAssembly
Symbol file LoadedFromMemory doesn't match image C:\Repositorios\Cornell box\Library\PackageCache\com.unity.visualscripting@1.7.8\Editor\VisualScripting.Core\Dependencies\YamlDotNet\Unity.VisualScripting.YamlDotNet.dll
Symbol file LoadedFromMemory doesn't match image C:\Repositorios\Cornell box\Library\PackageCache\com.unity.visualscripting@1.7.8\Editor\VisualScripting.Core\Dependencies\DotNetZip\Unity.VisualScripting.IonicZip.dll
Native extension for WindowsStandalone target not found
Refreshing native plugins compatible for Editor in 0.68 ms, found 3 plugins.
Preloading 0 native plugins for Editor in 0.00 ms.
Mono: successfully reloaded assembly
- Completed reload, in  0.954 seconds
Domain Reload Profiling:
	ReloadAssembly (955ms)
		BeginReloadAssembly (123ms)
			ExecutionOrderSort (0ms)
			DisableScriptedObjects (7ms)
			BackupInstance (0ms)
			ReleaseScriptingObjects (0ms)
			CreateAndSetChildDomain (41ms)
		EndReloadAssembly (745ms)
			LoadAssemblies (69ms)
			RebuildTransferFunctionScriptingTraits (0ms)
			SetupTypeCache (239ms)
			ReleaseScriptCaches (2ms)
			RebuildScriptCaches (36ms)
			SetupLoadedEditorAssemblies (322ms)
				LogAssemblyErrors (0ms)
				InitializePlatformSupportModulesInManaged (9ms)
				SetLoadedEditorAssemblies (0ms)
				RefreshPlugins (1ms)
				BeforeProcessingInitializeOnLoad (67ms)
				ProcessInitializeOnLoadAttributes (176ms)
				ProcessInitializeOnLoadMethodAttributes (64ms)
				AfterProcessingInitializeOnLoad (5ms)
				EditorAssembliesLoaded (0ms)
			ExecutionOrderSort2 (0ms)
			AwakeInstancesAfterBackupRestoration (19ms)
Platform modules already initialized, skipping
Refreshing native plugins compatible for Editor in 1.65 ms, found 3 plugins.
Preloading 0 native plugins for Editor in 0.00 ms.
Unloading 4902 Unused Serialized files (Serialized files now loaded: 0)
Unloading 37 unused Assets / (1.1 MB). Loaded Objects now: 5562.
Memory consumption went from 197.1 MB to 196.0 MB.
Total: 3.469600 ms (FindLiveObjects: 0.304200 ms CreateObjectMapping: 0.166300 ms MarkObjects: 2.555300 ms  DeleteObjects: 0.442400 ms)

AssetImportParameters requested are different than current active one (requested -> active):
  custom:video-decoder-ogg-theora: a1e56fd34408186e4bbccfd4996cb3dc -> 
  custom:container-muxer-webm: aa71ff27fc2769a1b78a27578f13a17b -> 
  custom:container-demuxer-webm: 4f35f7cbe854078d1ac9338744f61a02 -> 
  custom:video-encoder-webm-vp8: eb34c28f22e8b96e1ab97ce403110664 -> 
  custom:audio-encoder-webm-vorbis: bf7c407c2cedff20999df2af8eb42d56 -> 
  custom:framework-win-MediaFoundation: 216162199b28c13a410421893ffa2e32 -> 
  custom:container-demuxer-ogg: 62fdf1f143b41e24485cea50d1cbac27 -> 
  custom:video-decoder-webm-vp8: 9c59270c3fd7afecdb556c50c9e8de78 -> 
  custom:audio-decoder-ogg-vorbis: bf7c407c2cedff20999df2af8eb42d56 -> 
========================================================================
Received Import Request.
  Time since last request: 605.665736 seconds.
  path: Assets/cosas/_DemoScenes/DemoScene_BlurryRefractions.unity
  artifactKey: Guid(85ff7513f02ecdd41ba0ff01934db709) Importer(815301076,1909f56bfc062723c751e8b465ee728b)
Start importing Assets/cosas/_DemoScenes/DemoScene_BlurryRefractions.unity using Guid(85ff7513f02ecdd41ba0ff01934db709) Importer(815301076,1909f56bfc062723c751e8b465ee728b)  -> (artifact id: '06defe4ba49afbdfb23b1a5bbcb9e66a') in 0.012646 seconds 
========================================================================
Received Import Request.
  Time since last request: 2.526471 seconds.
  path: Assets/Scenes
  artifactKey: Guid(9c53962885c2c4f449125a979d6ad240) Importer(815301076,1909f56bfc062723c751e8b465ee728b)
Start importing Assets/Scenes using Guid(9c53962885c2c4f449125a979d6ad240) Importer(815301076,1909f56bfc062723c751e8b465ee728b)  -> (artifact id: '7f1480ff4af096e12daf936c2b57b168') in 0.001237 seconds 
========================================================================
Received Import Request.
  Time since last request: 0.948624 seconds.
  path: Assets/Scenes/SampleScene.unity
  artifactKey: Guid(99c9720ab356a0642a771bea13969a05) Importer(815301076,1909f56bfc062723c751e8b465ee728b)
Start importing Assets/Scenes/SampleScene.unity using Guid(99c9720ab356a0642a771bea13969a05) Importer(815301076,1909f56bfc062723c751e8b465ee728b)  -> (artifact id: '020b4502e5274b87e275395b5f4b21e2') in 0.001719 seconds 
========================================================================
Received Import Request.
  Time since last request: 42.122586 seconds.
  path: Assets/prefabs
  artifactKey: Guid(4b85d5481d20794489e1f86de57fb069) Importer(815301076,1909f56bfc062723c751e8b465ee728b)
Start importing Assets/prefabs using Guid(4b85d5481d20794489e1f86de57fb069) Importer(815301076,1909f56bfc062723c751e8b465ee728b)  -> (artifact id: 'f29e385aa78b355d4f3b450eb2cd7439') in 0.001368 seconds 
========================================================================
Received Import Request.
  Time since last request: 6.423148 seconds.
  path: Assets/prefabs/Cube (1).prefab
  artifactKey: Guid(4b026ed58422ef8478fee888f7a72a0c) Importer(815301076,1909f56bfc062723c751e8b465ee728b)
Start importing Assets/prefabs/Cube (1).prefab using Guid(4b026ed58422ef8478fee888f7a72a0c) Importer(815301076,1909f56bfc062723c751e8b465ee728b)  -> (artifact id: '36267f84da6a5f73aaa7fe7d4f98de98') in 0.180068 seconds 
========================================================================
Received Import Request.
  Time since last request: 0.000035 seconds.
  path: Assets/prefabs/Cube (3).prefab
  artifactKey: Guid(c75db1ca57d54274d80232c9a2a5bdb2) Importer(815301076,1909f56bfc062723c751e8b465ee728b)
Start importing Assets/prefabs/Cube (3).prefab using Guid(c75db1ca57d54274d80232c9a2a5bdb2) Importer(815301076,1909f56bfc062723c751e8b465ee728b)  -> (artifact id: '2593ed959140468770f27386b9d72955') in 0.021917 seconds 
========================================================================
Received Import Request.
  Time since last request: 0.000039 seconds.
  path: Assets/prefabs/Cube (5).prefab
  artifactKey: Guid(8e1a79d2058b0ea4a90ce87de06339bf) Importer(815301076,1909f56bfc062723c751e8b465ee728b)
Start importing Assets/prefabs/Cube (5).prefab using Guid(8e1a79d2058b0ea4a90ce87de06339bf) Importer(815301076,1909f56bfc062723c751e8b465ee728b)  -> (artifact id: '3ddf59cac2a5044bc8c6de03b8d0dc8a') in 0.023770 seconds 
========================================================================
Received Import Request.
  Time since last request: 0.000028 seconds.
  path: Assets/prefabs/Cube.prefab
  artifactKey: Guid(4b17bb6f59a933f4cbf15b12b3897899) Importer(815301076,1909f56bfc062723c751e8b465ee728b)
Start importing Assets/prefabs/Cube.prefab using Guid(4b17bb6f59a933f4cbf15b12b3897899) Importer(815301076,1909f56bfc062723c751e8b465ee728b)  -> (artifact id: '312653992307fb643149e82f69dd3ba5') in 0.021769 seconds 
========================================================================
Received Import Request.
  Time since last request: 0.000023 seconds.
  path: Assets/prefabs/Cube (4).prefab
  artifactKey: Guid(695926d7ab89d244399e289b34173458) Importer(815301076,1909f56bfc062723c751e8b465ee728b)
Start importing Assets/prefabs/Cube (4).prefab using Guid(695926d7ab89d244399e289b34173458) Importer(815301076,1909f56bfc062723c751e8b465ee728b)  -> (artifact id: '98856a80a3335ca3c20d635319be5aa6') in 0.016572 seconds 
========================================================================
Received Import Request.
  Time since last request: 29.258281 seconds.
  path: Assets/prefabs/Cornell_Box.prefab
  artifactKey: Guid(bfe8752e31498034aab35c214917e339) Importer(815301076,1909f56bfc062723c751e8b465ee728b)
Start importing Assets/prefabs/Cornell_Box.prefab using Guid(bfe8752e31498034aab35c214917e339) Importer(815301076,1909f56bfc062723c751e8b465ee728b)  -> (artifact id: '1aef092260178a11a77f9d59cd5539c4') in 0.016812 seconds 
========================================================================
Received Import Request.
  Time since last request: 41.520987 seconds.
  path: Assets/Materials
  artifactKey: Guid(b810467f4c8f13a4cb45fd225687c43a) Importer(815301076,1909f56bfc062723c751e8b465ee728b)
Start importing Assets/Materials using Guid(b810467f4c8f13a4cb45fd225687c43a) Importer(815301076,1909f56bfc062723c751e8b465ee728b)  -> (artifact id: '29dfca7ca98040811f4c408e5b35b948') in 0.001335 seconds 
========================================================================
Received Import Request.
  Time since last request: 25.760672 seconds.
  path: Assets/Materials/New Material.mat
  artifactKey: Guid(0722c1bf7769062438e8340698a25f3d) Importer(815301076,1909f56bfc062723c751e8b465ee728b)
Start importing Assets/Materials/New Material.mat using Guid(0722c1bf7769062438e8340698a25f3d) Importer(815301076,1909f56bfc062723c751e8b465ee728b)  -> (artifact id: '4e5c7928f27d8e70bf14608250288663') in 0.017674 seconds 
========================================================================
Received Import Request.
  Time since last request: 0.077412 seconds.
  path: Assets/Materials/New Material.mat
  artifactKey: Guid(0722c1bf7769062438e8340698a25f3d) Importer(815301076,1909f56bfc062723c751e8b465ee728b)
Start importing Assets/Materials/New Material.mat using Guid(0722c1bf7769062438e8340698a25f3d) Importer(815301076,1909f56bfc062723c751e8b465ee728b)  -> (artifact id: '7b1bb0a9c2d82559ba4ea8705dacafc5') in 0.015952 seconds 
========================================================================
Received Import Request.
  Time since last request: 38.486958 seconds.
  path: Assets/Materials/New Material 1.mat
  artifactKey: Guid(5bd8914997075c045af4c92a76d2f67c) Importer(815301076,1909f56bfc062723c751e8b465ee728b)
Start importing Assets/Materials/New Material 1.mat using Guid(5bd8914997075c045af4c92a76d2f67c) Importer(815301076,1909f56bfc062723c751e8b465ee728b)  -> (artifact id: '2b6f1327e8c39ea2dabec8a6b834d039') in 0.008914 seconds 
========================================================================
Received Import Request.
  Time since last request: 7.226771 seconds.
  path: Assets/Materials/red.mat
  artifactKey: Guid(5bd8914997075c045af4c92a76d2f67c) Importer(815301076,1909f56bfc062723c751e8b465ee728b)
Start importing Assets/Materials/red.mat using Guid(5bd8914997075c045af4c92a76d2f67c) Importer(815301076,1909f56bfc062723c751e8b465ee728b)  -> (artifact id: '66464f564e0cb0b8839718bbb47b0f33') in 0.006634 seconds 
========================================================================
Received Import Request.
  Time since last request: 5.819520 seconds.
  path: Assets/Materials/blue.mat
  artifactKey: Guid(0722c1bf7769062438e8340698a25f3d) Importer(815301076,1909f56bfc062723c751e8b465ee728b)
Start importing Assets/Materials/blue.mat using Guid(0722c1bf7769062438e8340698a25f3d) Importer(815301076,1909f56bfc062723c751e8b465ee728b)  -> (artifact id: 'e8bced1b7d30e21ce0c0180d4dfcce63') in 0.007676 seconds 
========================================================================
Received Import Request.
  Time since last request: 11.633824 seconds.
  path: Assets/Materials/blue.mat
  artifactKey: Guid(0722c1bf7769062438e8340698a25f3d) Importer(815301076,1909f56bfc062723c751e8b465ee728b)
Start importing Assets/Materials/blue.mat using Guid(0722c1bf7769062438e8340698a25f3d) Importer(815301076,1909f56bfc062723c751e8b465ee728b)  -> (artifact id: '6bc66a0f5653640a45370233493343eb') in 0.019094 seconds 
========================================================================
Received Import Request.
  Time since last request: 4.708375 seconds.
  path: Assets/Materials/green.mat
  artifactKey: Guid(72c370f1b906cb945a8ea6a8caaff638) Importer(815301076,1909f56bfc062723c751e8b465ee728b)
Start importing Assets/Materials/green.mat using Guid(72c370f1b906cb945a8ea6a8caaff638) Importer(815301076,1909f56bfc062723c751e8b465ee728b)  -> (artifact id: '8210969cb4e871edefb4e26fed501030') in 0.008511 seconds 
========================================================================
Received Import Request.
  Time since last request: 23.182008 seconds.
  path: Assets/Materials/green.mat
  artifactKey: Guid(72c370f1b906cb945a8ea6a8caaff638) Importer(815301076,1909f56bfc062723c751e8b465ee728b)
Start importing Assets/Materials/green.mat using Guid(72c370f1b906cb945a8ea6a8caaff638) Importer(815301076,1909f56bfc062723c751e8b465ee728b)  -> (artifact id: 'f8df7d25c6f7e7ded21b49dde87a07e3') in 0.008904 seconds 
========================================================================
Received Import Request.
  Time since last request: 8.087358 seconds.
  path: Assets/Materials/white.mat
  artifactKey: Guid(ccde7fa72a0bc464894bb946c9673a78) Importer(815301076,1909f56bfc062723c751e8b465ee728b)
Start importing Assets/Materials/white.mat using Guid(ccde7fa72a0bc464894bb946c9673a78) Importer(815301076,1909f56bfc062723c751e8b465ee728b)  -> (artifact id: 'ae098d65a8895a1233fe6ebd9f7a9bd7') in 0.012964 seconds 
========================================================================
Received Import Request.
  Time since last request: 47.765235 seconds.
  path: Assets/prefabs/Cornell_Box.prefab
  artifactKey: Guid(bfe8752e31498034aab35c214917e339) Importer(815301076,1909f56bfc062723c751e8b465ee728b)
Start importing Assets/prefabs/Cornell_Box.prefab using Guid(bfe8752e31498034aab35c214917e339) Importer(815301076,1909f56bfc062723c751e8b465ee728b)  -> (artifact id: 'fefdcbe90cda18f02415211371c2dd0a') in 0.010008 seconds 
========================================================================
Received Import Request.
  Time since last request: 161.145520 seconds.
  path: Assets/prefabs/New Lighting Settings.lighting
  artifactKey: Guid(5335438670128ca45b630c729c452136) Importer(815301076,1909f56bfc062723c751e8b465ee728b)
Start importing Assets/prefabs/New Lighting Settings.lighting using Guid(5335438670128ca45b630c729c452136) Importer(815301076,1909f56bfc062723c751e8b465ee728b)  -> (artifact id: '7b274ad5585f5dfbcb267233b5d67336') in 0.003828 seconds 
========================================================================
Received Import Request.
  Time since last request: 96.265738 seconds.
  path: Assets/Materials/Glow.mat
  artifactKey: Guid(e14e3b3623012494c9d496a06d78ac45) Importer(815301076,1909f56bfc062723c751e8b465ee728b)
Start importing Assets/Materials/Glow.mat using Guid(e14e3b3623012494c9d496a06d78ac45) Importer(815301076,1909f56bfc062723c751e8b465ee728b)  -> (artifact id: 'b85bbf5983e673af3f69d2f5e8d099c3') in 0.008527 seconds 
========================================================================
Received Import Request.
  Time since last request: 269.049599 seconds.
  path: Assets/Materials/Glow.mat
  artifactKey: Guid(e14e3b3623012494c9d496a06d78ac45) Importer(815301076,1909f56bfc062723c751e8b465ee728b)
Start importing Assets/Materials/Glow.mat using Guid(e14e3b3623012494c9d496a06d78ac45) Importer(815301076,1909f56bfc062723c751e8b465ee728b)  -> (artifact id: '3d7a5808a3e93c0532010d3573f8cd38') in 0.878459 seconds 
========================================================================
Received Prepare
Registering precompiled user dll's ...
Registered in 0.004809 seconds.
Begin MonoManager ReloadAssembly
Symbol file LoadedFromMemory doesn't match image C:\Repositorios\Cornell box\Library\PackageCache\com.unity.visualscripting@1.7.8\Editor\VisualScripting.Core\Dependencies\YamlDotNet\Unity.VisualScripting.YamlDotNet.dll
Symbol file LoadedFromMemory doesn't match image C:\Repositorios\Cornell box\Library\PackageCache\com.unity.visualscripting@1.7.8\Editor\VisualScripting.Core\Dependencies\DotNetZip\Unity.VisualScripting.IonicZip.dll
Native extension for WindowsStandalone target not found
Refreshing native plugins compatible for Editor in 0.81 ms, found 3 plugins.
Preloading 0 native plugins for Editor in 0.00 ms.
Mono: successfully reloaded assembly
- Completed reload, in  0.971 seconds
Domain Reload Profiling:
	ReloadAssembly (972ms)
		BeginReloadAssembly (126ms)
			ExecutionOrderSort (0ms)
			DisableScriptedObjects (9ms)
			BackupInstance (0ms)
			ReleaseScriptingObjects (0ms)
			CreateAndSetChildDomain (47ms)
		EndReloadAssembly (769ms)
			LoadAssemblies (68ms)
			RebuildTransferFunctionScriptingTraits (0ms)
			SetupTypeCache (241ms)
			ReleaseScriptCaches (2ms)
			RebuildScriptCaches (37ms)
			SetupLoadedEditorAssemblies (349ms)
				LogAssemblyErrors (0ms)
				InitializePlatformSupportModulesInManaged (10ms)
				SetLoadedEditorAssemblies (0ms)
				RefreshPlugins (1ms)
				BeforeProcessingInitializeOnLoad (69ms)
				ProcessInitializeOnLoadAttributes (192ms)
				ProcessInitializeOnLoadMethodAttributes (72ms)
				AfterProcessingInitializeOnLoad (5ms)
				EditorAssembliesLoaded (0ms)
			ExecutionOrderSort2 (0ms)
			AwakeInstancesAfterBackupRestoration (23ms)
Platform modules already initialized, skipping
Refreshing native plugins compatible for Editor in 1.83 ms, found 3 plugins.
Preloading 0 native plugins for Editor in 0.00 ms.
Unloading 4907 Unused Serialized files (Serialized files now loaded: 0)
Unloading 37 unused Assets / (1.1 MB). Loaded Objects now: 5642.
Memory consumption went from 197.4 MB to 196.3 MB.
Total: 3.643900 ms (FindLiveObjects: 0.481800 ms CreateObjectMapping: 0.331600 ms MarkObjects: 2.425100 ms  DeleteObjects: 0.404300 ms)

AssetImportParameters requested are different than current active one (requested -> active):
  custom:video-decoder-ogg-theora: a1e56fd34408186e4bbccfd4996cb3dc -> 
  custom:container-muxer-webm: aa71ff27fc2769a1b78a27578f13a17b -> 
  custom:container-demuxer-webm: 4f35f7cbe854078d1ac9338744f61a02 -> 
  custom:video-encoder-webm-vp8: eb34c28f22e8b96e1ab97ce403110664 -> 
  custom:audio-encoder-webm-vorbis: bf7c407c2cedff20999df2af8eb42d56 -> 
  custom:framework-win-MediaFoundation: 216162199b28c13a410421893ffa2e32 -> 
  custom:container-demuxer-ogg: 62fdf1f143b41e24485cea50d1cbac27 -> 
  custom:video-decoder-webm-vp8: 9c59270c3fd7afecdb556c50c9e8de78 -> 
  custom:audio-decoder-ogg-vorbis: bf7c407c2cedff20999df2af8eb42d56 -> 
========================================================================
Received Import Request.
  Time since last request: 1945.283920 seconds.
  path: Assets/cosas/Extras/TextMesh Pro/Resources/Fonts & Materials/LiberationSans SDF - Drop Shadow.mat
  artifactKey: Guid(e73a58f6e2794ae7b1b7e50b7fb811b0) Importer(815301076,1909f56bfc062723c751e8b465ee728b)
Start importing Assets/cosas/Extras/TextMesh Pro/Resources/Fonts & Materials/LiberationSans SDF - Drop Shadow.mat using Guid(e73a58f6e2794ae7b1b7e50b7fb811b0) Importer(815301076,1909f56bfc062723c751e8b465ee728b) Shader error in 'TextMeshPro/Mobile/Distance Field': Couldn't open include file 'TMPro_Properties.cginc'. at line 91

Compiling Subshader: 0, Pass: <Unnamed Pass 0>, Vertex program with OUTLINE_ON UNDERLAY_ON
Platform defines: SHADER_API_DESKTOP UNITY_ENABLE_DETAIL_NORMALMAP UNITY_ENABLE_REFLECTION_BUFFERS UNITY_LIGHTMAP_FULL_HDR UNITY_LIGHT_PROBE_PROXY_VOLUME UNITY_PBS_USE_BRDF1 UNITY_SPECCUBE_BLENDING UNITY_SPECCUBE_BOX_PROJECTION UNITY_USE_DITHER_MASK_FOR_ALPHABLENDED_SHADOWS
Disabled keywords: SHADER_API_GLES30 UNDERLAY_INNER UNITY_ASTC_NORMALMAP_ENCODING UNITY_COLORSPACE_GAMMA UNITY_ENABLE_NATIVE_SHADOW_LOOKUPS UNITY_FRAMEBUFFER_FETCH_AVAILABLE UNITY_HALF_PRECISION_FRAGMENT_SHADER_REGISTERS UNITY_HARDWARE_TIER1 UNITY_HARDWARE_TIER2 UNITY_HARDWARE_TIER3 UNITY_LIGHTMAP_DLDR_ENCODING UNITY_LIGHTMAP_RGBM_ENCODING UNITY_METAL_SHADOWS_USE_POINT_FILTERING UNITY_NO_DXT5nm UNITY_NO_FULL_STANDARD_SHADER UNITY_NO_SCREENSPACE_SHADOWS UNITY_PBS_USE_BRDF2 UNITY_PBS_USE_BRDF3 UNITY_PRETRANSFORM_TO_DISPLAY_ORIENTATION UNITY_UI_ALPHACLIP UNITY_UI_CLIP_RECT UNITY_UNIFIED_SHADER_PRECISION_MODEL UNITY_VIRTUAL_TEXTURING
Shader error in 'TextMeshPro/Mobile/Distance Field': Couldn't open include file 'TMPro_Properties.cginc'. at line 91

Compiling Subshader: 0, Pass: <Unnamed Pass 0>, Vertex program with OUTLINE_ON UNDERLAY_ON
Platform defines: SHADER_API_DESKTOP UNITY_ENABLE_DETAIL_NORMALMAP UNITY_ENABLE_REFLECTION_BUFFERS UNITY_LIGHTMAP_FULL_HDR UNITY_LIGHT_PROBE_PROXY_VOLUME UNITY_PBS_USE_BRDF1 UNITY_SPECCUBE_BLENDING UNITY_SPECCUBE_BOX_PROJECTION UNITY_USE_DITHER_MASK_FOR_ALPHABLENDED_SHADOWS
Disabled keywords: SHADER_API_GLES30 UNDERLAY_INNER UNITY_ASTC_NORMALMAP_ENCODING UNITY_COLORSPACE_GAMMA UNITY_ENABLE_NATIVE_SHADOW_LOOKUPS UNITY_FRAMEBUFFER_FETCH_AVAILABLE UNITY_HALF_PRECISION_FRAGMENT_SHADER_REGISTERS UNITY_HARDWARE_TIER1 UNITY_HARDWARE_TIER2 UNITY_HARDWARE_TIER3 UNITY_LIGHTMAP_DLDR_ENCODING UNITY_LIGHTMAP_RGBM_ENCODING UNITY_METAL_SHADOWS_USE_POINT_FILTERING UNITY_NO_DXT5nm UNITY_NO_FULL_STANDARD_SHADER UNITY_NO_SCREENSPACE_SHADOWS UNITY_PBS_USE_BRDF2 UNITY_PBS_USE_BRDF3 UNITY_PRETRANSFORM_TO_DISPLAY_ORIENTATION UNITY_UI_ALPHACLIP UNITY_UI_CLIP_RECT UNITY_UNIFIED_SHADER_PRECISION_MODEL UNITY_VIRTUAL_TEXTURING
 -> (artifact id: '5af23b55b9d901b573e8950eacef0373') in 0.235532 seconds 
========================================================================
Received Import Request.
  Time since last request: 0.000040 seconds.
  path: Assets/cosas/ScriptableRenderPasses/ScreenEffect/ScreenEffect_Pixelate_Mat.mat
  artifactKey: Guid(96e405a4e6428f64588e24a3b3e4648b) Importer(815301076,1909f56bfc062723c751e8b465ee728b)
Start importing Assets/cosas/ScriptableRenderPasses/ScreenEffect/ScreenEffect_Pixelate_Mat.mat using Guid(96e405a4e6428f64588e24a3b3e4648b) Importer(815301076,1909f56bfc062723c751e8b465ee728b)  -> (artifact id: '03b8dc179fa950f606713718b76b887e') in 0.353795 seconds 
========================================================================
Received Import Request.
  Time since last request: 0.000039 seconds.
  path: Assets/cosas/ExampleAssets/TerraformerPod/Materials/TerraformerPod_BeesWax_Mat.mat
  artifactKey: Guid(cecfe752594469a45baea34c63249f82) Importer(815301076,1909f56bfc062723c751e8b465ee728b)
Start importing Assets/cosas/ExampleAssets/TerraformerPod/Materials/TerraformerPod_BeesWax_Mat.mat using Guid(cecfe752594469a45baea34c63249f82) Importer(815301076,1909f56bfc062723c751e8b465ee728b)  -> (artifact id: 'b5ffdcc2ff220e052716880e28709ebc') in 1.189312 seconds 
========================================================================
Received Import Request.
  Time since last request: 0.000026 seconds.
  path: Packages/com.unity.render-pipelines.universal/Runtime/Materials/ParticlesUnlit.mat
  artifactKey: Guid(e823cd5b5d27c0f4b8256e7c12ee3e6d) Importer(815301076,1909f56bfc062723c751e8b465ee728b)
Start importing Packages/com.unity.render-pipelines.universal/Runtime/Materials/ParticlesUnlit.mat using Guid(e823cd5b5d27c0f4b8256e7c12ee3e6d) Importer(815301076,1909f56bfc062723c751e8b465ee728b)  -> (artifact id: 'd741bd55bcd0b24f88704cb9f9e6335a') in 0.137143 seconds 
========================================================================
Received Import Request.
  Time since last request: 0.000032 seconds.
  path: Assets/cosas/ExampleAssets/TerraformerPod/Materials/TerraformerPod_Glass_Mat.mat
  artifactKey: Guid(f6751b66fd386df4183de203100a83ea) Importer(815301076,1909f56bfc062723c751e8b465ee728b)
Start importing Assets/cosas/ExampleAssets/TerraformerPod/Materials/TerraformerPod_Glass_Mat.mat using Guid(f6751b66fd386df4183de203100a83ea) Importer(815301076,1909f56bfc062723c751e8b465ee728b)  -> (artifact id: 'babf808857a4142d4e8ca00d871b57bb') in 0.401770 seconds 
========================================================================
Received Import Request.
  Time since last request: 0.000030 seconds.
  path: Packages/com.unity.render-pipelines.universal/Runtime/Materials/Sprite-Unlit-Default.mat
  artifactKey: Guid(9dfc825aed78fcd4ba02077103263b40) Importer(815301076,1909f56bfc062723c751e8b465ee728b)
Start importing Packages/com.unity.render-pipelines.universal/Runtime/Materials/Sprite-Unlit-Default.mat using Guid(9dfc825aed78fcd4ba02077103263b40) Importer(815301076,1909f56bfc062723c751e8b465ee728b)  -> (artifact id: '9666cbf34dea93ab298e643ba9da4c12') in 0.007368 seconds 
========================================================================
Received Import Request.
  Time since last request: 0.000038 seconds.
  path: Assets/cosas/ScriptableRenderPasses/ScreenEffect/ScreenEffect_Filtering_Mat.mat
  artifactKey: Guid(29b135881d090af42bb8ed685a674bcb) Importer(815301076,1909f56bfc062723c751e8b465ee728b)
Start importing Assets/cosas/ScriptableRenderPasses/ScreenEffect/ScreenEffect_Filtering_Mat.mat using Guid(29b135881d090af42bb8ed685a674bcb) Importer(815301076,1909f56bfc062723c751e8b465ee728b)  -> (artifact id: 'ef5656bb263679febbada2e82a151f36') in 0.363197 seconds 
========================================================================
Received Import Request.
  Time since last request: 0.000036 seconds.
  path: Packages/com.unity.render-pipelines.universal/Runtime/Materials/SimpleLit.mat
  artifactKey: Guid(6a1143ee683302f4aa628c052723efc1) Importer(815301076,1909f56bfc062723c751e8b465ee728b)
Start importing Packages/com.unity.render-pipelines.universal/Runtime/Materials/SimpleLit.mat using Guid(6a1143ee683302f4aa628c052723efc1) Importer(815301076,1909f56bfc062723c751e8b465ee728b)  -> (artifact id: 'c33d12fdf3aee57dddb0cfb3bcf15def') in 1.182377 seconds 
========================================================================
Received Import Request.
  Time since last request: 13.370903 seconds.
  path: Assets/cosas/ExampleAssets/MetalPlating/MetalPlating_D.tga
  artifactKey: Guid(6fd51db45f4e23b4ebe60b979bfc2d89) Importer(815301076,1909f56bfc062723c751e8b465ee728b)
Start importing Assets/cosas/ExampleAssets/MetalPlating/MetalPlating_D.tga using Guid(6fd51db45f4e23b4ebe60b979bfc2d89) Importer(815301076,1909f56bfc062723c751e8b465ee728b)  -> (artifact id: '768f5d7855e599421af398745c43b749') in 0.058394 seconds 
Editor requested this worker to shutdown with reason: Scaling down because of idle timeout
AssetImportWorker is now disconnected from the server
Process exiting
Exiting without the bug reporter. Application will terminate with return code 0