{
  "project_info": {
    "project_number": "273051461191",
    "project_id": "word-rule",
    "storage_bucket": "word-rule.appspot.com"
  },
  "client": [
    {
      "client_info": {
        "mobilesdk_app_id": "1:273051461191:android:6d0a6031207226b1473362",
        "android_client_info": {
          "package_name": "com.lavrovdmitriii.wordle"
        }
      },
      "oauth_client": [
        {
          "client_id": "273051461191-p95odqkcl3vqdv95634idqg3b4b1p66k.apps.googleusercontent.com",
          "client_type": 3
        }
      ],
      "api_key": [
        {
          "current_key": "AIzaSyB2yy-H8Vh3GMPOu0j-GyJpVBPoG3CR4Iw"
        }
      ],
      "services": {
        "appinvite_service": {
          "other_platform_oauth_client": [
            {
              "client_id": "273051461191-p95odqkcl3vqdv95634idqg3b4b1p66k.apps.googleusercontent.com",
              "client_type": 3
            }
          ]
        }
      }
    }
  ],
  "configuration_version": "1"
}