{
 "$schema": "http://json.schemastore.org/template", // schema which can be placed to schema validation to get the intellicence for the file
 "author": "Bokhov",  // you can replace with your name
 "classifications": [ "Common", "WebApi", "IdentityServer" ],  // used to add more info to the console output when checking installed templates
 "identity": "IdentityServer",  // unique name
 "name": "Project IdentityServer", // full name for the template
 "shortName": "is", // short name for the template to simplify usage
 "tags": {
 "language": "C#",
 "option": "IdentityServer"
 },
 "sourceName": "IdentityServer", // value which will be replaced across the whole template to the new name provided by the user
 "preferNameDirectory": true
}
